xmlgraphics-fop-dev mailing list archives

Site index · List index
Message view « Date » · « Thread »
Top « Date » · « Thread »
From Mathieu Malaterre <ma...@debian.org>
Subject fop 2.3 current test failures in Debian
Date Wed, 28 Nov 2018 10:19:45 GMT
Dear fop dev

I've uploaded fop 2.3 to Debian archive. I had to turn test suite to
off because of test failure, current list is available at (*):

For convenience:

[INFO] -------------------------------------------------------
[INFO]  T E S T S
[INFO] -------------------------------------------------------
[INFO] Running org.apache.fop.URIResolutionTestCase
[INFO] Tests run: 2, Failures: 0, Errors: 0, Skipped: 0, Time elapsed:
1.448 s - in org.apache.fop.URIResolutionTestCase
[INFO] Running org.apache.fop.BasicPDFTranscoderTestCase
[INFO] Tests run: 1, Failures: 0, Errors: 0, Skipped: 0, Time elapsed:
1.06 s - in org.apache.fop.BasicPDFTranscoderTestCase
[INFO] Running org.apache.fop.HyphenationTestCase
[INFO] Tests run: 2, Failures: 0, Errors: 0, Skipped: 0, Time elapsed:
0.04 s - in org.apache.fop.HyphenationTestCase
[INFO] Running org.apache.fop.BasicDriverTestCase
[INFO] Tests run: 5, Failures: 0, Errors: 0, Skipped: 0, Time elapsed:
0.279 s - in org.apache.fop.BasicDriverTestCase
[INFO] Running org.apache.fop.BasicPSTranscoderTestCase
[INFO] Tests run: 1, Failures: 0, Errors: 0, Skipped: 0, Time elapsed:
0.103 s - in org.apache.fop.BasicPSTranscoderTestCase
[INFO] Running org.apache.fop.KnuthAlgorithmTestCase
[INFO] Tests run: 1, Failures: 0, Errors: 0, Skipped: 0, Time elapsed:
0.004 s - in org.apache.fop.KnuthAlgorithmTestCase
[INFO] Running org.apache.fop.DigestFilterTestCase
[INFO] Tests run: 3, Failures: 0, Errors: 0, Skipped: 0, Time elapsed:
0.01 s - in org.apache.fop.DigestFilterTestCase
[INFO] Running org.apache.fop.text.linebreak.LineBreakStatusTestCase
[INFO] Tests run: 2, Failures: 0, Errors: 0, Skipped: 0, Time elapsed:
0.001 s - in org.apache.fop.text.linebreak.LineBreakStatusTestCase
[INFO] Running org.apache.fop.text.linebreak.LineBreakUtilsTestCase
[INFO] Tests run: 2, Failures: 0, Errors: 0, Skipped: 0, Time elapsed:
0.001 s - in org.apache.fop.text.linebreak.LineBreakUtilsTestCase
[INFO] Running org.apache.fop.datatypes.URISpecificationTestCase
[INFO] Tests run: 2, Failures: 0, Errors: 0, Skipped: 0, Time elapsed:
0 s - in org.apache.fop.datatypes.URISpecificationTestCase
[INFO] Running org.apache.fop.image.loader.batik.ImagePreloaderTestCase
[WARNING] Tests run: 5, Failures: 0, Errors: 0, Skipped: 1, Time
elapsed: 0.037 s - in
org.apache.fop.image.loader.batik.ImagePreloaderTestCase
[INFO] Running org.apache.fop.image.loader.batik.ImageLoaderTestCase
[WARNING] Tests run: 1, Failures: 0, Errors: 0, Skipped: 1, Time
elapsed: 0 s - in
org.apache.fop.image.loader.batik.ImageLoaderTestCase
[INFO] Running org.apache.fop.intermediate.IFMimickingTestCase
[INFO] Tests run: 3, Failures: 0, Errors: 0, Skipped: 0, Time elapsed:
0.075 s - in org.apache.fop.intermediate.IFMimickingTestCase
[INFO] Running org.apache.fop.intermediate.IFTestCase
[ERROR] Tests run: 11, Failures: 1, Errors: 0, Skipped: 0, Time
elapsed: 1.179 s <<< FAILURE! - in
org.apache.fop.intermediate.IFTestCase
[ERROR] runTest[4](org.apache.fop.intermediate.IFTestCase)  Time
elapsed: 0.06 s  <<< FAILURE!
java.lang.AssertionError: Expected XPath expression to evaluate to
'true', but got '' (XPath: /descendant::if:text[1]/@hyphenated)
at org.apache.fop.intermediate.IFTestCase.runTest(IFTestCase.java:103)

[INFO] Running org.apache.fop.intermediate.IFParserTestCase
[INFO] Tests run: 650, Failures: 0, Errors: 0, Skipped: 0, Time
elapsed: 17.098 s - in org.apache.fop.intermediate.IFParserTestCase
[INFO] Running org.apache.fop.intermediate.AreaTreeParserTestCase
[INFO] Tests run: 650, Failures: 0, Errors: 0, Skipped: 0, Time
elapsed: 24.38 s - in
org.apache.fop.intermediate.AreaTreeParserTestCase
[INFO] Running org.apache.fop.cli.CommandLineOptionsTestCase
[INFO] Tests run: 3, Failures: 0, Errors: 0, Skipped: 0, Time elapsed:
0 s - in org.apache.fop.cli.CommandLineOptionsTestCase
[INFO] Running org.apache.fop.area.BlockViewportTestCase
[INFO] Tests run: 2, Failures: 0, Errors: 0, Skipped: 0, Time elapsed:
0.001 s - in org.apache.fop.area.BlockViewportTestCase
[INFO] Running org.apache.fop.area.RegionViewportTestCase
[INFO] Tests run: 2, Failures: 0, Errors: 0, Skipped: 0, Time elapsed:
0.001 s - in org.apache.fop.area.RegionViewportTestCase
[INFO] Running org.apache.fop.area.TraitTestCase
[INFO] Tests run: 1, Failures: 0, Errors: 0, Skipped: 0, Time elapsed:
0 s - in org.apache.fop.area.TraitTestCase
[INFO] Running org.apache.fop.area.inline.InlineViewportTestCase
[INFO] Tests run: 2, Failures: 0, Errors: 0, Skipped: 0, Time elapsed:
0 s - in org.apache.fop.area.inline.InlineViewportTestCase
[INFO] Running org.apache.fop.layoutmgr.BreakElementTestCase
[INFO] Tests run: 1, Failures: 0, Errors: 0, Skipped: 0, Time elapsed:
0 s - in org.apache.fop.layoutmgr.BreakElementTestCase
[INFO] Running org.apache.fop.layoutmgr.RetrieveTableMarkerLayoutManagerTestCase
[INFO] Tests run: 1, Failures: 0, Errors: 0, Skipped: 0, Time elapsed:
0.389 s - in org.apache.fop.layoutmgr.RetrieveTableMarkerLayoutManagerTestCase
[INFO] Running org.apache.fop.layoutmgr.PageSequenceLayoutManagerTestCase
[INFO] Tests run: 3, Failures: 0, Errors: 0, Skipped: 0, Time elapsed:
0.157 s - in org.apache.fop.layoutmgr.PageSequenceLayoutManagerTestCase
[INFO] Running org.apache.fop.layoutmgr.RetrieveTableMarkerLayoutManagerMakerTestCase
[INFO] Tests run: 1, Failures: 0, Errors: 0, Skipped: 0, Time elapsed:
0.013 s - in org.apache.fop.layoutmgr.RetrieveTableMarkerLayoutManagerMakerTestCase
[INFO] Running org.apache.fop.layoutmgr.table.TableCellLayoutManagerTestCase
[INFO] Tests run: 1, Failures: 0, Errors: 0, Skipped: 0, Time elapsed:
0.145 s - in org.apache.fop.layoutmgr.table.TableCellLayoutManagerTestCase
[INFO] Running org.apache.fop.layoutmgr.table.TableLayoutManagerTestCase
[INFO] Tests run: 2, Failures: 0, Errors: 0, Skipped: 0, Time elapsed:
0.045 s - in org.apache.fop.layoutmgr.table.TableLayoutManagerTestCase
[INFO] Running org.apache.fop.layoutmgr.table.TableContentLayoutManagerTestCase
[INFO] Tests run: 1, Failures: 0, Errors: 0, Skipped: 0, Time elapsed:
0.027 s - in org.apache.fop.layoutmgr.table.TableContentLayoutManagerTestCase
[INFO] Running org.apache.fop.events.FlowNamedNotMappedTestCase
[INFO] Tests run: 1, Failures: 0, Errors: 0, Skipped: 0, Time elapsed:
0.005 s - in org.apache.fop.events.FlowNamedNotMappedTestCase
[INFO] Running org.apache.fop.events.EventProcessingTestCase
[INFO] Tests run: 10, Failures: 0, Errors: 0, Skipped: 0, Time
elapsed: 0.092 s - in org.apache.fop.events.EventProcessingTestCase
[INFO] Running org.apache.fop.traits.MinOptMaxTestCase
[INFO] Tests run: 20, Failures: 0, Errors: 0, Skipped: 0, Time
elapsed: 0.005 s - in org.apache.fop.traits.MinOptMaxTestCase
[INFO] Running org.apache.fop.traits.BorderPropsTestCase
[INFO] Tests run: 2, Failures: 0, Errors: 0, Skipped: 0, Time elapsed:
0.002 s - in org.apache.fop.traits.BorderPropsTestCase
[INFO] Running org.apache.fop.config.FontsSubstitutionTestCase
[INFO] Tests run: 1, Failures: 0, Errors: 0, Skipped: 0, Time elapsed:
0.025 s - in org.apache.fop.config.FontsSubstitutionTestCase
[INFO] Running org.apache.fop.config.FontsAutoDetectTestCase
[INFO] Tests run: 1, Failures: 0, Errors: 0, Skipped: 0, Time elapsed:
0.177 s - in org.apache.fop.config.FontsAutoDetectTestCase
[INFO] Running org.apache.fop.config.FontMetricsUrlBadTestCase
[INFO] Tests run: 1, Failures: 0, Errors: 0, Skipped: 0, Time elapsed:
0.006 s - in org.apache.fop.config.FontMetricsUrlBadTestCase
[INFO] Running org.apache.fop.config.FontTripletAttributeMissingTestCase
[INFO] Tests run: 1, Failures: 0, Errors: 0, Skipped: 0, Time elapsed:
0.004 s - in org.apache.fop.config.FontTripletAttributeMissingTestCase
[INFO] Running org.apache.fop.config.FontsDirectoryRecursiveTestCase
[INFO] Tests run: 1, Failures: 0, Errors: 0, Skipped: 0, Time elapsed:
0.127 s - in org.apache.fop.config.FontsDirectoryRecursiveTestCase
[INFO] Running org.apache.fop.config.FontAttributesMissingTestCase
[INFO] Tests run: 1, Failures: 0, Errors: 0, Skipped: 0, Time elapsed:
0.003 s - in org.apache.fop.config.FontAttributesMissingTestCase
[INFO] Running org.apache.fop.config.FontMetricsUrlMalformedTestCase
[INFO] Tests run: 1, Failures: 0, Errors: 0, Skipped: 0, Time elapsed:
0.003 s - in org.apache.fop.config.FontMetricsUrlMalformedTestCase
[INFO] Running org.apache.fop.fotreetest.FOTreeTestCase
[INFO] Tests run: 41, Failures: 0, Errors: 0, Skipped: 0, Time
elapsed: 0.642 s - in org.apache.fop.fotreetest.FOTreeTestCase
[INFO] Running org.apache.fop.apps.FopConfParserTestCase
[INFO] Tests run: 13, Failures: 0, Errors: 0, Skipped: 0, Time
elapsed: 0.017 s - in org.apache.fop.apps.FopConfParserTestCase
[INFO] Running org.apache.fop.apps.FopFactoryBuilderTestCase
[INFO] Tests run: 15, Failures: 0, Errors: 0, Skipped: 0, Time
elapsed: 0.012 s - in org.apache.fop.apps.FopFactoryBuilderTestCase
[INFO] Running org.apache.fop.apps.EnvironmentalProfileFactoryTestCase
[INFO] Tests run: 1, Failures: 0, Errors: 0, Skipped: 0, Time elapsed:
0.004 s - in org.apache.fop.apps.EnvironmentalProfileFactoryTestCase
[INFO] Running org.apache.fop.apps.FopFactoryTestCase
[INFO] Tests run: 1, Failures: 0, Errors: 0, Skipped: 0, Time elapsed:
0.029 s - in org.apache.fop.apps.FopFactoryTestCase
[INFO] Running org.apache.fop.apps.io.ResourceResolverFactoryTestCase
[INFO] Tests run: 10, Failures: 0, Errors: 0, Skipped: 0, Time
elapsed: 0.025 s - in
org.apache.fop.apps.io.ResourceResolverFactoryTestCase
[INFO] Running org.apache.fop.apps.io.URIResolverWrapperTestCase
[INFO] Tests run: 4, Failures: 0, Errors: 0, Skipped: 0, Time elapsed:
0.011 s - in org.apache.fop.apps.io.URIResolverWrapperTestCase
[INFO] Running org.apache.fop.layoutengine.HyphenationLayoutTestCase
[ERROR] Tests run: 13, Failures: 8, Errors: 0, Skipped: 0, Time
elapsed: 0.583 s <<< FAILURE! - in
org.apache.fop.layoutengine.HyphenationLayoutTestCase
[ERROR] runTest[1](org.apache.fop.layoutengine.HyphenationLayoutTestCase)
 Time elapsed: 0.032 s  <<< FAILURE!
java.lang.AssertionError: Layout test
(inline_border_padding_hyphenate_de.xml): Expected XPath expression to
evaluate to '250110', but got '377390' (XPath:
//flow/block[1]/lineArea[1]/inlineparent/@ipd)

[ERROR] runTest[3](org.apache.fop.layoutengine.HyphenationLayoutTestCase)
 Time elapsed: 0.039 s  <<< FAILURE!
java.lang.AssertionError: Layout test
(hyphenation-pattern_fallback.xml): Expected XPath expression to
evaluate to '8', but got '9' (XPath:
count(//pageViewport[1]//flow/block[2]/lineArea))

[ERROR] runTest[6](org.apache.fop.layoutengine.HyphenationLayoutTestCase)
 Time elapsed: 0.013 s  <<< FAILURE!
java.lang.AssertionError: Layout test
(block_uax14_linebreaking_hyph.xml): Expected XPath expression to
evaluate to '9', but got '4' (XPath: count(//flow/block/lineArea))

[ERROR] runTest[7](org.apache.fop.layoutengine.HyphenationLayoutTestCase)
 Time elapsed: 0.017 s  <<< FAILURE!
java.lang.AssertionError: Layout test
(block_hyphenation_non_letter_words.xml): Expected XPath expression to
evaluate to 'OCF_SUC-', but got '' (XPath:
//pageViewport[1]/page[1]/regionViewport[1]/regionBody[1]/mainReference[1]/span[1]/flow[1]/block[6]/lineArea[1]/text[1]/word[6])

[ERROR] runTest[9](org.apache.fop.layoutengine.HyphenationLayoutTestCase)
 Time elapsed: 0.013 s  <<< FAILURE!
java.lang.AssertionError: Layout test
(block_hyphenation_linefeed_preserve.xml): Expected XPath expression
to evaluate to '13', but got '14' (XPath:
count(//flow[1]/block/lineArea))

[ERROR] runTest[10](org.apache.fop.layoutengine.HyphenationLayoutTestCase)
 Time elapsed: 0.034 s  <<< FAILURE!
java.lang.AssertionError: Layout test
(block_hyphenation_kerning_non_bmp.xml): Expected XPath expression to
evaluate to '47702', but got '34372' (XPath:
//flow/block[1]/lineArea[1]/text[1]/@twsadjust)

[ERROR] runTest[11](org.apache.fop.layoutengine.HyphenationLayoutTestCase)
 Time elapsed: 0.017 s  <<< FAILURE!
java.lang.AssertionError: Layout test (block_hyphenation_kerning.xml):
Expected XPath expression to evaluate to '-1339', but got '31090'
(XPath: //flow/block[1]/lineArea[2]/text[1]/@twsadjust)

[ERROR] runTest[12](org.apache.fop.layoutengine.HyphenationLayoutTestCase)
 Time elapsed: 0.075 s  <<< FAILURE!
java.lang.AssertionError: Layout test
(block_hyphenation-ladder-count.xml): Expected XPath expression to
evaluate to '8', but got '9' (XPath:
count(//pageViewport[1]//flow/block[2]/lineArea))

[INFO] Running org.apache.fop.layoutengine.LayoutEngineTestCase
[INFO] Tests run: 650, Failures: 0, Errors: 0, Skipped: 0, Time
elapsed: 25.566 s - in
org.apache.fop.layoutengine.LayoutEngineTestCase
[INFO] Running org.apache.fop.accessibility.fo.ArtifactImageBugTestCase
[INFO] Tests run: 1, Failures: 0, Errors: 0, Skipped: 0, Time elapsed:
0.079 s - in org.apache.fop.accessibility.fo.ArtifactImageBugTestCase
[INFO] Running org.apache.fop.accessibility.fo.PDFUAWarningTestCase
[INFO] Tests run: 1, Failures: 0, Errors: 0, Skipped: 0, Time elapsed:
0 s - in org.apache.fop.accessibility.fo.PDFUAWarningTestCase
[INFO] Running org.apache.fop.accessibility.fo.FO2StructureTreeConverterTestCase
[INFO] Tests run: 8, Failures: 0, Errors: 0, Skipped: 0, Time elapsed:
0.169 s - in org.apache.fop.accessibility.fo.FO2StructureTreeConverterTestCase
[INFO] Running org.apache.fop.accessibility.pdf.MissingLanguageWarningTestCase
[INFO] Tests run: 1, Failures: 0, Errors: 0, Skipped: 0, Time elapsed:
0.047 s - in org.apache.fop.accessibility.pdf.MissingLanguageWarningTestCase
[INFO] Running org.apache.fop.accessibility.pdf.FootnoteSeparatorTestCase
[INFO] Tests run: 1, Failures: 0, Errors: 0, Skipped: 0, Time elapsed:
0.001 s - in org.apache.fop.accessibility.pdf.FootnoteSeparatorTestCase
[INFO] Running org.apache.fop.afp.AFPEventProcessingTestCase
[INFO] Tests run: 5, Failures: 0, Errors: 0, Skipped: 0, Time elapsed:
0.089 s - in org.apache.fop.afp.AFPEventProcessingTestCase
[INFO] Running org.apache.fop.afp.AFPResourceManagerTestCase
[INFO] Tests run: 3, Failures: 0, Errors: 0, Skipped: 0, Time elapsed:
0.013 s - in org.apache.fop.afp.AFPResourceManagerTestCase
[INFO] Running org.apache.fop.afp.AFPObjectAreaInfoTestCase
[INFO] Tests run: 2, Failures: 0, Errors: 0, Skipped: 0, Time elapsed:
0.001 s - in org.apache.fop.afp.AFPObjectAreaInfoTestCase
[INFO] Running org.apache.fop.afp.AFPResourceUtilTestCase
[INFO] Tests run: 6, Failures: 0, Errors: 0, Skipped: 0, Time elapsed:
0 s - in org.apache.fop.afp.AFPResourceUtilTestCase
[INFO] Running org.apache.fop.afp.AFPGraphics2DTestCase
[INFO] Tests run: 1, Failures: 0, Errors: 0, Skipped: 0, Time elapsed:
0.049 s - in org.apache.fop.afp.AFPGraphics2DTestCase
[INFO] Running org.apache.fop.afp.AFPPaintingStateTestCase
[INFO] Tests run: 1, Failures: 0, Errors: 0, Skipped: 0, Time elapsed:
0 s - in org.apache.fop.afp.AFPPaintingStateTestCase
[INFO] Running org.apache.fop.afp.util.AFPResourceAccessorTestCase
[INFO] Tests run: 2, Failures: 0, Errors: 0, Skipped: 0, Time elapsed:
0.014 s - in org.apache.fop.afp.util.AFPResourceAccessorTestCase
[INFO] Running org.apache.fop.afp.parser.MODCAParserTestCase
[INFO] Tests run: 2, Failures: 0, Errors: 0, Skipped: 0, Time elapsed:
0.002 s - in org.apache.fop.afp.parser.MODCAParserTestCase
[INFO] Running org.apache.fop.afp.fonts.CharactersetEncoderTestCase
[INFO] Tests run: 2, Failures: 0, Errors: 0, Skipped: 0, Time elapsed:
0.012 s - in org.apache.fop.afp.fonts.CharactersetEncoderTestCase
[INFO] Running org.apache.fop.afp.fonts.IntegerKeyStoreTestCase
[INFO] Tests run: 1, Failures: 0, Errors: 0, Skipped: 0, Time elapsed:
0.002 s - in org.apache.fop.afp.fonts.IntegerKeyStoreTestCase
[INFO] Running org.apache.fop.afp.goca.GraphicsSetLineWidthTestCase
[INFO] Tests run: 3, Failures: 0, Errors: 0, Skipped: 0, Time elapsed:
0.001 s - in org.apache.fop.afp.goca.GraphicsSetLineWidthTestCase
[INFO] Running org.apache.fop.afp.goca.GraphicsSetFractionalLineWidthTestCase
[INFO] Tests run: 3, Failures: 0, Errors: 0, Skipped: 0, Time elapsed:
0.001 s - in org.apache.fop.afp.goca.GraphicsSetFractionalLineWidthTestCase
[INFO] Running org.apache.fop.afp.goca.GraphicsCharacterStringTestCase
[INFO] Tests run: 1, Failures: 0, Errors: 0, Skipped: 0, Time elapsed:
0 s - in org.apache.fop.afp.goca.GraphicsCharacterStringTestCase
[INFO] Running org.apache.fop.afp.modca.IncludeObjectTestCase
[INFO] Tests run: 7, Failures: 0, Errors: 0, Skipped: 0, Time elapsed:
0.001 s - in org.apache.fop.afp.modca.IncludeObjectTestCase
[INFO] Running org.apache.fop.afp.ptoca.TransparentDataControlSequenceTestCase
[INFO] Tests run: 2, Failures: 0, Errors: 0, Skipped: 0, Time elapsed:
0.073 s - in org.apache.fop.afp.ptoca.TransparentDataControlSequenceTestCase
[INFO] Running org.apache.fop.complexscripts.layout.ComplexScriptsLayoutTestCase
[INFO] Tests run: 1, Failures: 0, Errors: 0, Skipped: 0, Time elapsed:
0.059 s - in org.apache.fop.complexscripts.layout.ComplexScriptsLayoutTestCase
[INFO] Running org.apache.fop.complexscripts.util.NumberConverterTestCase
[INFO] Tests run: 13, Failures: 0, Errors: 0, Skipped: 0, Time
elapsed: 0.008 s - in
org.apache.fop.complexscripts.util.NumberConverterTestCase
[INFO] Running org.apache.fop.complexscripts.fonts.GSUBTestCase
[INFO] Tests run: 6, Failures: 0, Errors: 0, Skipped: 0, Time elapsed:
0.649 s - in org.apache.fop.complexscripts.fonts.GSUBTestCase
[INFO] Running org.apache.fop.complexscripts.fonts.GPOSTestCase
[INFO] Tests run: 8, Failures: 0, Errors: 0, Skipped: 0, Time elapsed:
0.003 s - in org.apache.fop.complexscripts.fonts.GPOSTestCase
[INFO] Running org.apache.fop.complexscripts.fonts.GDEFTestCase
[INFO] Tests run: 4, Failures: 0, Errors: 0, Skipped: 0, Time elapsed:
0.005 s - in org.apache.fop.complexscripts.fonts.GDEFTestCase
[INFO] Running org.apache.fop.complexscripts.fonts.ttx.TTXFileTestCase
[INFO] Tests run: 1, Failures: 0, Errors: 0, Skipped: 0, Time elapsed:
0 s - in org.apache.fop.complexscripts.fonts.ttx.TTXFileTestCase
[INFO] Running org.apache.fop.complexscripts.scripts.arabic.ArabicJoinersTestCase
[INFO] Tests run: 2, Failures: 0, Errors: 0, Skipped: 0, Time elapsed:
0.001 s - in org.apache.fop.complexscripts.scripts.arabic.ArabicJoinersTestCase
[INFO] Running org.apache.fop.complexscripts.scripts.arabic.ArabicWordFormsTestCase
[INFO] Tests run: 1, Failures: 0, Errors: 0, Skipped: 0, Time elapsed:
18.229 s - in org.apache.fop.complexscripts.scripts.arabic.ArabicWordFormsTestCase
[INFO] Running org.apache.fop.complexscripts.bidi.BidiAlgorithmTestCase
[INFO] Tests run: 1, Failures: 0, Errors: 0, Skipped: 0, Time elapsed:
1.085 s - in org.apache.fop.complexscripts.bidi.BidiAlgorithmTestCase
[INFO] Running org.apache.fop.complexscripts.bidi.BidiClassTestCase
[INFO] Tests run: 1, Failures: 0, Errors: 0, Skipped: 0, Time elapsed:
0.153 s - in org.apache.fop.complexscripts.bidi.BidiClassTestCase
[INFO] Running org.apache.fop.fo.DelegatingFOEventHandlerTestCase
[INFO] Tests run: 1, Failures: 0, Errors: 0, Skipped: 0, Time elapsed:
0.027 s - in org.apache.fop.fo.DelegatingFOEventHandlerTestCase
[INFO] Running org.apache.fop.fo.properties.AltTextHolderTestCase
[INFO] Tests run: 2, Failures: 0, Errors: 0, Skipped: 0, Time elapsed:
0.09 s - in org.apache.fop.fo.properties.AltTextHolderTestCase
[INFO] Running org.apache.fop.fo.properties.CommonHyphenationTestCase
[INFO] Tests run: 3, Failures: 0, Errors: 0, Skipped: 0, Time elapsed:
0.001 s - in org.apache.fop.fo.properties.CommonHyphenationTestCase
[INFO] Running org.apache.fop.fo.properties.CommonAccessibilityHolderTestCase
[INFO] Tests run: 1, Failures: 0, Errors: 0, Skipped: 0, Time elapsed:
0.038 s - in org.apache.fop.fo.properties.CommonAccessibilityHolderTestCase
[INFO] Running org.apache.fop.fo.flow.MarkersTestCase
[INFO] Tests run: 1, Failures: 0, Errors: 0, Skipped: 0, Time elapsed:
0.024 s - in org.apache.fop.fo.flow.MarkersTestCase
[INFO] Running org.apache.fop.fo.flow.table.TableColumnColumnNumberTestCase
[INFO] Tests run: 2, Failures: 0, Errors: 0, Skipped: 0, Time elapsed:
0.089 s - in org.apache.fop.fo.flow.table.TableColumnColumnNumberTestCase
[INFO] Running org.apache.fop.fo.flow.table.RowGroupBuilderTestCase
[INFO] Tests run: 8, Failures: 0, Errors: 0, Skipped: 0, Time elapsed:
0.158 s - in org.apache.fop.fo.flow.table.RowGroupBuilderTestCase
[INFO] Running org.apache.fop.fo.flow.table.TooManyColumnsTestCase
[INFO] Tests run: 6, Failures: 0, Errors: 0, Skipped: 0, Time elapsed:
0.016 s - in org.apache.fop.fo.flow.table.TooManyColumnsTestCase
[INFO] Running org.apache.fop.fo.flow.table.IllegalRowSpanTestCase
[INFO] Tests run: 4, Failures: 0, Errors: 0, Skipped: 0, Time elapsed:
0.021 s - in org.apache.fop.fo.flow.table.IllegalRowSpanTestCase
[INFO] Running org.apache.fop.fo.flow.table.HeaderColumnTestCase
[INFO] Tests run: 2, Failures: 0, Errors: 0, Skipped: 0, Time elapsed:
0.029 s - in org.apache.fop.fo.flow.table.HeaderColumnTestCase
[INFO] Running org.apache.fop.fo.flow.table.CollapsedConditionalBorderTestCase
[INFO] Tests run: 2, Failures: 0, Errors: 0, Skipped: 0, Time elapsed:
0.044 s - in org.apache.fop.fo.flow.table.CollapsedConditionalBorderTestCase
[INFO] Running org.apache.fop.fo.pagination.RepeatablePageMasterAlternativesTestCase
[INFO] Tests run: 4, Failures: 0, Errors: 0, Skipped: 0, Time elapsed:
0.059 s - in org.apache.fop.fo.pagination.RepeatablePageMasterAlternativesTestCase
[INFO] Running org.apache.fop.fo.pagination.LayoutMasterSetTestCase
[INFO] Tests run: 1, Failures: 0, Errors: 0, Skipped: 0, Time elapsed:
0.008 s - in org.apache.fop.fo.pagination.LayoutMasterSetTestCase
[INFO] Running org.apache.fop.fo.pagination.PageSequenceMasterTestCase
[INFO] Tests run: 2, Failures: 0, Errors: 0, Skipped: 0, Time elapsed:
0.046 s - in org.apache.fop.fo.pagination.PageSequenceMasterTestCase
[INFO] Running org.apache.fop.fonts.CIDSubsetTestCase
[INFO] Tests run: 9, Failures: 0, Errors: 0, Skipped: 0, Time elapsed:
0.027 s - in org.apache.fop.fonts.CIDSubsetTestCase
[INFO] Running org.apache.fop.fonts.FontManagerConfiguratorTestCase
[INFO] Tests run: 6, Failures: 0, Errors: 0, Skipped: 0, Time elapsed:
0.011 s - in org.apache.fop.fonts.FontManagerConfiguratorTestCase
[INFO] Running org.apache.fop.fonts.EmbedFontInfoTestCase
[INFO] Tests run: 3, Failures: 0, Errors: 0, Skipped: 0, Time elapsed:
0.002 s - in org.apache.fop.fonts.EmbedFontInfoTestCase
[INFO] Running org.apache.fop.fonts.CIDFullTestCase
[INFO] Tests run: 9, Failures: 0, Errors: 0, Skipped: 0, Time elapsed:
0.004 s - in org.apache.fop.fonts.CIDFullTestCase
[INFO] Running org.apache.fop.fonts.LazyFontTestCase
[INFO] Tests run: 1, Failures: 0, Errors: 0, Skipped: 0, Time elapsed:
0.001 s - in org.apache.fop.fonts.LazyFontTestCase
[INFO] Running org.apache.fop.fonts.EncodingModeTestCase
[INFO] Tests run: 3, Failures: 0, Errors: 0, Skipped: 0, Time elapsed:
0 s - in org.apache.fop.fonts.EncodingModeTestCase
[INFO] Running org.apache.fop.fonts.FontSelectorTestCase
[INFO] Tests run: 1, Failures: 0, Errors: 0, Skipped: 0, Time elapsed:
0.036 s - in org.apache.fop.fonts.FontSelectorTestCase
[INFO] Running org.apache.fop.fonts.FontManagerTestCase
[INFO] Tests run: 5, Failures: 0, Errors: 0, Skipped: 0, Time elapsed:
0.02 s - in org.apache.fop.fonts.FontManagerTestCase
[INFO] Running org.apache.fop.fonts.DejaVuLGCSerifTestCase
[INFO] Tests run: 3, Failures: 0, Errors: 0, Skipped: 0, Time elapsed:
0.025 s - in org.apache.fop.fonts.DejaVuLGCSerifTestCase
[INFO] Running org.apache.fop.fonts.FontEventProcessingTestCase
[INFO] Tests run: 2, Failures: 0, Errors: 0, Skipped: 0, Time elapsed:
0.016 s - in org.apache.fop.fonts.FontEventProcessingTestCase
[INFO] Running org.apache.fop.fonts.cff.CFFDataReaderTestCase
[INFO] Tests run: 2, Failures: 0, Errors: 0, Skipped: 0, Time elapsed:
0.001 s - in org.apache.fop.fonts.cff.CFFDataReaderTestCase
[INFO] Running org.apache.fop.fonts.truetype.OTFFileTestCase
[INFO] Tests run: 3, Failures: 0, Errors: 0, Skipped: 0, Time elapsed:
0.019 s - in org.apache.fop.fonts.truetype.OTFFileTestCase
[INFO] Running org.apache.fop.fonts.truetype.OTFSubSetFileTestCase
[INFO] Tests run: 14, Failures: 0, Errors: 0, Skipped: 0, Time
elapsed: 0.259 s - in
org.apache.fop.fonts.truetype.OTFSubSetFileTestCase
[INFO] Running org.apache.fop.fonts.truetype.TTFSubSetFileTestCase
[INFO] Tests run: 30, Failures: 0, Errors: 0, Skipped: 0, Time
elapsed: 0.344 s - in
org.apache.fop.fonts.truetype.TTFSubSetFileTestCase
[INFO] Running org.apache.fop.fonts.truetype.GlyfTableTestCase
[INFO] Tests run: 4, Failures: 0, Errors: 0, Skipped: 0, Time elapsed:
0.008 s - in org.apache.fop.fonts.truetype.GlyfTableTestCase
[INFO] Running org.apache.fop.fonts.truetype.TTFFontLoaderTestCase
[INFO] Tests run: 1, Failures: 0, Errors: 0, Skipped: 0, Time elapsed:
0.019 s - in org.apache.fop.fonts.truetype.TTFFontLoaderTestCase
[INFO] Running org.apache.fop.fonts.truetype.TTFTableNameTestCase
[INFO] Tests run: 4, Failures: 0, Errors: 0, Skipped: 0, Time elapsed:
0.003 s - in org.apache.fop.fonts.truetype.TTFTableNameTestCase
[INFO] Running org.apache.fop.fonts.truetype.TTFFileTestCase
[INFO] Tests run: 29, Failures: 0, Errors: 0, Skipped: 0, Time
elapsed: 0.225 s - in org.apache.fop.fonts.truetype.TTFFileTestCase
[INFO] Running org.apache.fop.fonts.truetype.FontFileReaderTestCase
[INFO] Tests run: 15, Failures: 0, Errors: 0, Skipped: 0, Time
elapsed: 0.007 s - in
org.apache.fop.fonts.truetype.FontFileReaderTestCase
[INFO] Running org.apache.fop.fonts.truetype.OTFToType1TestCase
[INFO] Tests run: 2, Failures: 0, Errors: 0, Skipped: 0, Time elapsed:
0.035 s - in org.apache.fop.fonts.truetype.OTFToType1TestCase
[INFO] Running org.apache.fop.fonts.type1.AFMParserTestCase
[INFO] Tests run: 2, Failures: 0, Errors: 0, Skipped: 0, Time elapsed:
0.066 s - in org.apache.fop.fonts.type1.AFMParserTestCase
[INFO] Running org.apache.fop.fonts.type1.CharMetricsHandlerTestCase
[INFO] Tests run: 1, Failures: 0, Errors: 0, Skipped: 0, Time elapsed:
0.021 s - in org.apache.fop.fonts.type1.CharMetricsHandlerTestCase
[INFO] Running org.apache.fop.fonts.type1.Type1SubsetFileTestCase
[INFO] Tests run: 7, Failures: 0, Errors: 0, Skipped: 0, Time elapsed:
0.562 s - in org.apache.fop.fonts.type1.Type1SubsetFileTestCase
[INFO] Running org.apache.fop.fonts.type1.Type1FontLoaderTestCase
[INFO] Tests run: 1, Failures: 0, Errors: 0, Skipped: 0, Time elapsed:
0.004 s - in org.apache.fop.fonts.type1.Type1FontLoaderTestCase
[INFO] Running org.apache.fop.fonts.type1.PostscriptParserTestCase
[INFO] Tests run: 2, Failures: 0, Errors: 0, Skipped: 0, Time elapsed:
0.003 s - in org.apache.fop.fonts.type1.PostscriptParserTestCase
[INFO] Running org.apache.fop.fonts.type1.AdobeStandardEncodingTestCase
[INFO] Tests run: 1, Failures: 0, Errors: 0, Skipped: 0, Time elapsed:
0.006 s - in org.apache.fop.fonts.type1.AdobeStandardEncodingTestCase
[INFO] Running org.apache.fop.pdf.PDFVTTestCase
[INFO] Tests run: 4, Failures: 0, Errors: 0, Skipped: 0, Time elapsed:
0.385 s - in org.apache.fop.pdf.PDFVTTestCase
[INFO] Running org.apache.fop.pdf.PDFArrayTestCase
[INFO] Tests run: 15, Failures: 0, Errors: 0, Skipped: 0, Time
elapsed: 0.005 s - in org.apache.fop.pdf.PDFArrayTestCase
[INFO] Running org.apache.fop.pdf.PDFEncryptionJCETestCase
[INFO] Tests run: 11, Failures: 0, Errors: 0, Skipped: 0, Time
elapsed: 0.158 s - in org.apache.fop.pdf.PDFEncryptionJCETestCase
[INFO] Running org.apache.fop.pdf.PDFDocumentTestCase
[INFO] Tests run: 1, Failures: 0, Errors: 0, Skipped: 0, Time elapsed:
0.002 s - in org.apache.fop.pdf.PDFDocumentTestCase
[INFO] Running org.apache.fop.pdf.PDFPagePieceTestCase
[INFO] Tests run: 1, Failures: 0, Errors: 0, Skipped: 0, Time elapsed:
0.014 s - in org.apache.fop.pdf.PDFPagePieceTestCase
[INFO] Running org.apache.fop.pdf.PDFAttachmentTestCase
[INFO] Tests run: 1, Failures: 0, Errors: 0, Skipped: 0, Time elapsed:
0.027 s - in org.apache.fop.pdf.PDFAttachmentTestCase
[INFO] Running org.apache.fop.pdf.PDFLinkTestCase
[INFO] Tests run: 180, Failures: 0, Errors: 0, Skipped: 0, Time
elapsed: 0.448 s - in org.apache.fop.pdf.PDFLinkTestCase
[INFO] Running org.apache.fop.pdf.ObjectStreamManagerTestCase
[INFO] Tests run: 1, Failures: 0, Errors: 0, Skipped: 0, Time elapsed:
0 s - in org.apache.fop.pdf.ObjectStreamManagerTestCase
[INFO] Running org.apache.fop.pdf.ObjectStreamTestCase
[INFO] Tests run: 4, Failures: 0, Errors: 0, Skipped: 0, Time elapsed:
0 s - in org.apache.fop.pdf.ObjectStreamTestCase
[INFO] Running org.apache.fop.pdf.PDFNumberTestCase
[INFO] Tests run: 10, Failures: 0, Errors: 0, Skipped: 0, Time
elapsed: 0 s - in org.apache.fop.pdf.PDFNumberTestCase
[INFO] Running org.apache.fop.pdf.PDFFilterListTestCase
[INFO] Tests run: 1, Failures: 0, Errors: 0, Skipped: 0, Time elapsed:
0 s - in org.apache.fop.pdf.PDFFilterListTestCase
[INFO] Running org.apache.fop.pdf.PDFEncodingTestCase
[INFO] Tests run: 4, Failures: 0, Errors: 0, Skipped: 0, Time elapsed:
0 s - in org.apache.fop.pdf.PDFEncodingTestCase
[INFO] Running org.apache.fop.pdf.VersionTestCase
[INFO] Tests run: 4, Failures: 0, Errors: 0, Skipped: 0, Time elapsed:
0 s - in org.apache.fop.pdf.VersionTestCase
[INFO] Running org.apache.fop.pdf.PDFRectangleTestCase
[INFO] Tests run: 1, Failures: 0, Errors: 0, Skipped: 0, Time elapsed:
0 s - in org.apache.fop.pdf.PDFRectangleTestCase
[INFO] Running org.apache.fop.pdf.PDFReferenceTestCase
[INFO] Tests run: 2, Failures: 0, Errors: 0, Skipped: 0, Time elapsed:
0.002 s - in org.apache.fop.pdf.PDFReferenceTestCase
[INFO] Running org.apache.fop.pdf.PDFNumsArrayTestCase
[INFO] Tests run: 10, Failures: 0, Errors: 0, Skipped: 0, Time
elapsed: 0 s - in org.apache.fop.pdf.PDFNumsArrayTestCase
[INFO] Running org.apache.fop.pdf.PDFLinearizationTestCase
[INFO] Tests run: 2, Failures: 0, Errors: 0, Skipped: 0, Time elapsed:
0.002 s - in org.apache.fop.pdf.PDFLinearizationTestCase
[INFO] Running org.apache.fop.pdf.PDFDocumentGraphics2DTestCase
[INFO] Tests run: 1, Failures: 0, Errors: 0, Skipped: 0, Time elapsed:
0.001 s - in org.apache.fop.pdf.PDFDocumentGraphics2DTestCase
[INFO] Running org.apache.fop.pdf.PDFDictionaryTestCase
[INFO] Tests run: 13, Failures: 0, Errors: 0, Skipped: 0, Time
elapsed: 0.001 s - in org.apache.fop.pdf.PDFDictionaryTestCase
[INFO] Running org.apache.fop.pdf.PDFAModeTestCase
[INFO] Tests run: 6, Failures: 0, Errors: 0, Skipped: 0, Time elapsed:
0 s - in org.apache.fop.pdf.PDFAModeTestCase
[INFO] Running org.apache.fop.pdf.PDFUATestCase
[INFO] Tests run: 2, Failures: 0, Errors: 0, Skipped: 0, Time elapsed:
0 s - in org.apache.fop.pdf.PDFUATestCase
[INFO] Running org.apache.fop.pdf.VersionControllerTestCase
[INFO] Tests run: 2, Failures: 0, Errors: 0, Skipped: 0, Time elapsed:
0 s - in org.apache.fop.pdf.VersionControllerTestCase
[INFO] Running org.apache.fop.pdf.PDFStreamTestCase
[INFO] Tests run: 5, Failures: 0, Errors: 0, Skipped: 0, Time elapsed:
0 s - in org.apache.fop.pdf.PDFStreamTestCase
[INFO] Running org.apache.fop.pdf.FileIDGeneratorTestCase
[INFO] Tests run: 8, Failures: 0, Errors: 0, Skipped: 0, Time elapsed:
0.001 s - in org.apache.fop.pdf.FileIDGeneratorTestCase
[INFO] Running org.apache.fop.pdf.PDFFactoryTestCase
[INFO] Tests run: 4, Failures: 0, Errors: 0, Skipped: 0, Time elapsed:
0.04 s - in org.apache.fop.pdf.PDFFactoryTestCase
[INFO] Running org.apache.fop.pdf.PDFNameTestCase
[INFO] Tests run: 13, Failures: 0, Errors: 0, Skipped: 0, Time
elapsed: 0.001 s - in org.apache.fop.pdf.PDFNameTestCase
[INFO] Running org.apache.fop.pdf.AbstractPDFStreamTestCase
[INFO] Tests run: 10, Failures: 0, Errors: 0, Skipped: 0, Time
elapsed: 0 s - in org.apache.fop.pdf.AbstractPDFStreamTestCase
[INFO] Running org.apache.fop.pdf.PDFNullTestCase
[INFO] Tests run: 10, Failures: 0, Errors: 0, Skipped: 0, Time
elapsed: 0 s - in org.apache.fop.pdf.PDFNullTestCase
[INFO] Running org.apache.fop.pdf.PDFPageLabelsTestCase
[INFO] Tests run: 1, Failures: 0, Errors: 0, Skipped: 0, Time elapsed:
0.021 s - in org.apache.fop.pdf.PDFPageLabelsTestCase
[INFO] Running org.apache.fop.pdf.PDFObjectTestCase
[INFO] Tests run: 9, Failures: 0, Errors: 0, Skipped: 0, Time elapsed:
0.002 s - in org.apache.fop.pdf.PDFObjectTestCase
[INFO] Running org.apache.fop.pdf.PDFDestsTestCase
[INFO] Tests run: 10, Failures: 0, Errors: 0, Skipped: 0, Time
elapsed: 0.006 s - in org.apache.fop.pdf.PDFDestsTestCase
[INFO] Running org.apache.fop.pdf.TableHeaderScopeTestCase
[INFO] Tests run: 3, Failures: 0, Errors: 0, Skipped: 0, Time elapsed:
0.019 s - in org.apache.fop.pdf.TableHeaderScopeTestCase
[INFO] Running org.apache.fop.pdf.PDFParentTreeTestCase
[INFO] Tests run: 4, Failures: 0, Errors: 0, Skipped: 0, Time elapsed:
0.003 s - in org.apache.fop.pdf.PDFParentTreeTestCase
[INFO] Running org.apache.fop.pdf.xref.CrossReferenceStreamTestCase
[INFO] Tests run: 5, Failures: 0, Errors: 0, Skipped: 0, Time elapsed:
0.004 s - in org.apache.fop.pdf.xref.CrossReferenceStreamTestCase
[INFO] Running org.apache.fop.pdf.xref.CrossReferenceTableTestCase
[INFO] Tests run: 3, Failures: 0, Errors: 0, Skipped: 0, Time elapsed:
0.001 s - in org.apache.fop.pdf.xref.CrossReferenceTableTestCase
[INFO] Running org.apache.fop.pdf.xref.CompressedObjectReferenceTestCase
[INFO] Tests run: 1, Failures: 0, Errors: 0, Skipped: 0, Time elapsed:
0.001 s - in org.apache.fop.pdf.xref.CompressedObjectReferenceTestCase
[INFO] Running org.apache.fop.pdf.xref.UncompressedObjectReferenceTestCase
[INFO] Tests run: 6, Failures: 0, Errors: 0, Skipped: 0, Time elapsed:
0 s - in org.apache.fop.pdf.xref.UncompressedObjectReferenceTestCase
[INFO] Running org.apache.fop.render.RendererFactoryTestCase
[INFO] Tests run: 3, Failures: 0, Errors: 0, Skipped: 0, Time elapsed:
0.001 s - in org.apache.fop.render.RendererFactoryTestCase
[INFO] Running org.apache.fop.render.AbstractPathOrientedRendererTestCase
[INFO] Tests run: 1, Failures: 0, Errors: 0, Skipped: 0, Time elapsed:
0.012 s - in org.apache.fop.render.AbstractPathOrientedRendererTestCase
[INFO] Running org.apache.fop.render.txt.TxtRendererConfigParserTestCase
[INFO] Tests run: 1, Failures: 0, Errors: 0, Skipped: 0, Time elapsed:
0.051 s - in org.apache.fop.render.txt.TxtRendererConfigParserTestCase
[INFO] Running org.apache.fop.render.extensions.DocumentNavigationHandlerTestCase
[INFO] Tests run: 3, Failures: 0, Errors: 0, Skipped: 0, Time elapsed:
0.022 s - in org.apache.fop.render.extensions.DocumentNavigationHandlerTestCase
[INFO] Running org.apache.fop.render.extensions.prepress.PageBoundariesTestCase
[INFO] Tests run: 8, Failures: 0, Errors: 0, Skipped: 0, Time elapsed:
0.003 s - in org.apache.fop.render.extensions.prepress.PageBoundariesTestCase
[INFO] Running org.apache.fop.render.extensions.prepress.PageScaleTestCase
[INFO] Tests run: 4, Failures: 0, Errors: 0, Skipped: 0, Time elapsed:
0 s - in org.apache.fop.render.extensions.prepress.PageScaleTestCase
[INFO] Running org.apache.fop.render.intermediate.IFStructureTreeBuilderTestCase
[INFO] Tests run: 3, Failures: 0, Errors: 0, Skipped: 0, Time elapsed:
0.012 s - in org.apache.fop.render.intermediate.IFStructureTreeBuilderTestCase
[INFO] Running org.apache.fop.render.intermediate.SAXEventRecorderTestCase
[INFO] Tests run: 5, Failures: 0, Errors: 0, Skipped: 0, Time elapsed:
0.003 s - in org.apache.fop.render.intermediate.SAXEventRecorderTestCase
[INFO] Running org.apache.fop.render.intermediate.BorderPainterTestCase
[INFO] Tests run: 7, Failures: 0, Errors: 0, Skipped: 0, Time elapsed:
0.079 s - in org.apache.fop.render.intermediate.BorderPainterTestCase
[INFO] Running org.apache.fop.render.intermediate.URIActionTestCase
[INFO] Tests run: 1, Failures: 0, Errors: 0, Skipped: 0, Time elapsed:
0 s - in org.apache.fop.render.intermediate.URIActionTestCase
[INFO] Running org.apache.fop.render.intermediate.IFSerializerTestCase
[INFO] Tests run: 2, Failures: 0, Errors: 0, Skipped: 0, Time elapsed:
0 s - in org.apache.fop.render.intermediate.IFSerializerTestCase
[INFO] Running org.apache.fop.render.intermediate.ArcToBezierCurveTransformerTestCase
[INFO] Tests run: 1, Failures: 0, Errors: 0, Skipped: 0, Time elapsed:
0 s - in org.apache.fop.render.intermediate.ArcToBezierCurveTransformerTestCase
[INFO] Running org.apache.fop.render.intermediate.AbstractIFPainterTestCase
[INFO] Tests run: 2, Failures: 0, Errors: 0, Skipped: 0, Time elapsed:
0.013 s - in org.apache.fop.render.intermediate.AbstractIFPainterTestCase
[INFO] Running org.apache.fop.render.bitmap.TIFFCompressionValueTestCase
[INFO] Tests run: 3, Failures: 0, Errors: 0, Skipped: 0, Time elapsed:
0 s - in org.apache.fop.render.bitmap.TIFFCompressionValueTestCase
[INFO] Running org.apache.fop.render.bitmap.TIFFRendererConfiguratorTestCase
[INFO] Tests run: 7, Failures: 0, Errors: 0, Skipped: 0, Time elapsed:
0.083 s - in org.apache.fop.render.bitmap.TIFFRendererConfiguratorTestCase
[INFO] Running org.apache.fop.render.bitmap.BitmapRendererConfigParserTestCase
[INFO] Tests run: 5, Failures: 0, Errors: 0, Skipped: 0, Time elapsed:
0.047 s - in org.apache.fop.render.bitmap.BitmapRendererConfigParserTestCase
[INFO] Running org.apache.fop.render.bitmap.TIFFRendererConfigParserTestCase
[INFO] Tests run: 8, Failures: 0, Errors: 0, Skipped: 0, Time elapsed:
0.036 s - in org.apache.fop.render.bitmap.TIFFRendererConfigParserTestCase
[INFO] Running org.apache.fop.render.bitmap.BitmapRendererConfiguratorTestCase
[INFO] Tests run: 5, Failures: 0, Errors: 0, Skipped: 0, Time elapsed:
0.031 s - in org.apache.fop.render.bitmap.BitmapRendererConfiguratorTestCase
[INFO] Running org.apache.fop.render.gradient.GradientTestCase
[INFO] Tests run: 6, Failures: 0, Errors: 0, Skipped: 0, Time elapsed:
0.005 s - in org.apache.fop.render.gradient.GradientTestCase
[INFO] Running org.apache.fop.render.rtf.TextAttributesConverterTestCase
[INFO] Tests run: 1, Failures: 0, Errors: 0, Skipped: 0, Time elapsed:
0 s - in org.apache.fop.render.rtf.TextAttributesConverterTestCase
[INFO] Running org.apache.fop.render.rtf.Bug39607TestCase
[INFO] Tests run: 1, Failures: 0, Errors: 0, Skipped: 0, Time elapsed:
0.002 s - in org.apache.fop.render.rtf.Bug39607TestCase
[INFO] Running org.apache.fop.render.java2d.Java2DUtilTestCase
[INFO] Tests run: 2, Failures: 0, Errors: 0, Skipped: 0, Time elapsed:
0.03 s - in org.apache.fop.render.java2d.Java2DUtilTestCase
[INFO] Running org.apache.fop.render.java2d.ConfiguredFontCollectionTestCase
[INFO] Tests run: 1, Failures: 0, Errors: 0, Skipped: 0, Time elapsed:
0.007 s - in org.apache.fop.render.java2d.ConfiguredFontCollectionTestCase
[INFO] Running org.apache.fop.render.pdf.PDFPainterTestCase
[ERROR] Tests run: 4, Failures: 0, Errors: 1, Skipped: 0, Time
elapsed: 0.091 s <<< FAILURE! - in
org.apache.fop.render.pdf.PDFPainterTestCase
[ERROR] testDrawTextWithMultiByteFont(org.apache.fop.render.pdf.PDFPainterTestCase)
 Time elapsed: 0.051 s  <<< ERROR!
java.lang.RuntimeException: Unable to set MockitoNamingPolicy on cglib
generator which creates FastClasses
at org.apache.fop.render.pdf.PDFPainterTestCase.testDrawTextWithMultiByteFont(PDFPainterTestCase.java:173)
Caused by: java.lang.NullPointerException
at org.apache.fop.render.pdf.PDFPainterTestCase.testDrawTextWithMultiByteFont(PDFPainterTestCase.java:173)

[INFO] Running org.apache.fop.render.pdf.ImageRawPNGAdapterTestCase
[INFO] Tests run: 8, Failures: 0, Errors: 0, Skipped: 0, Time elapsed:
0.122 s - in org.apache.fop.render.pdf.ImageRawPNGAdapterTestCase
[INFO] Running org.apache.fop.render.pdf.PDFAMetadataTestCase
[INFO] Tests run: 2, Failures: 0, Errors: 0, Skipped: 0, Time elapsed:
0.001 s - in org.apache.fop.render.pdf.PDFAMetadataTestCase
[INFO] Running org.apache.fop.render.pdf.PDFsRGBSettingsTestCase
[INFO] Tests run: 1, Failures: 0, Errors: 0, Skipped: 0, Time elapsed:
0.001 s - in org.apache.fop.render.pdf.PDFsRGBSettingsTestCase
[INFO] Running org.apache.fop.render.pdf.PDFGraphicsPainterTestCase
[INFO] Tests run: 12, Failures: 0, Errors: 0, Skipped: 0, Time
elapsed: 0.013 s - in
org.apache.fop.render.pdf.PDFGraphicsPainterTestCase
[INFO] Running org.apache.fop.render.pdf.PDFAConformanceTestCase
[INFO] Tests run: 7, Failures: 0, Errors: 0, Skipped: 0, Time elapsed:
0.128 s - in org.apache.fop.render.pdf.PDFAConformanceTestCase
[INFO] Running org.apache.fop.render.pdf.PDFBorderPainterTestCase
[INFO] Tests run: 1, Failures: 0, Errors: 0, Skipped: 0, Time elapsed:
0.001 s - in org.apache.fop.render.pdf.PDFBorderPainterTestCase
[INFO] Running org.apache.fop.render.pdf.PDFRendererOptionsConfigTestCase
[INFO] Tests run: 3, Failures: 0, Errors: 0, Skipped: 0, Time elapsed:
0 s - in org.apache.fop.render.pdf.PDFRendererOptionsConfigTestCase
[INFO] Running org.apache.fop.render.pdf.PDFRendererConfigParserTestCase
[INFO] Tests run: 13, Failures: 0, Errors: 0, Skipped: 0, Time
elapsed: 0.252 s - in
org.apache.fop.render.pdf.PDFRendererConfigParserTestCase
[INFO] Running org.apache.fop.render.pdf.PDFDocumentHandlerTestCase
[INFO] Tests run: 1, Failures: 0, Errors: 0, Skipped: 0, Time elapsed:
0.004 s - in org.apache.fop.render.pdf.PDFDocumentHandlerTestCase
[INFO] Running org.apache.fop.render.pdf.PDFEncodingTestCase
[INFO] Tests run: 3, Failures: 0, Errors: 0, Skipped: 0, Time elapsed:
0.73 s - in org.apache.fop.render.pdf.PDFEncodingTestCase
[INFO] Running org.apache.fop.render.pdf.PDFCMapTestCase
[INFO] Tests run: 1, Failures: 0, Errors: 0, Skipped: 0, Time elapsed:
0 s - in org.apache.fop.render.pdf.PDFCMapTestCase
[INFO] Running org.apache.fop.render.pdf.extensions.PDFDocumentInformationElementTestCase
[INFO] Tests run: 2, Failures: 0, Errors: 0, Skipped: 0, Time elapsed:
0.006 s - in org.apache.fop.render.pdf.extensions.PDFDocumentInformationElementTestCase
[INFO] Running org.apache.fop.render.pcl.PCLRendererConfiguratorTestCase
[INFO] Tests run: 5, Failures: 0, Errors: 0, Skipped: 0, Time elapsed:
0.05 s - in org.apache.fop.render.pcl.PCLRendererConfiguratorTestCase
[INFO] Running org.apache.fop.render.pcl.PCLRendererConfigParserTestCase
[INFO] Tests run: 6, Failures: 0, Errors: 0, Skipped: 0, Time elapsed:
0.015 s - in org.apache.fop.render.pcl.PCLRendererConfigParserTestCase
[INFO] Running org.apache.fop.render.pcl.PCLPainterTestCase
[INFO] Tests run: 2, Failures: 0, Errors: 0, Skipped: 0, Time elapsed:
0.061 s - in org.apache.fop.render.pcl.PCLPainterTestCase
[INFO] Running org.apache.fop.render.pcl.fonts.PCLTTFFontReaderTestCase
[INFO] Tests run: 1, Failures: 0, Errors: 0, Skipped: 0, Time elapsed:
0.032 s - in org.apache.fop.render.pcl.fonts.PCLTTFFontReaderTestCase
[INFO] Running org.apache.fop.render.pcl.fonts.PCLByteWriterUtilTestCase
[INFO] Tests run: 2, Failures: 0, Errors: 0, Skipped: 0, Time elapsed:
0 s - in org.apache.fop.render.pcl.fonts.PCLByteWriterUtilTestCase
[INFO] Running org.apache.fop.render.pcl.fonts.PCLFontReaderFactoryTestCase
[INFO] Tests run: 1, Failures: 0, Errors: 0, Skipped: 0, Time elapsed:
0.002 s - in org.apache.fop.render.pcl.fonts.PCLFontReaderFactoryTestCase
[INFO] Running org.apache.fop.render.pcl.fonts.truetype.PCLTTFCharacterWriterTestCase
[INFO] Tests run: 1, Failures: 0, Errors: 0, Skipped: 0, Time elapsed:
0.015 s - in org.apache.fop.render.pcl.fonts.truetype.PCLTTFCharacterWriterTestCase
[INFO] Running org.apache.fop.render.afp.AFPBorderPainterTestCase
[INFO] Tests run: 2, Failures: 0, Errors: 0, Skipped: 0, Time elapsed:
0 s - in org.apache.fop.render.afp.AFPBorderPainterTestCase
[INFO] Running org.apache.fop.render.afp.NoOperationTestCase
[INFO] Tests run: 1, Failures: 0, Errors: 0, Skipped: 0, Time elapsed:
0.017 s - in org.apache.fop.render.afp.NoOperationTestCase
[INFO] Running org.apache.fop.render.afp.AFPPainterTestCase
[INFO] Tests run: 4, Failures: 0, Errors: 0, Skipped: 0, Time elapsed:
2.992 s - in org.apache.fop.render.afp.AFPPainterTestCase
[INFO] Running org.apache.fop.render.afp.AFPImageHandlerTestCase
[INFO] Tests run: 1, Failures: 0, Errors: 0, Skipped: 0, Time elapsed:
0 s - in org.apache.fop.render.afp.AFPImageHandlerTestCase
[INFO] Running org.apache.fop.render.afp.AFPRendererConfigParserTestCase
[INFO] Tests run: 15, Failures: 0, Errors: 0, Skipped: 0, Time
elapsed: 0.057 s - in
org.apache.fop.render.afp.AFPRendererConfigParserTestCase
[INFO] Running org.apache.fop.render.afp.AFPRendererConfiguratorTestCase
[INFO] Tests run: 17, Failures: 0, Errors: 0, Skipped: 0, Time
elapsed: 0.21 s - in
org.apache.fop.render.afp.AFPRendererConfiguratorTestCase
[INFO] Running org.apache.fop.render.afp.AFPTrueTypeTestCase
[INFO] Tests run: 2, Failures: 0, Errors: 0, Skipped: 0, Time elapsed:
0.037 s - in org.apache.fop.render.afp.AFPTrueTypeTestCase
[INFO] Running org.apache.fop.render.ps.ResourceOptimizationTestCase
[INFO] Tests run: 1, Failures: 0, Errors: 0, Skipped: 0, Time elapsed:
0.066 s - in org.apache.fop.render.ps.ResourceOptimizationTestCase
[INFO] Running org.apache.fop.render.ps.ImageEncoderPNGTestCase
[INFO] Tests run: 7, Failures: 0, Errors: 0, Skipped: 0, Time elapsed:
0.007 s - in org.apache.fop.render.ps.ImageEncoderPNGTestCase
[INFO] Running org.apache.fop.render.ps.ImageHandlingTestCase
[INFO] Tests run: 3, Failures: 0, Errors: 0, Skipped: 0, Time elapsed:
0.144 s - in org.apache.fop.render.ps.ImageHandlingTestCase
[INFO] Running org.apache.fop.render.ps.PSGraphics2DAdapterTestCase
[INFO] Tests run: 1, Failures: 0, Errors: 0, Skipped: 0, Time elapsed:
0 s - in org.apache.fop.render.ps.PSGraphics2DAdapterTestCase
[INFO] Running org.apache.fop.render.ps.PSBorderPainterTestCase
[INFO] Tests run: 1, Failures: 0, Errors: 0, Skipped: 0, Time elapsed:
0 s - in org.apache.fop.render.ps.PSBorderPainterTestCase
[INFO] Running org.apache.fop.render.ps.PSGraphicsPainterTestCase
[INFO] Tests run: 1, Failures: 0, Errors: 0, Skipped: 0, Time elapsed:
0.001 s - in org.apache.fop.render.ps.PSGraphicsPainterTestCase
[INFO] Running org.apache.fop.render.ps.PSRenderingUtilTestCase
[INFO] Tests run: 1, Failures: 0, Errors: 0, Skipped: 0, Time elapsed:
0 s - in org.apache.fop.render.ps.PSRenderingUtilTestCase
[INFO] Running org.apache.fop.render.ps.PSRendererConfigParserTestCase
[INFO] Tests run: 5, Failures: 0, Errors: 0, Skipped: 0, Time elapsed:
0.014 s - in org.apache.fop.render.ps.PSRendererConfigParserTestCase
[INFO] Running org.apache.fop.render.ps.PSPainterTestCase
[INFO] Tests run: 5, Failures: 0, Errors: 0, Skipped: 0, Time elapsed:
0.02 s - in org.apache.fop.render.ps.PSPainterTestCase
[INFO] Running org.apache.fop.render.ps.PSImageUtilsTestCase
[WARNING] Tests run: 1, Failures: 0, Errors: 0, Skipped: 1, Time
elapsed: 0 s - in org.apache.fop.render.ps.PSImageUtilsTestCase
[INFO] Running org.apache.fop.render.ps.PSRendererConfiguratorTestCase
[INFO] Tests run: 6, Failures: 0, Errors: 0, Skipped: 0, Time elapsed:
0.029 s - in org.apache.fop.render.ps.PSRendererConfiguratorTestCase
[INFO] Running org.apache.fop.render.ps.fonts.PSTTFGeneratorTestCase
[INFO] Tests run: 4, Failures: 0, Errors: 0, Skipped: 0, Time elapsed:
0.023 s - in org.apache.fop.render.ps.fonts.PSTTFGeneratorTestCase
[INFO] Running org.apache.fop.render.ps.fonts.PSTTFTableOutputStreamTestCase
[INFO] Tests run: 1, Failures: 0, Errors: 0, Skipped: 0, Time elapsed:
0.007 s - in org.apache.fop.render.ps.fonts.PSTTFTableOutputStreamTestCase
[INFO] Running org.apache.fop.render.ps.fonts.PSTTFOutputStreamTestCase
[INFO] Tests run: 4, Failures: 0, Errors: 0, Skipped: 0, Time elapsed:
0 s - in org.apache.fop.render.ps.fonts.PSTTFOutputStreamTestCase
[INFO] Running org.apache.fop.render.ps.fonts.PSTTFGlyphOutputStreamTestCase
[INFO] Tests run: 3, Failures: 0, Errors: 0, Skipped: 0, Time elapsed:
0.158 s - in org.apache.fop.render.ps.fonts.PSTTFGlyphOutputStreamTestCase
[INFO] Running org.apache.fop.render.ps.svg.GradientTestCase
[INFO] Tests run: 2, Failures: 0, Errors: 0, Skipped: 0, Time elapsed:
0.003 s - in org.apache.fop.render.ps.svg.GradientTestCase
[INFO] Running org.apache.fop.svg.PDFTextPainterTestCase
[INFO] Tests run: 5, Failures: 0, Errors: 0, Skipped: 0, Time elapsed:
0.033 s - in org.apache.fop.svg.PDFTextPainterTestCase
[INFO] Running org.apache.fop.svg.PSTextPainterTestCase
[INFO] Tests run: 1, Failures: 0, Errors: 0, Skipped: 0, Time elapsed:
0 s - in org.apache.fop.svg.PSTextPainterTestCase
[INFO] Running org.apache.fop.svg.PDFGraphics2DTestCase
[INFO] Tests run: 2, Failures: 0, Errors: 0, Skipped: 0, Time elapsed:
0 s - in org.apache.fop.svg.PDFGraphics2DTestCase
[INFO] Running org.apache.fop.svg.font.FOPFontFamilyResolverTestCase
[WARNING] Tests run: 4, Failures: 0, Errors: 0, Skipped: 1, Time
elapsed: 0.002 s - in
org.apache.fop.svg.font.FOPFontFamilyResolverTestCase
[INFO] Running org.apache.fop.svg.font.BasicGlyphVectorTestCase
[INFO] Tests run: 12, Failures: 0, Errors: 0, Skipped: 0, Time
elapsed: 0.05 s - in org.apache.fop.svg.font.BasicGlyphVectorTestCase
[INFO] Running org.apache.fop.svg.font.GlyphLayoutTestCase
[INFO] Tests run: 2, Failures: 0, Errors: 0, Skipped: 0, Time elapsed:
0.02 s - in org.apache.fop.svg.font.GlyphLayoutTestCase
[INFO] Running org.apache.fop.svg.font.KerningGlyphLayoutTestCase
[INFO] Tests run: 1, Failures: 0, Errors: 0, Skipped: 0, Time elapsed:
0 s - in org.apache.fop.svg.font.KerningGlyphLayoutTestCase
[INFO] Running org.apache.fop.svg.font.FOPGVTFontTestCase
[INFO] Tests run: 2, Failures: 0, Errors: 0, Skipped: 0, Time elapsed:
0 s - in org.apache.fop.svg.font.FOPGVTFontTestCase
[INFO] Running org.apache.fop.util.XMLResourceBundleTestCase
[INFO] Tests run: 2, Failures: 0, Errors: 0, Skipped: 0, Time elapsed:
0.002 s - in org.apache.fop.util.XMLResourceBundleTestCase
[INFO] Running org.apache.fop.util.LanguageTagsTestCase
[INFO] Tests run: 4, Failures: 0, Errors: 0, Skipped: 0, Time elapsed:
0 s - in org.apache.fop.util.LanguageTagsTestCase
[INFO] Running org.apache.fop.util.AdvancedMessageFormatTestCase
[INFO] Tests run: 5, Failures: 0, Errors: 0, Skipped: 0, Time elapsed:
0.003 s - in org.apache.fop.util.AdvancedMessageFormatTestCase
[INFO] Running org.apache.fop.util.CharUtilitiesTestCase
[INFO] Tests run: 5, Failures: 0, Errors: 0, Skipped: 0, Time elapsed:
0.095 s - in org.apache.fop.util.CharUtilitiesTestCase
[INFO] Running org.apache.fop.util.CompareUtilTestCase
[INFO] Tests run: 1, Failures: 0, Errors: 0, Skipped: 0, Time elapsed:
0.005 s - in org.apache.fop.util.CompareUtilTestCase
[INFO] Running org.apache.fop.util.ColorUtilTestCase
[INFO] Tests run: 8, Failures: 0, Errors: 0, Skipped: 0, Time elapsed:
0.031 s - in org.apache.fop.util.ColorUtilTestCase
[INFO] Running org.apache.fop.util.BitmapImageUtilTestCase
[INFO] Tests run: 1, Failures: 0, Errors: 0, Skipped: 0, Time elapsed:
0.137 s - in org.apache.fop.util.BitmapImageUtilTestCase
[INFO] Running org.apache.fop.util.HexEncoderTestCase
[INFO] Tests run: 2, Failures: 0, Errors: 0, Skipped: 0, Time elapsed:
0.049 s - in org.apache.fop.util.HexEncoderTestCase
[INFO] Running org.apache.fop.util.ElementListUtilsTestCase
[INFO] Tests run: 4, Failures: 0, Errors: 0, Skipped: 0, Time elapsed:
0.001 s - in org.apache.fop.util.ElementListUtilsTestCase
[INFO]
[INFO] Results:
[INFO]
[ERROR] Failures:
[ERROR]   IFTestCase.runTest:103 Expected XPath expression to evaluate
to 'true', but got '' (XPath: /descendant::if:text[1]/@hyphenated)
[ERROR]   HyphenationLayoutTestCase>LayoutEngineTestCase.runTest:183->LayoutEngineTestCase.checkAll:255->LayoutEngineTestCase.doATChecks:329
Layout test (block_hyphenation_kerning_non_bmp.xml): Expected XPath
expression to evaluate to '47702', but got '34372' (XPath:
//flow/block[1]/lineArea[1]/text[1]/@twsadjust)
[ERROR]   HyphenationLayoutTestCase>LayoutEngineTestCase.runTest:183->LayoutEngineTestCase.checkAll:255->LayoutEngineTestCase.doATChecks:329
Layout test (block_hyphenation_kerning.xml): Expected XPath expression
to evaluate to '-1339', but got '31090' (XPath:
//flow/block[1]/lineArea[2]/text[1]/@twsadjust)
[ERROR]   HyphenationLayoutTestCase>LayoutEngineTestCase.runTest:183->LayoutEngineTestCase.checkAll:255->LayoutEngineTestCase.doATChecks:329
Layout test (block_hyphenation-ladder-count.xml): Expected XPath
expression to evaluate to '8', but got '9' (XPath:
count(//pageViewport[1]//flow/block[2]/lineArea))
[ERROR]   HyphenationLayoutTestCase>LayoutEngineTestCase.runTest:183->LayoutEngineTestCase.checkAll:255->LayoutEngineTestCase.doATChecks:329
Layout test (inline_border_padding_hyphenate_de.xml): Expected XPath
expression to evaluate to '250110', but got '377390' (XPath:
//flow/block[1]/lineArea[1]/inlineparent/@ipd)
[ERROR]   HyphenationLayoutTestCase>LayoutEngineTestCase.runTest:183->LayoutEngineTestCase.checkAll:255->LayoutEngineTestCase.doATChecks:329
Layout test (hyphenation-pattern_fallback.xml): Expected XPath
expression to evaluate to '8', but got '9' (XPath:
count(//pageViewport[1]//flow/block[2]/lineArea))
[ERROR]   HyphenationLayoutTestCase>LayoutEngineTestCase.runTest:183->LayoutEngineTestCase.checkAll:255->LayoutEngineTestCase.doATChecks:329
Layout test (block_uax14_linebreaking_hyph.xml): Expected XPath
expression to evaluate to '9', but got '4' (XPath:
count(//flow/block/lineArea))
[ERROR]   HyphenationLayoutTestCase>LayoutEngineTestCase.runTest:183->LayoutEngineTestCase.checkAll:255->LayoutEngineTestCase.doATChecks:329
Layout test (block_hyphenation_non_letter_words.xml): Expected XPath
expression to evaluate to 'OCF_SUC-', but got '' (XPath:
//pageViewport[1]/page[1]/regionViewport[1]/regionBody[1]/mainReference[1]/span[1]/flow[1]/block[6]/lineArea[1]/text[1]/word[6])
[ERROR]   HyphenationLayoutTestCase>LayoutEngineTestCase.runTest:183->LayoutEngineTestCase.checkAll:255->LayoutEngineTestCase.doATChecks:329
Layout test (block_hyphenation_linefeed_preserve.xml): Expected XPath
expression to evaluate to '13', but got '14' (XPath:
count(//flow[1]/block/lineArea))
[ERROR] Errors:
[ERROR]   PDFPainterTestCase.testDrawTextWithMultiByteFont:173 Runtime
Unable to set Moc...
[INFO]
[ERROR] Tests run: 3112, Failures: 9, Errors: 1, Skipped: 4
[INFO]
[ERROR] There are test failures.


(*)
https://buildd.debian.org/status/fetch.php?pkg=fop&arch=all&ver=1%3A2.3-2&stamp=1543399269&raw=0

Mime
View raw message