xmlgraphics-fop-dev mailing list archives

Site index · List index
Message view « Date » · « Thread »
Top « Date » · « Thread »
From Apache Jenkins Server <jenk...@builds.apache.org>
Subject Build failed in Jenkins: xmlgraphics-fop #170
Date Fri, 13 Oct 2017 12:18:30 GMT
See <https://builds.apache.org/job/xmlgraphics-fop/170/display/redirect?page=changes>

Changes:

[ssteiner] FOP-2753: PDF to PS allow fop fonts as fallback

------------------------------------------
[...truncated 17.75 KB...]
[INFO] Building jar: <https://builds.apache.org/job/xmlgraphics-fop/ws/fop-events/target/fop-events-2.3.0-SNAPSHOT.jar>
[INFO] 
[INFO] --- maven-install-plugin:2.3.1:install (default-install) @ fop-events ---
[INFO] Installing <https://builds.apache.org/job/xmlgraphics-fop/ws/fop-events/target/fop-events-2.3.0-SNAPSHOT.jar>
to /home/jenkins/jenkins-slave/maven-repositories/1/org/apache/xmlgraphics/fop-events/2.3.0-SNAPSHOT/fop-events-2.3.0-SNAPSHOT.jar
[INFO] Installing <https://builds.apache.org/job/xmlgraphics-fop/ws/fop-events/pom.xml>
to /home/jenkins/jenkins-slave/maven-repositories/1/org/apache/xmlgraphics/fop-events/2.3.0-SNAPSHOT/fop-events-2.3.0-SNAPSHOT.pom
[INFO] 
[INFO] --- maven-checkstyle-plugin:2.14:checkstyle (default-cli) @ fop-events ---
[CHECKSTYLE] Parsing file <https://builds.apache.org/job/xmlgraphics-fop/ws/fop-events/target/checkstyle-result.xml>
[CHECKSTYLE] Successfully parsed file <https://builds.apache.org/job/xmlgraphics-fop/ws/fop-events/target/checkstyle-result.xml>
of module Apache FOP Events with 0 unique warnings and 0 duplicates.
[CHECKSTYLE] Ignore new warnings since this is the first valid build
[CHECKSTYLE] Plug-in Result: Success - no threshold has been exceeded
[CHECKSTYLE] Computing warning deltas based on reference build #169
[INFO] 
[INFO] --- findbugs-maven-plugin:3.0.4:findbugs (default-cli) @ fop-events ---
[INFO] Fork Value is true
[INFO] Done FindBugs Analysis....
[FINDBUGS] Searching for all files in <https://builds.apache.org/job/xmlgraphics-fop/ws/fop-events/target>
that match the pattern findbugsXml.xml
[FINDBUGS] Parsing 1 file in <https://builds.apache.org/job/xmlgraphics-fop/ws/fop-events/target>
[FINDBUGS] Successfully parsed file <https://builds.apache.org/job/xmlgraphics-fop/ws/fop-events/target/findbugsXml.xml>
of module Apache FOP Events with 0 unique warnings and 0 duplicates.
[FINDBUGS] Ignore new warnings since this is the first valid build
[FINDBUGS] Plug-in Result: Success - no threshold has been exceeded
[FINDBUGS] Computing warning deltas based on reference build #169
[INFO]                                                                         
[INFO] ------------------------------------------------------------------------
[INFO] Building Apache FOP Core 2.3.0-SNAPSHOT
[INFO] ------------------------------------------------------------------------
Downloading: https://repository.apache.org/content/repositories/snapshots/org/apache/xmlgraphics/batik-anim/1.9.0-SNAPSHOT/maven-metadata.xml
Downloading: https://repository.jboss.org/nexus/content/repositories/thirdparty-releases/org/apache/xmlgraphics/batik-anim/1.9.0-SNAPSHOT/maven-metadata.xml
Downloaded: https://repository.apache.org/content/repositories/snapshots/org/apache/xmlgraphics/batik-anim/1.9.0-SNAPSHOT/maven-metadata.xml
(785 B at 1.3 KB/sec)
Downloading: https://repository.apache.org/content/repositories/snapshots/org/apache/xmlgraphics/batik/1.9.0-SNAPSHOT/maven-metadata.xml
Downloading: https://repository.jboss.org/nexus/content/repositories/thirdparty-releases/org/apache/xmlgraphics/batik/1.9.0-SNAPSHOT/maven-metadata.xml
Downloaded: https://repository.apache.org/content/repositories/snapshots/org/apache/xmlgraphics/batik/1.9.0-SNAPSHOT/maven-metadata.xml
(606 B at 1.0 KB/sec)
Downloading: https://repository.apache.org/content/repositories/snapshots/org/apache/xmlgraphics/batik-awt-util/1.9.0-SNAPSHOT/maven-metadata.xml
Downloading: https://repository.jboss.org/nexus/content/repositories/thirdparty-releases/org/apache/xmlgraphics/batik-awt-util/1.9.0-SNAPSHOT/maven-metadata.xml
Downloaded: https://repository.apache.org/content/repositories/snapshots/org/apache/xmlgraphics/batik-awt-util/1.9.0-SNAPSHOT/maven-metadata.xml
(789 B at 1.4 KB/sec)
Downloading: https://repository.apache.org/content/repositories/snapshots/org/apache/xmlgraphics/batik-util/1.9.0-SNAPSHOT/maven-metadata.xml
Downloading: https://repository.jboss.org/nexus/content/repositories/thirdparty-releases/org/apache/xmlgraphics/batik-util/1.9.0-SNAPSHOT/maven-metadata.xml
Downloaded: https://repository.apache.org/content/repositories/snapshots/org/apache/xmlgraphics/batik-util/1.9.0-SNAPSHOT/maven-metadata.xml
(785 B at 1.4 KB/sec)
Downloading: https://repository.jboss.org/nexus/content/repositories/thirdparty-releases/org/apache/xmlgraphics/batik-constants/1.9.0-SNAPSHOT/maven-metadata.xml
Downloading: https://repository.apache.org/content/repositories/snapshots/org/apache/xmlgraphics/batik-constants/1.9.0-SNAPSHOT/maven-metadata.xml
Downloaded: https://repository.apache.org/content/repositories/snapshots/org/apache/xmlgraphics/batik-constants/1.9.0-SNAPSHOT/maven-metadata.xml
(790 B at 1.4 KB/sec)
Downloading: https://repository.apache.org/content/repositories/snapshots/org/apache/xmlgraphics/batik-i18n/1.9.0-SNAPSHOT/maven-metadata.xml
Downloading: https://repository.jboss.org/nexus/content/repositories/thirdparty-releases/org/apache/xmlgraphics/batik-i18n/1.9.0-SNAPSHOT/maven-metadata.xml
Downloaded: https://repository.apache.org/content/repositories/snapshots/org/apache/xmlgraphics/batik-i18n/1.9.0-SNAPSHOT/maven-metadata.xml
(785 B at 1.4 KB/sec)
Downloading: https://repository.apache.org/content/repositories/snapshots/org/apache/xmlgraphics/xmlgraphics-commons/2.2.0-SNAPSHOT/maven-metadata.xml
Downloading: https://repository.jboss.org/nexus/content/repositories/thirdparty-releases/org/apache/xmlgraphics/xmlgraphics-commons/2.2.0-SNAPSHOT/maven-metadata.xml
Downloaded: https://repository.apache.org/content/repositories/snapshots/org/apache/xmlgraphics/xmlgraphics-commons/2.2.0-SNAPSHOT/maven-metadata.xml
(794 B at 1.3 KB/sec)
Downloading: https://repository.apache.org/content/repositories/snapshots/org/apache/xmlgraphics/batik-css/1.9.0-SNAPSHOT/maven-metadata.xml
Downloading: https://repository.jboss.org/nexus/content/repositories/thirdparty-releases/org/apache/xmlgraphics/batik-css/1.9.0-SNAPSHOT/maven-metadata.xml
Downloaded: https://repository.apache.org/content/repositories/snapshots/org/apache/xmlgraphics/batik-css/1.9.0-SNAPSHOT/maven-metadata.xml
(784 B at 1.4 KB/sec)
Downloading: https://repository.apache.org/content/repositories/snapshots/org/apache/xmlgraphics/batik-dom/1.9.0-SNAPSHOT/maven-metadata.xml
Downloading: https://repository.jboss.org/nexus/content/repositories/thirdparty-releases/org/apache/xmlgraphics/batik-dom/1.9.0-SNAPSHOT/maven-metadata.xml
Downloaded: https://repository.apache.org/content/repositories/snapshots/org/apache/xmlgraphics/batik-dom/1.9.0-SNAPSHOT/maven-metadata.xml
(784 B at 1.4 KB/sec)
Downloading: https://repository.apache.org/content/repositories/snapshots/org/apache/xmlgraphics/batik-ext/1.9.0-SNAPSHOT/maven-metadata.xml
Downloading: https://repository.jboss.org/nexus/content/repositories/thirdparty-releases/org/apache/xmlgraphics/batik-ext/1.9.0-SNAPSHOT/maven-metadata.xml
Downloaded: https://repository.apache.org/content/repositories/snapshots/org/apache/xmlgraphics/batik-ext/1.9.0-SNAPSHOT/maven-metadata.xml
(784 B at 1.4 KB/sec)
Downloading: https://repository.apache.org/content/repositories/snapshots/org/apache/xmlgraphics/batik-xml/1.9.0-SNAPSHOT/maven-metadata.xml
Downloading: https://repository.jboss.org/nexus/content/repositories/thirdparty-releases/org/apache/xmlgraphics/batik-xml/1.9.0-SNAPSHOT/maven-metadata.xml
Downloaded: https://repository.apache.org/content/repositories/snapshots/org/apache/xmlgraphics/batik-xml/1.9.0-SNAPSHOT/maven-metadata.xml
(784 B at 1.4 KB/sec)
Downloading: https://repository.apache.org/content/repositories/snapshots/org/apache/xmlgraphics/batik-parser/1.9.0-SNAPSHOT/maven-metadata.xml
Downloading: https://repository.jboss.org/nexus/content/repositories/thirdparty-releases/org/apache/xmlgraphics/batik-parser/1.9.0-SNAPSHOT/maven-metadata.xml
Downloaded: https://repository.apache.org/content/repositories/snapshots/org/apache/xmlgraphics/batik-parser/1.9.0-SNAPSHOT/maven-metadata.xml
(787 B at 1.4 KB/sec)
Downloading: https://repository.apache.org/content/repositories/snapshots/org/apache/xmlgraphics/batik-svg-dom/1.9.0-SNAPSHOT/maven-metadata.xml
Downloading: https://repository.jboss.org/nexus/content/repositories/thirdparty-releases/org/apache/xmlgraphics/batik-svg-dom/1.9.0-SNAPSHOT/maven-metadata.xml
Downloaded: https://repository.apache.org/content/repositories/snapshots/org/apache/xmlgraphics/batik-svg-dom/1.9.0-SNAPSHOT/maven-metadata.xml
(788 B at 1.3 KB/sec)
Downloading: https://repository.apache.org/content/repositories/snapshots/org/apache/xmlgraphics/batik-bridge/1.9.0-SNAPSHOT/maven-metadata.xml
Downloading: https://repository.jboss.org/nexus/content/repositories/thirdparty-releases/org/apache/xmlgraphics/batik-bridge/1.9.0-SNAPSHOT/maven-metadata.xml
Downloaded: https://repository.apache.org/content/repositories/snapshots/org/apache/xmlgraphics/batik-bridge/1.9.0-SNAPSHOT/maven-metadata.xml
(787 B at 1.4 KB/sec)
Downloading: https://repository.apache.org/content/repositories/snapshots/org/apache/xmlgraphics/batik-gvt/1.9.0-SNAPSHOT/maven-metadata.xml
Downloading: https://repository.jboss.org/nexus/content/repositories/thirdparty-releases/org/apache/xmlgraphics/batik-gvt/1.9.0-SNAPSHOT/maven-metadata.xml
Downloaded: https://repository.apache.org/content/repositories/snapshots/org/apache/xmlgraphics/batik-gvt/1.9.0-SNAPSHOT/maven-metadata.xml
(784 B at 1.4 KB/sec)
Downloading: https://repository.apache.org/content/repositories/snapshots/org/apache/xmlgraphics/batik-script/1.9.0-SNAPSHOT/maven-metadata.xml
Downloading: https://repository.jboss.org/nexus/content/repositories/thirdparty-releases/org/apache/xmlgraphics/batik-script/1.9.0-SNAPSHOT/maven-metadata.xml
Downloaded: https://repository.apache.org/content/repositories/snapshots/org/apache/xmlgraphics/batik-script/1.9.0-SNAPSHOT/maven-metadata.xml
(787 B at 1.4 KB/sec)
Downloading: https://repository.apache.org/content/repositories/snapshots/org/apache/xmlgraphics/batik-extension/1.9.0-SNAPSHOT/maven-metadata.xml
Downloading: https://repository.jboss.org/nexus/content/repositories/thirdparty-releases/org/apache/xmlgraphics/batik-extension/1.9.0-SNAPSHOT/maven-metadata.xml
Downloaded: https://repository.apache.org/content/repositories/snapshots/org/apache/xmlgraphics/batik-extension/1.9.0-SNAPSHOT/maven-metadata.xml
(790 B at 1.4 KB/sec)
Downloading: https://repository.apache.org/content/repositories/snapshots/org/apache/xmlgraphics/batik-transcoder/1.9.0-SNAPSHOT/maven-metadata.xml
Downloading: https://repository.jboss.org/nexus/content/repositories/thirdparty-releases/org/apache/xmlgraphics/batik-transcoder/1.9.0-SNAPSHOT/maven-metadata.xml
Downloaded: https://repository.apache.org/content/repositories/snapshots/org/apache/xmlgraphics/batik-transcoder/1.9.0-SNAPSHOT/maven-metadata.xml
(791 B at 1.4 KB/sec)
Downloading: https://repository.jboss.org/nexus/content/repositories/thirdparty-releases/org/apache/xmlgraphics/batik-svggen/1.9.0-SNAPSHOT/maven-metadata.xml
Downloading: https://repository.apache.org/content/repositories/snapshots/org/apache/xmlgraphics/batik-svggen/1.9.0-SNAPSHOT/maven-metadata.xml
Downloaded: https://repository.apache.org/content/repositories/snapshots/org/apache/xmlgraphics/batik-svggen/1.9.0-SNAPSHOT/maven-metadata.xml
(787 B at 1.4 KB/sec)
[INFO] 
[INFO] --- maven-clean-plugin:2.4.1:clean (default-clean) @ fop-core ---
[INFO] Deleting <https://builds.apache.org/job/xmlgraphics-fop/ws/fop-core/target>
[INFO] 
[INFO] --- xml-maven-plugin:1.0.1:transform (generate-base14-fonts) @ fop-core ---
[INFO] Transforming file: <https://builds.apache.org/job/xmlgraphics-fop/ws/fop-core/src/main/codegen/fonts/CourierBoldOblique.xml>
[INFO] Transforming file: <https://builds.apache.org/job/xmlgraphics-fop/ws/fop-core/src/main/codegen/fonts/TimesRoman.xml>
[INFO] Transforming file: <https://builds.apache.org/job/xmlgraphics-fop/ws/fop-core/src/main/codegen/fonts/HelveticaBoldOblique.xml>
[INFO] Transforming file: <https://builds.apache.org/job/xmlgraphics-fop/ws/fop-core/src/main/codegen/fonts/CourierBold.xml>
[INFO] Transforming file: <https://builds.apache.org/job/xmlgraphics-fop/ws/fop-core/src/main/codegen/fonts/TimesBoldItalic.xml>
[INFO] Transforming file: <https://builds.apache.org/job/xmlgraphics-fop/ws/fop-core/src/main/codegen/fonts/HelveticaBold.xml>
[INFO] Transforming file: <https://builds.apache.org/job/xmlgraphics-fop/ws/fop-core/src/main/codegen/fonts/TimesItalic.xml>
[INFO] Transforming file: <https://builds.apache.org/job/xmlgraphics-fop/ws/fop-core/src/main/codegen/fonts/HelveticaOblique.xml>
[INFO] Transforming file: <https://builds.apache.org/job/xmlgraphics-fop/ws/fop-core/src/main/codegen/fonts/TimesBold.xml>
[INFO] Transforming file: <https://builds.apache.org/job/xmlgraphics-fop/ws/fop-core/src/main/codegen/fonts/Helvetica.xml>
[INFO] Transforming file: <https://builds.apache.org/job/xmlgraphics-fop/ws/fop-core/src/main/codegen/fonts/CourierOblique.xml>
[INFO] Transforming file: <https://builds.apache.org/job/xmlgraphics-fop/ws/fop-core/src/main/codegen/fonts/Courier.xml>
[INFO] Transformed 12 file(s).
[INFO] Transforming file: <https://builds.apache.org/job/xmlgraphics-fop/ws/fop-core/src/main/codegen/fonts/Symbol.xml>
[INFO] Transforming file: <https://builds.apache.org/job/xmlgraphics-fop/ws/fop-core/src/main/codegen/fonts/ZapfDingbats.xml>
[INFO] Transformed 2 file(s).
[INFO] 
[INFO] --- xml-maven-plugin:1.0.1:transform (codegen-fonts-encodings) @ fop-core ---
[INFO] Transforming file: <https://builds.apache.org/job/xmlgraphics-fop/ws/fop-core/src/main/codegen/fonts/encodings.xml>
[INFO] Transformed 1 file(s).
[INFO] 
[INFO] --- build-helper-maven-plugin:1.9.1:add-source (add-generated-sources) @ fop-core ---
[INFO] Source directory: <https://builds.apache.org/job/xmlgraphics-fop/ws/fop-core/target/generated-sources/main/java>
added.
[INFO] 
[INFO] --- maven-resources-plugin:2.5:resources (default-resources) @ fop-core ---
[debug] execute contextualize
[INFO] Using 'UTF-8' encoding to copy filtered resources.
[INFO] Copying 59 resources
[INFO] Copying 2 resources to META-INF
[INFO] 
[INFO] --- maven-compiler-plugin:3.1:compile (default-compile) @ fop-core ---
[INFO] Changes detected - recompiling the module!
[INFO] Compiling 1542 source files to <https://builds.apache.org/job/xmlgraphics-fop/ws/fop-core/target/classes>
[INFO] -------------------------------------------------------------
[ERROR] COMPILATION ERROR : 
[INFO] -------------------------------------------------------------
[ERROR] <https://builds.apache.org/job/xmlgraphics-fop/ws/fop-core/src/main/java/org/apache/fop/render/ps/PSFontUtils.java>:[917,19]
cannot find symbol
symbol  : method addFallbackFont(java.lang.String,org.apache.fop.fonts.Typeface)
location: interface org.apache.xmlgraphics.java2d.GeneralGraphics2DImagePainter
[INFO] 1 error
[INFO] -------------------------------------------------------------
[INFO]                                                                         
[INFO] ------------------------------------------------------------------------
[INFO] Skipping Apache FOP All-In-One
[INFO] This project has been banned from the build due to previous failures.
[INFO] ------------------------------------------------------------------------
[INFO]                                                                         
[INFO] ------------------------------------------------------------------------
[INFO] Skipping Apache FOP Sandbox
[INFO] This project has been banned from the build due to previous failures.
[INFO] ------------------------------------------------------------------------
[INFO]                                                                         
[INFO] ------------------------------------------------------------------------
[INFO] Skipping Apache FOP Servlet
[INFO] This project has been banned from the build due to previous failures.
[INFO] ------------------------------------------------------------------------
[INFO]                                                                         
[INFO] ------------------------------------------------------------------------
[INFO] Skipping Apache FOP Transcoder
[INFO] This project has been banned from the build due to previous failures.
[INFO] ------------------------------------------------------------------------
[INFO]                                                                         
[INFO] ------------------------------------------------------------------------
[INFO] Skipping Apache FOP Transcoder All-In-One
[INFO] This project has been banned from the build due to previous failures.
[INFO] ------------------------------------------------------------------------
[INFO] ------------------------------------------------------------------------
[INFO] Reactor Summary:
[INFO] 
[INFO] Apache FOP Parent ................................. SUCCESS [16.332s]
[INFO] Apache FOP Utilities .............................. SUCCESS [2:33.583s]
[INFO] Apache FOP Events ................................. SUCCESS [20.588s]
[INFO] Apache FOP Core ................................... FAILURE [27.768s]
[INFO] Apache FOP All-In-One ............................. SKIPPED
[INFO] Apache FOP Sandbox ................................ SKIPPED
[INFO] Apache FOP Servlet ................................ SKIPPED
[INFO] Apache FOP Transcoder ............................. SKIPPED
[INFO] Apache FOP Transcoder All-In-One .................. SKIPPED
[INFO] ------------------------------------------------------------------------
[INFO] BUILD FAILURE
[INFO] ------------------------------------------------------------------------
[INFO] Total time: 3:50.954s
[INFO] Finished at: Fri Oct 13 12:18:12 UTC 2017
[INFO] Final Memory: 59M/778M
[INFO] ------------------------------------------------------------------------
Waiting for Jenkins to finish collecting data
[ERROR] Failed to execute goal org.apache.maven.plugins:maven-compiler-plugin:3.1:compile
(default-compile) on project fop-core: Compilation failure
[ERROR] <https://builds.apache.org/job/xmlgraphics-fop/ws/fop-core/src/main/java/org/apache/fop/render/ps/PSFontUtils.java>:[917,19]
cannot find symbol
[ERROR] symbol  : method addFallbackFont(java.lang.String,org.apache.fop.fonts.Typeface)
[ERROR] location: interface org.apache.xmlgraphics.java2d.GeneralGraphics2DImagePainter
[ERROR] -> [Help 1]
org.apache.maven.lifecycle.LifecycleExecutionException: Failed to execute goal org.apache.maven.plugins:maven-compiler-plugin:3.1:compile
(default-compile) on project fop-core: Compilation failure
<https://builds.apache.org/job/xmlgraphics-fop/ws/fop-core/src/main/java/org/apache/fop/render/ps/PSFontUtils.java>:[917,19]
cannot find symbol
symbol  : method addFallbackFont(java.lang.String,org.apache.fop.fonts.Typeface)
location: interface org.apache.xmlgraphics.java2d.GeneralGraphics2DImagePainter

	at org.apache.maven.lifecycle.internal.MojoExecutor.execute(MojoExecutor.java:213)
	at org.apache.maven.lifecycle.internal.MojoExecutor.execute(MojoExecutor.java:153)
	at org.apache.maven.lifecycle.internal.MojoExecutor.execute(MojoExecutor.java:145)
	at org.apache.maven.lifecycle.internal.LifecycleModuleBuilder.buildProject(LifecycleModuleBuilder.java:84)
	at org.apache.maven.lifecycle.internal.LifecycleModuleBuilder.buildProject(LifecycleModuleBuilder.java:59)
	at org.apache.maven.lifecycle.internal.LifecycleStarter.singleThreadedBuild(LifecycleStarter.java:183)
	at org.apache.maven.lifecycle.internal.LifecycleStarter.execute(LifecycleStarter.java:161)
	at org.apache.maven.DefaultMaven.doExecute(DefaultMaven.java:320)
	at org.apache.maven.DefaultMaven.execute(DefaultMaven.java:156)
	at org.jvnet.hudson.maven3.launcher.Maven3Launcher.main(Maven3Launcher.java:117)
	at sun.reflect.NativeMethodAccessorImpl.invoke0(Native Method)
	at sun.reflect.NativeMethodAccessorImpl.invoke(NativeMethodAccessorImpl.java:62)
	at sun.reflect.DelegatingMethodAccessorImpl.invoke(DelegatingMethodAccessorImpl.java:43)
	at java.lang.reflect.Method.invoke(Method.java:498)
	at org.codehaus.plexus.classworlds.launcher.Launcher.launchStandard(Launcher.java:329)
	at org.codehaus.plexus.classworlds.launcher.Launcher.launch(Launcher.java:239)
	at org.jvnet.hudson.maven3.agent.Maven3Main.launch(Maven3Main.java:181)
	at sun.reflect.NativeMethodAccessorImpl.invoke0(Native Method)
	at sun.reflect.NativeMethodAccessorImpl.invoke(NativeMethodAccessorImpl.java:62)
	at sun.reflect.DelegatingMethodAccessorImpl.invoke(DelegatingMethodAccessorImpl.java:43)
	at java.lang.reflect.Method.invoke(Method.java:498)
	at hudson.maven.Maven3Builder.call(Maven3Builder.java:139)
	at hudson.maven.Maven3Builder.call(Maven3Builder.java:70)
	at hudson.remoting.UserRequest.perform(UserRequest.java:181)
	at hudson.remoting.UserRequest.perform(UserRequest.java:52)
	at hudson.remoting.Request$2.run(Request.java:336)
	at hudson.remoting.InterceptingExecutorService$1.call(InterceptingExecutorService.java:68)
	at java.util.concurrent.FutureTask.run(FutureTask.java:266)
	at java.util.concurrent.ThreadPoolExecutor.runWorker(ThreadPoolExecutor.java:1142)
	at java.util.concurrent.ThreadPoolExecutor$Worker.run(ThreadPoolExecutor.java:617)
	at java.lang.Thread.run(Thread.java:748)
Caused by: org.apache.maven.plugin.compiler.CompilationFailureException: Compilation failure
<https://builds.apache.org/job/xmlgraphics-fop/ws/fop-core/src/main/java/org/apache/fop/render/ps/PSFontUtils.java>:[917,19]
cannot find symbol
symbol  : method addFallbackFont(java.lang.String,org.apache.fop.fonts.Typeface)
location: interface org.apache.xmlgraphics.java2d.GeneralGraphics2DImagePainter

	at org.apache.maven.plugin.compiler.AbstractCompilerMojo.execute(AbstractCompilerMojo.java:858)
	at org.apache.maven.plugin.compiler.CompilerMojo.execute(CompilerMojo.java:129)
	at org.apache.maven.plugin.DefaultBuildPluginManager.executeMojo(DefaultBuildPluginManager.java:101)
	at org.apache.maven.lifecycle.internal.MojoExecutor.execute(MojoExecutor.java:209)
	... 30 more
[ERROR] 
[ERROR] Re-run Maven using the -X switch to enable full debug logging.
[ERROR] 
[ERROR] For more information about the errors and possible solutions, please read the following
articles:
[ERROR] [Help 1] http://cwiki.apache.org/confluence/display/MAVEN/MojoFailureException
[ERROR] 
[ERROR] After correcting the problems, you can resume the build with the command
[ERROR]   mvn <goals> -rf :fop-core
[JENKINS] Archiving <https://builds.apache.org/job/xmlgraphics-fop/ws/fop-sandbox/pom.xml>
to org.apache.xmlgraphics/fop-sandbox/2.3.0-SNAPSHOT/fop-sandbox-2.3.0-SNAPSHOT.pom
[JENKINS] Archiving <https://builds.apache.org/job/xmlgraphics-fop/ws/pom.xml> to org.apache.xmlgraphics/fop-parent/2.3.0-SNAPSHOT/fop-parent-2.3.0-SNAPSHOT.pom
[JENKINS] Archiving <https://builds.apache.org/job/xmlgraphics-fop/ws/fop-core/pom.xml>
to org.apache.xmlgraphics/fop-core/2.3.0-SNAPSHOT/fop-core-2.3.0-SNAPSHOT.pom
[JENKINS] Archiving <https://builds.apache.org/job/xmlgraphics-fop/ws/fop/pom.xml> to
org.apache.xmlgraphics/fop/2.3.0-SNAPSHOT/fop-2.3.0-SNAPSHOT.pom
[JENKINS] Archiving <https://builds.apache.org/job/xmlgraphics-fop/ws/fop-servlet/pom.xml>
to org.apache.xmlgraphics/fop-servlet/2.3.0-SNAPSHOT/fop-servlet-2.3.0-SNAPSHOT.pom
[JENKINS] Archiving <https://builds.apache.org/job/xmlgraphics-fop/ws/fop-transcoder-allinone/pom.xml>
to org.apache.xmlgraphics/fop-transcoder-allinone/2.3.0-SNAPSHOT/fop-transcoder-allinone-2.3.0-SNAPSHOT.pom
[JENKINS] Archiving <https://builds.apache.org/job/xmlgraphics-fop/ws/fop-util/pom.xml>
to org.apache.xmlgraphics/fop-util/2.3.0-SNAPSHOT/fop-util-2.3.0-SNAPSHOT.pom
[JENKINS] Archiving <https://builds.apache.org/job/xmlgraphics-fop/ws/fop-util/target/fop-util-2.3.0-SNAPSHOT.jar>
to org.apache.xmlgraphics/fop-util/2.3.0-SNAPSHOT/fop-util-2.3.0-SNAPSHOT.jar
[JENKINS] Archiving <https://builds.apache.org/job/xmlgraphics-fop/ws/fop-events/pom.xml>
to org.apache.xmlgraphics/fop-events/2.3.0-SNAPSHOT/fop-events-2.3.0-SNAPSHOT.pom
[JENKINS] Archiving <https://builds.apache.org/job/xmlgraphics-fop/ws/fop-events/target/fop-events-2.3.0-SNAPSHOT.jar>
to org.apache.xmlgraphics/fop-events/2.3.0-SNAPSHOT/fop-events-2.3.0-SNAPSHOT.jar
[JENKINS] Archiving <https://builds.apache.org/job/xmlgraphics-fop/ws/fop-transcoder/pom.xml>
to org.apache.xmlgraphics/fop-transcoder/2.3.0-SNAPSHOT/fop-transcoder-2.3.0-SNAPSHOT.pom
[CHECKSTYLE] Plug-in Result: Success - no threshold has been exceeded
[CHECKSTYLE] Plug-in Result: Success - no threshold has been exceeded
[FINDBUGS] Plug-in Result: Success - no threshold has been exceeded
[FINDBUGS] Plug-in Result: Success - no threshold has been exceeded
channel stopped

Mime
View raw message