xmlgraphics-fop-dev mailing list archives

Site index · List index
Message view « Date » · « Thread »
Top « Date » · « Thread »
From FOP Gump Nightly Build <fop-...@xmlgraphics.apache.org>
Subject [GUMP@vmgump]: Project xml-fop-test (in module xml-fop) failed
Date Wed, 12 Nov 2014 01:36:43 GMT
To whom it may engage...
        
This is an automated request, but not an unsolicited one. For 
more information please visit http://gump.apache.org/nagged.html, 
and/or contact the folk at general@gump.apache.org.

Project xml-fop-test has an issue affecting its community integration.
This issue affects 1 projects,
 and has been outstanding for 2 runs.
The current state of this project is 'Failed', with reason 'Build Failed'.
For reference only, the following projects are affected by this:
    - xml-fop-test :  XSL-FO (Formatting Objects) processor


Full details are available at:
    http://vmgump.apache.org/gump/public/xml-fop/xml-fop-test/index.html

That said, some information snippets are provided here.

The following annotations (debug/informational/warning/error messages) were provided:
 -DEBUG- Dependency on checkstyle exists, no need to add for property checkstyle.location.
 -INFO- Failed with reason build failed
 -INFO- Project Reports in: /srv/gump/public/workspace/xml-fop/build/test-reports



The following work was performed:
http://vmgump.apache.org/gump/public/xml-fop/xml-fop-test/gump_work/build_xml-fop_xml-fop-test.html
Work Name: build_xml-fop_xml-fop-test (Type: Build)
Work ended in a state of : Failed
Elapsed: 3 mins 28 secs
Command Line: /usr/lib/jvm/java-8-oracle/bin/java -Djava.awt.headless=true -Dbuild.sysclasspath=only
-Dant.build.clonevm=true -Xbootclasspath/p:/srv/gump/public/workspace/xml-xalan/build/xalan-unbundled.jar:/srv/gump/public/workspace/xml-xalan/build/serializer.jar:/srv/gump/public/workspace/xml-commons/java/external/build/xml-apis.jar:/srv/gump/public/workspace/xml-xerces2/build/xercesImpl.jar
org.apache.tools.ant.Main -Dgump.merge=/srv/gump/public/gump/work/merge.xml -Dcheckstyle.location=/srv/gump/public/workspace/checkstyle/target/checkstyle-6.1-SNAPSHOT.jar
gump-test 
[Working Directory: /srv/gump/public/workspace/xml-fop]
CLASSPATH: /usr/lib/jvm/java-8-oracle/lib/tools.jar:/srv/gump/public/workspace/xml-fop/build/classes:/srv/gump/public/workspace/xml-fop/build/codegen-classes:/srv/gump/public/workspace/xml-fop/build/test-classes:/srv/gump/public/workspace/xml-fop/lib/build/asm-3.1.jar:/srv/gump/public/workspace/xml-fop/lib/build/mockito-core-1.8.5.jar:/srv/gump/public/workspace/xml-fop/lib/build/hamcrest.core-1.1.0.jar:/srv/gump/public/workspace/xml-fop/lib/build/objenesis-1.0.0.jar:/srv/gump/public/workspace/xml-fop/lib/build/qdox-1.12.jar:/srv/gump/public/workspace/xml-fop/lib/fontbox-1.8.5.jar:/srv/gump/public/workspace/checkstyle/target/checkstyle-6.1-SNAPSHOT.jar:/srv/gump/packages/antlr/antlr-3.1.3.jar:/srv/gump/public/workspace/apache-commons/beanutils/dist/commons-beanutils-20141112.jar:/srv/gump/public/workspace/apache-commons/cli/target/commons-cli-1.3-SNAPSHOT.jar:/srv/gump/packages/commons-collections3/commons-collections-3.2.1.jar:/srv/gump/public/workspace/apache-commons/exec/target/com
 mons-exec-1.3.1-SNAPSHOT.jar:/srv/gump/public/workspace/apache-commons/logging/target/commons-logging-20141112.jar:/srv/gump/public/workspace/apache-commons/logging/target/commons-logging-api-20141112.jar:/srv/gump/public/workspace/apache-commons/validator/dist/commons-validator-20141112.jar:/srv/gump/packages/guava/guava-18.0.jar:/srv/gump/public/workspace/xml-fop/build/fop.jar:/srv/gump/public/workspace/xml-fop/build/fop-sandbox.jar:/srv/gump/public/workspace/ant/dist/lib/ant.jar:/srv/gump/public/workspace/ant/dist/lib/ant-launcher.jar:/srv/gump/public/workspace/ant/dist/lib/ant-jmf.jar:/srv/gump/public/workspace/ant/dist/lib/ant-junit.jar:/srv/gump/public/workspace/ant/dist/lib/ant-junit4.jar:/srv/gump/public/workspace/ant/dist/lib/ant-swing.jar:/srv/gump/public/workspace/ant/dist/lib/ant-apache-resolver.jar:/srv/gump/public/workspace/ant/dist/lib/ant-apache-xalan2.jar:/srv/gump/public/workspace/xml-commons/java/build/resolver.jar:/srv/gump/packages/apache-attic/avalon-framework-
 api-4.3.jar:/srv/gump/packages/apache-attic/avalon-framework-impl-4.3.jar:/srv/gump/public/workspace/apache-commons/io/target/commons-io-2.5-SNAPSHOT.jar:/srv/gump/public/workspace/jakarta-servletapi-5/jsr154/dist/lib/servlet-api.jar:/srv/gump/public/workspace/xml-commons/java/external/build/xml-apis-ext.jar:/srv/gump/public/workspace/xml-batik/batik-20141112/batik-slideshow.jar:/srv/gump/public/workspace/xml-batik/batik-20141112/batik-svgpp.jar:/srv/gump/public/workspace/xml-batik/batik-20141112/lib/batik-anim.jar:/srv/gump/public/workspace/xml-batik/batik-20141112/lib/batik-awt-util.jar:/srv/gump/public/workspace/xml-batik/batik-20141112/lib/batik-bridge.jar:/srv/gump/public/workspace/xml-batik/batik-20141112/lib/batik-codec.jar:/srv/gump/public/workspace/xml-batik/batik-20141112/lib/batik-css.jar:/srv/gump/public/workspace/xml-batik/batik-20141112/lib/batik-dom.jar:/srv/gump/public/workspace/xml-batik/batik-20141112/lib/batik-ext.jar:/srv/gump/public/workspace/xml-batik/batik-201
 41112/lib/batik-extension.jar:/srv/gump/public/workspace/xml-batik/batik-20141112/lib/batik-gui-util.jar:/srv/gump/public/workspace/xml-batik/batik-20141112/lib/batik-gvt.jar:/srv/gump/public/workspace/xml-batik/batik-20141112/lib/batik-parser.jar:/srv/gump/public/workspace/xml-batik/batik-20141112/lib/batik-script.jar:/srv/gump/public/workspace/xml-batik/batik-20141112/lib/batik-svg-dom.jar:/srv/gump/public/workspace/xml-batik/batik-20141112/lib/batik-svggen.jar:/srv/gump/public/workspace/xml-batik/batik-20141112/lib/batik-swing.jar:/srv/gump/public/workspace/xml-batik/batik-20141112/lib/batik-transcoder.jar:/srv/gump/public/workspace/xml-batik/batik-20141112/lib/batik-util.jar:/srv/gump/public/workspace/xml-batik/batik-20141112/lib/batik-xml.jar:/srv/gump/public/workspace/xmlgraphics-commons/build/xmlgraphics-commons-20141112.jar:/srv/gump/packages/fop-hyph/fop-hyph.jar:/srv/gump/public/workspace/junit/target/junit-4.12-SNAPSHOT.jar:/srv/gump/public/workspace/objenesis/main/target
 /objenesis-2.2-SNAPSHOT.jar:/srv/gump/public/workspace/xmlunit/build/java/lib/xmlunit-sumo-20141112.jar
---------------------------------------------
    [junit] Tests run: 6, Failures: 0, Errors: 0, Skipped: 0, Time elapsed: 0.013 sec
    [junit] 
    [junit] Testsuite: org.apache.fop.pdf.PDFArrayTestCase
    [junit] Tests run: 15, Failures: 0, Errors: 0, Skipped: 0, Time elapsed: 0.024 sec
    [junit] 
    [junit] Testsuite: org.apache.fop.pdf.PDFDestsTestCase
    [junit] Tests run: 10, Failures: 0, Errors: 0, Skipped: 0, Time elapsed: 0.016 sec
    [junit] 
    [junit] Testsuite: org.apache.fop.pdf.PDFDictionaryTestCase
    [junit] Tests run: 13, Failures: 0, Errors: 0, Skipped: 0, Time elapsed: 0.022 sec
    [junit] 
    [junit] Testsuite: org.apache.fop.pdf.PDFDocumentGraphics2DTestCase
    [junit] Tests run: 1, Failures: 0, Errors: 0, Skipped: 0, Time elapsed: 0.01 sec
    [junit] 
    [junit] Testsuite: org.apache.fop.pdf.PDFDocumentTestCase
    [junit] Tests run: 1, Failures: 0, Errors: 0, Skipped: 0, Time elapsed: 0.001 sec
    [junit] 
    [junit] Testsuite: org.apache.fop.pdf.PDFEncodingTestCase
    [junit] Tests run: 4, Failures: 0, Errors: 0, Skipped: 0, Time elapsed: 0.007 sec
    [junit] 
    [junit] Testsuite: org.apache.fop.pdf.PDFEncryptionJCETestCase
    [junit] Tests run: 11, Failures: 0, Errors: 1, Skipped: 0, Time elapsed: 1.379 sec
    [junit] 
    [junit] Testcase: testAES256(org.apache.fop.pdf.PDFEncryptionJCETestCase):	Caused an ERROR
    [junit] java.security.InvalidKeyException: Illegal key size
    [junit] java.lang.IllegalStateException: java.security.InvalidKeyException: Illegal key
size
    [junit] 	at org.apache.fop.pdf.PDFEncryptionJCE.initCipher(PDFEncryptionJCE.java:792)
    [junit] 	at org.apache.fop.pdf.PDFEncryptionJCE.encryptWithKey(PDFEncryptionJCE.java:759)
    [junit] 	at org.apache.fop.pdf.PDFEncryptionJCE.access$800(PDFEncryptionJCE.java:43)
    [junit] 	at org.apache.fop.pdf.PDFEncryptionJCE$Rev5Engine.computeUEValue(PDFEncryptionJCE.java:578)
    [junit] 	at org.apache.fop.pdf.PDFEncryptionJCE$Rev5Engine.run(PDFEncryptionJCE.java:476)
    [junit] 	at org.apache.fop.pdf.PDFEncryptionJCE$EncryptionInitializer.init(PDFEncryptionJCE.java:84)
    [junit] 	at org.apache.fop.pdf.PDFEncryptionJCE.<init>(PDFEncryptionJCE.java:682)
    [junit] 	at org.apache.fop.pdf.PDFEncryptionJCE.make(PDFEncryptionJCE.java:696)
    [junit] 	at org.apache.fop.pdf.PDFEncryptionJCETestCase.createEncryptionObject(PDFEncryptionJCETestCase.java:611)
    [junit] 	at org.apache.fop.pdf.PDFEncryptionJCETestCase.testAES256(PDFEncryptionJCETestCase.java:468)
    [junit] Caused by: java.security.InvalidKeyException: Illegal key size
    [junit] 	at javax.crypto.Cipher.checkCryptoPerm(Cipher.java:1034)
    [junit] 	at javax.crypto.Cipher.implInit(Cipher.java:800)
    [junit] 	at javax.crypto.Cipher.chooseProvider(Cipher.java:859)
    [junit] 	at javax.crypto.Cipher.init(Cipher.java:1370)
    [junit] 	at javax.crypto.Cipher.init(Cipher.java:1301)
    [junit] 	at org.apache.fop.pdf.PDFEncryptionJCE.initCipher(PDFEncryptionJCE.java:789)
    [junit] 
    [junit] 

BUILD FAILED
/srv/gump/public/workspace/xml-fop/build.xml:833: Tests failed

Total time: 3 minutes 27 seconds
---------------------------------------------

To subscribe to this information via syndicated feeds:
- RSS: http://vmgump.apache.org/gump/public/xml-fop/xml-fop-test/rss.xml
- Atom: http://vmgump.apache.org/gump/public/xml-fop/xml-fop-test/atom.xml

============================== Gump Tracking Only ===
Produced by Apache Gump(TM) version 2.3.
Gump Run 20141112000005, vmgump.apache.org:vmgump:20141112000005
Gump E-mail Identifier (unique within run) #9.

--
Apache Gump
http://gump.apache.org/ [Instance: vmgump]

Mime
View raw message