portals-jetspeed-dev mailing list archives

Site index · List index
Message view « Date » · « Thread »
Top « Date » · « Thread »
From "Stijn de Witt" <Stijn.deW...@bergland-it.nl>
Subject TestRdbmsPolicy FAILED when trying to build J2
Date Thu, 22 Jul 2004 20:08:46 GMT
Hi,

I've been trying to compile jetspeed 2, but the build fails. Could any of
the experts here at the dev list maybe shed some light on this? I have been
working with Jetspeed 1 for a while now, but Jetspeed 2 is new to me...


C:\bit\dev\project2\jetspeed2>maven allClean allBuild
 __  __
|  \/  |__ _Apache__ ___
| |\/| / _` \ V / -_) ' \  ~ intelligent projects ~
|_|  |_\__,_|\_/\___|_||_|  v. 1.0

Starting the reactor...
Our processing order:
Java Portlet API
Jetspeed-2 Core API
Jetspeed-2 Portal Commons

<SNIP>

allBuild:
check.required.properties:

torque:init:

db.scripts.gen:
    [echo] Generating SQL schema creation scripts for HSQLDB

<SNIP>

db.create:
db.execute:
    [sql] Executing file:
C:\bit\dev\project2\jetspeed2\target\src\sql\hsql\phase3ojb-schema.sql

<SNIP>

Starting the reactor...
Our processing order:
Java Portlet API
+----------------------------------------
| Build and Install the Portlet API jar Java Portlet API
| Memory: 34M/60M
+----------------------------------------
Probeer commons-jelly-tags-xml-20040613.030723.jar te downloaden.
33K downloaded
Probeer commons-net-1.1.0.jar te downloaden.
139K downloaded
Plugin 'maven-deploy-plugin' in project 'Java Portlet API' is not available

// ERROR ?  ^

build:start:

java:prepare-filesystem:
    [mkdir] Created dir:
C:\bit\dev\project2\jetspeed2\portlet-api\target\classes

java:compile:
    [echo] Compiling to
C:\bit\dev\project2\jetspeed2\portlet-api/target/classes
    [javac] Compiling 27 source files to
C:\bit\dev\project2\jetspeed2\portlet-api\target\classes

<SNIP>

jar:jar:
    [jar] Building jar:
C:\bit\dev\project2\jetspeed2\components\registry\target\jetspeed-registry-2
.0-a1-dev.jar
Copying: from
'C:\bit\dev\project2\jetspeed2\components\registry\target\jetspeed-registry-
2.0-a1-dev
.jar' to: 'C:\Documents and
Settings\Administrator.STORM\.maven\repository\jetspeed2\jars\jetspeed-r
egistry-2.0-a1-dev.jar'
Copying: from
'C:\bit\dev\project2\jetspeed2\components\registry\project.xml' to:
'C:\Documents and
Settings\Administrator.STORM\.maven\repository\jetspeed2\poms\jetspeed-regis
try-2.0-a1-dev.pom'
Starting the reactor...
Our processing order:
Jetspeed-2 Security Components
+----------------------------------------
| Build and Install the Security Components jar Jetspeed-2 Security
Components
| Memory: 46M/61M
+----------------------------------------
Plugin 'maven-deploy-plugin' in project 'Jetspeed-2 Security Components' is
not available

jar:install:

build:end:

build:start:

java:prepare-filesystem:
    [mkdir] Created dir:
C:\bit\dev\project2\jetspeed2\components\security\target\classes

java:compile:
    [echo] Compiling to
C:\bit\dev\project2\jetspeed2\components\security/target/classes
    [javac] Compiling 26 source files to
C:\bit\dev\project2\jetspeed2\components\security\target\cl
asses

java:jar-resources:
Copying 4 files to
C:\bit\dev\project2\jetspeed2\components\security\target\classes
Copied 1 empty directory to
C:\bit\dev\project2\jetspeed2\components\security\target\classes

test:prepare-filesystem:
    [mkdir] Created dir:
C:\bit\dev\project2\jetspeed2\components\security\target\test-classes
    [mkdir] Created dir:
C:\bit\dev\project2\jetspeed2\components\security\target\test-reports

test:test-resources:
Copying 5 files to
C:\bit\dev\project2\jetspeed2\components\security\target\test-classes
Copied 4 empty directories to
C:\bit\dev\project2\jetspeed2\components\security\target\test-classes
Copying 4 files to
C:\bit\dev\project2\jetspeed2\components\security\target\test-classes

test:compile:
    [javac] Compiling 10 source files to
C:\bit\dev\project2\jetspeed2\components\security\target\te
st-classes

test:test:
dbSetup:
    [copy] Copying 1 file to
C:\bit\dev\project2\jetspeed2\components\security\target\test-classes

    [junit] Running org.apache.jetspeed.security.TestAggregationHierarchy
    [junit] Tests run: 1, Failures: 0, Errors: 0, Time elapsed: 2,5 sec
    [junit] Running org.apache.jetspeed.security.TestGeneralizationHierarchy
    [junit] Tests run: 1, Failures: 0, Errors: 0, Time elapsed: 2,484 sec
    [junit] Running org.apache.jetspeed.security.TestGroupManager
    [junit] Tests run: 8, Failures: 0, Errors: 0, Time elapsed: 3,938 sec
    [junit] Running org.apache.jetspeed.security.TestLoginModule
    [junit] Tests run: 2, Failures: 0, Errors: 0, Time elapsed: 2,407 sec
    [junit] Running org.apache.jetspeed.security.TestPermissionManager
    [junit] Tests run: 6, Failures: 0, Errors: 0, Time elapsed: 3,75 sec
    [junit] Running org.apache.jetspeed.security.TestRdbmsPolicy
    [junit] Tests run: 1, Failures: 1, Errors: 0, Time elapsed: 2,282 sec
    [junit] [ERROR] TEST org.apache.jetspeed.security.TestRdbmsPolicy FAILED
    [junit] Running org.apache.jetspeed.security.TestRoleManager
    [junit] Tests run: 12, Failures: 0, Errors: 0, Time elapsed: 4,75 sec
    [junit] Running org.apache.jetspeed.security.TestSecurityHelper
    [junit] Tests run: 1, Failures: 0, Errors: 0, Time elapsed: 1,782 sec
    [junit] Running org.apache.jetspeed.security.TestUserManager
    [junit] Tests run: 3, Failures: 1, Errors: 0, Time elapsed: 3,015 sec
    [junit] [ERROR] TEST org.apache.jetspeed.security.TestUserManager FAILED

BUILD FAILED
File...... C:\bit\dev\project2\jetspeed2\maven.xml
Element... maven:reactor
Line...... 235
Column.... 40
Unable to obtain goal [test:test] -- C:\Documents and
Settings\Administrator.STORM\.maven\cache\mave
n-test-plugin-1.6.2\plugin.jelly:181:54: <fail> There were test failures.
Total time: 19 minutes 14 seconds
Finished at: Thu Jul 22 21:40:16 CEST 2004



---------------------------------------------------------------------
To unsubscribe, e-mail: jetspeed-dev-unsubscribe@jakarta.apache.org
For additional commands, e-mail: jetspeed-dev-help@jakarta.apache.org


Mime
View raw message