mesos-reviews mailing list archives

Site index · List index
Message view « Date » · « Thread »
Top « Date » · « Thread »
From Mesos Reviewbot Windows <revi...@mesos.apache.org>
Subject Re: Review Request 70133: Removed unnecessary accept filters in SLRP tests.
Date Tue, 23 Apr 2019 12:26:38 GMT

-----------------------------------------------------------
This is an automatically generated e-mail. To reply, visit:
https://reviews.apache.org/r/70133/#review214813
-----------------------------------------------------------



FAIL: Some of the unit tests failed. Please check the relevant logs.

Reviews applied: `['70132', '70521', '70133']`

Failed command: `Start-MesosCITesting`

All the build artifacts available at: http://dcos-win.westus2.cloudapp.azure.com/artifacts/mesos-reviewbot-testing/3242/mesos-review-70133

Relevant logs:

- [mesos-tests.log](http://dcos-win.westus2.cloudapp.azure.com/artifacts/mesos-reviewbot-testing/3242/mesos-review-70133/logs/mesos-tests.log):

```
I0423 12:26:20.012372 74948 master.cpp:3333] Disconnecting agent 0a068c4b-f399-4887-a3c9-ae3eea705cfc-S0
at slave(501)@192.10.1.4:52137 (windows-01.chtsmhjxogyevckjfayqqcnjda.xx.internal.cloudapp.net)
I0423 12:26:20.012372 74948 master.cpp:3352] Deactivating agent 0a068c4b-f399-4887-a3c9-ae3eea705cfc-S0
at slave(501)@192.10.1.4:52137 (windows-01.chtsmhjxogyevckjfayqqcnjda.xx.internal.cloudapp.net)
I0423 12:26:20.013376 71464 hierarchical.cpp:392] Removed framework 0a068c4b-f399-4887-a3c9-ae3eea705cfc-0000
I0423 12:26:20.013376 71464 hierarchical.cpp:829] Agent 0a068c4b-f399-4887-a3c9-ae3eea705cfc-S0
deactivated
I0423 12:26:20.014398 72056 containerizer.cpp:2576] Destroying container b00a3bb1-9df7-4322-ab24-ad0ff75733a5
in RUNNING state
I0423 12:26:20.014398 72056 containerizer.cpp:3278] Transitioning the state of container b00a3bb1-9df7-4322-ab24-ad0ff75733a5
from RUNNING to DESTROYING
I0423 12:26:20.014398 72056 launcher.cpp:161] Asked to destroy container b00a3bb1-9df7-4322-ab24-ad0ff75733a5
W0423 12:26:20.015440 73000 process.cpp:1423] Failed to recv on socket WindowsFD::Type::SOCKET=1184
to peer '192.10.1.4:54519': IO failed with error code: The specified network name is no longer
available.

W0423 12:26:20.016374 73000 process.cpp:838] Failed to recv on socket WindowsFD::Type::SOCKET=1224
to peer '192.10.1.4:54520': IO failed with e[       OK ] IsolationFlag/MemoryIsolatorTest.ROOT_MemUsage/0
(794 ms)
[----------] 1 test from IsolationFlag/MemoryIsolatorTest (812 ms total)

[----------] Global test environment tear-down
[==========] 1162 tests from 109 test cases ran. (588932 ms total)
[  PASSED  ] 1159 tests.
[  FAILED  ] 3 tests, listed below:
[  FAILED  ] DockerFetcherPluginTest.INTERNET_CURL_FetchManifest
[  FAILED  ] DockerFetcherPluginTest.INTERNET_CURL_FetchImage
[  FAILED  ] DockerFetcherPluginTest.INTERNET_CURL_InvokeFetchByName

 3 FAILED TESTS
  YOU HAVE 233 DISABLED TESTS

rror code: The specified network name is no longer available.

I0423 12:26:20.085477 74172 containerizer.cpp:3117] Container b00a3bb1-9df7-4322-ab24-ad0ff75733a5
has exited
I0423 12:26:20.119426 74172 master.cpp:1135] Master terminating
I0423 12:26:20.120602 74728 hierarchical.cpp:680] Removed agent 0a068c4b-f399-4887-a3c9-ae3eea705cfc-S0
I0423 12:26:21.104396 73000 process.cpp:927] Stopped the socket accept loop
```

- Mesos Reviewbot Windows


On April 9, 2019, 9:21 p.m., Chun-Hung Hsiao wrote:
> 
> -----------------------------------------------------------
> This is an automatically generated e-mail. To reply, visit:
> https://reviews.apache.org/r/70133/
> -----------------------------------------------------------
> 
> (Updated April 9, 2019, 9:21 p.m.)
> 
> 
> Review request for mesos, Benjamin Bannier and Meng Zhu.
> 
> 
> Repository: mesos
> 
> 
> Description
> -------
> 
> Removed unnecessary accept filters in SLRP tests.
> 
> 
> Diffs
> -----
> 
>   src/tests/storage_local_resource_provider_tests.cpp bd35150200a23ba57408f5d64a975f8a2f062018

> 
> 
> Diff: https://reviews.apache.org/r/70133/diff/2/
> 
> 
> Testing
> -------
> 
> `sudo make check`
> 
> Especially, tested that each of the three modified tests finishes in 5 seconds.
> 
> 
> Thanks,
> 
> Chun-Hung Hsiao
> 
>


Mime
  • Unnamed multipart/alternative (inline, None, 0 bytes)
View raw message