mesos-reviews mailing list archives

Site index · List index
Message view « Date » · « Thread »
Top « Date » · « Thread »
From Mesos Reviewbot Windows <revi...@mesos.apache.org>
Subject Re: Review Request 67059: Ported all support scripts to Python 3.
Date Thu, 24 May 2018 16:12:55 GMT

-----------------------------------------------------------
This is an automatically generated e-mail. To reply, visit:
https://reviews.apache.org/r/67059/#review203775
-----------------------------------------------------------



FAIL: Some of the unit tests failed. Please check the relevant logs.

Reviews applied: `['67247', '67099', '67282', '67059']`

Failed command: `Start-MesosCITesting`

All the build artifacts available at: http://dcos-win.westus.cloudapp.azure.com/mesos-build/review/67059

Relevant logs:

- [mesos-tests-stdout.log](http://dcos-win.westus.cloudapp.azure.com/mesos-build/review/67059/logs/mesos-tests-stdout.log):

```
[       OK ] Endpoint/SlaveEndpointTest.NoAuthorizer/2 (105 ms)
[----------] 9 tests from Endpoint/SlaveEndpointTest (1000 ms total)

[----------] 2 tests from ContainerizerType/DefaultContainerDNSFlagTest
[ RUN      ] ContainerizerType/DefaultContainerDNSFlagTest.ValidateFlag/0
[       OK ] ContainerizerType/DefaultContainerDNSFlagTest.ValidateFlag/0 (35 ms)
[ RUN      ] ContainerizerType/DefaultContainerDNSFlagTest.ValidateFlag/1
[       OK ] ContainerizerType/DefaultContainerDNSFlagTest.ValidateFlag/1 (37 ms)
[----------] 2 tests from ContainerizerType/DefaultContainerDNSFlagTest (73 ms total)

[----------] 1 test from IsolationFlag/CpuIsolatorTest
[ RUN      ] IsolationFlag/CpuIsolatorTest.ROOT_UserCpuUsage/0
[       OK ] IsolationFlag/CpuIsolatorTest.ROOT_UserCpuUsage/0 (769 ms)
[----------] 1 test from IsolationFlag/CpuIsolatorTest (793 ms total)

[----------] 1 test from IsolationFlag/MemoryIsolatorTest
[ RUN      ] IsolationFlag/MemoryIsolatorTest.ROOT_MemUsage/0
[       OK ] IsolationFlag/MemoryIsolatorTest.ROOT_MemUsage/0 (734 ms)
[----------] 1 test from IsolationFlag/MemoryIsolatorTest (759 ms total)

[----------] Global test environment tear-down
[==========] 981 tests from 95 test cases ran. (440516 ms total)
[  PASSED  ] 980 tests.
[  FAILED  ] 1 test, listed below:
[  FAILED  ] DockerContainerizerHealthCheckTest.ROOT_DOCKER_DockerHealthStatusChange

 1 FAILED TEST
  YOU HAVE 220 DISABLED TESTS

```

- [mesos-tests-stderr.log](http://dcos-win.westus.cloudapp.azure.com/mesos-build/review/67059/logs/mesos-tests-stderr.log):

```
I0524 16:12:37.297600 21032 master.cpp:10843] Updating the state of task 1d5d0213-21ca-4cfe-994d-eb62f07f5648
oI0524 16:12:37.140612 19832 exec.cpp:162] Version: 1.7.0
I0524 16:12:37.165616 22184 exec.cpp:236] Executor registered on agent cef0344d-7a02-417f-aadb-7eb5013cc9b4-S0
I0524 16:12:37.168619 18068 executor.cpp:178] Received SUBSCRIBED event
I0524 16:12:37.173619 18068 executor.cpp:182] Subscribed executor on windows-02.enofukwu14ruplxn0gs3yzmsgf.xx.internal.cloudapp.net
I0524 16:12:37.173619 18068 executor.cpp:178] Received LAUNCH event
I0524 16:12:37.178612 18068 executor.cpp:665] Starting task 1d5d0213-21ca-4cfe-994d-eb62f07f5648
I0524 16:12:37.256613 18068 executor.cpp:485] Running 'D:\DCOS\mesos\src\mesos-containerizer.exe
launch <POSSIBLY-SENSITIVE-DATA>'
I0524 16:12:37.272620 18068 executor.cpp:678] Forked command at 16964
I0524 16:12:37.299602 18816 exec.cpp:445] Executor asked to shutdown
I0524 16:12:37.300601  8596 executor.cpp:178] Received SHUTDOWN event
I0524 16:12:37.300601  8596 executor.cpp:781] Shutting down
I0524 16:12:37.300601  8596 executor.cpp:894] Sending SIGTERM to process tree at pid 16f framework
cef0344d-7a02-417f-aadb-7eb5013cc9b4-0000 (latest state: TASK_KILLED, status update state:
TASK_KILLED)
I0524 16:12:37.297600 16972 slave.cpp:3935] Shutting down framework cef0344d-7a02-417f-aadb-7eb5013cc9b4-0000
I0524 16:12:37.298601 16972 slave.cpp:6656] Shutting down executor '1d5d0213-21ca-4cfe-994d-eb62f07f5648'
of framework cef0344d-7a02-417f-aadb-7eb5013cc9b4-0000 at executor(1)@192.10.1.6:49351
I0524 16:12:37.299602 16972 slave.cpp:929] Agent terminating
W0524 16:12:37.300601 16972 slave.cpp:3931] Ignoring shutdown framework cef0344d-7a02-417f-aadb-7eb5013cc9b4-0000
because it is terminating
I0524 16:12:37.300601 21032 master.cpp:10942] Removing task 1d5d0213-21ca-4cfe-994d-eb62f07f5648
with resources cpus(allocated: *):4; mem(allocated: *):2048; disk(allocated: *):1024; ports(allocated:
*):[31000-32000] of framework cef0344d-7a02-417f-aadb-7eb5013cc9b4-0000 on agent cef0344d-7a02-417f-aadb-7eb5013cc9b4-S0
at slave(448)@192.10.1.6:49330 (windows-02.enofukwu14ruplxn0gs3yzmsgf.xx.internal.cloudapp.net)
I0524 16:12:37.304608 21032 master.cpp:1293] Agent cef0344d-7a02-417f-aadb-7eb5013cc9b4-S0
at slave(448)@192.10.1.6:49330 (windows-02.enofukwu14ruplxn0gs3yzmsgf.xx.internal.cloudapp.net)
disconnected
I0524 16:12:37.304608 21032 master.cpp:3303] Disconnecting agent cef0344d-7a02-417f-aadb-7eb5013cc9b4-S0
at slave(448)@192.10.1.6:49330 (windows-02.enofukwu14ruplxn0gs3yzmsgf.xx.internal.cloudapp.net)
I0524 16:12:37.304608 21032 master.cpp:3322] Deactivating agent cef0344d-7a02-417f-aadb-7eb5013cc9b4-S0
at slave(448)@192.10.1.6:49330 (windows-02.enofukwu14ruplxn0gs3yzmsgf.xx.internal.cloudapp.net)
I0524 16:12:37.304608 16972 hierarchical.cpp:344] Removed framework cef0344d-7a02-417f-aadb-7eb5013cc9b4-0000
I0524 16:12:37.304608 15800 containerizer.cpp:2401] Destroying container 423c4d05-c103-4aa7-be2e-f66783c37bcb
in RUNNING state
I0524 16:12:37.304608 16972 hierarchical.cpp:766] Agent cef0344d-7a02-417f-aadb-7eb5013cc9b4-S0
deactivated
I0524 16:12:37.304608 15800 containerizer.cpp:3015] Transitioning the state of container 423c4d05-c103-4aa7-be2e-f66783c37bcb
from RUNNING to DESTROYING
I0524 16:12:37.306617 15800 launcher.cpp:156] Asked to destroy container 423c4d05-c103-4aa7-be2e-f66783c37bcb
I0524 16:12:37.385771 21368 containerizer.cpp:2854] Container 423c4d05-c103-4aa7-be2e-f66783c37bcb
has exited
I0524 16:12:37.416292 18484 master.cpp:1135] Master terminating
I0524 16:12:37.417757 16972 hierarchical.cpp:609] Removed agent cef0344d-7a02-417f-aadb-7eb5013cc9b4-S0
I0524 16:12:37.825767 13500 process.cpp:940] Stopped the socket accept loop
```

- Mesos Reviewbot Windows


On May 24, 2018, 2:45 p.m., Armand Grillet wrote:
> 
> -----------------------------------------------------------
> This is an automatically generated e-mail. To reply, visit:
> https://reviews.apache.org/r/67059/
> -----------------------------------------------------------
> 
> (Updated May 24, 2018, 2:45 p.m.)
> 
> 
> Review request for mesos, Andrew Schwartzmeyer, Benjamin Bannier, Eric Chung, and Kevin
Klues.
> 
> 
> Bugs: MESOS-8770
>     https://issues.apache.org/jira/browse/MESOS-8770
> 
> 
> Repository: mesos
> 
> 
> Description
> -------
> 
> The scripts are in a temporary directory, support/python3.
> 
> The scripts have been ported using 2to3, the official tool to do so.
> Many of these scripts require testing from the community before being
> used by default.
> 
> The script building the virtual environment and the git hooks have
> been updated to use the new scripts if the environment variable
> `MESOSSUPPORTPYTHON` is set to `3` by the user.
> 
> 
> Diffs
> -----
> 
>   support/README.md e812e9638ca555c56e4c52e52485240e75cb8229 
>   support/build-virtualenv 850af89326721f34de20eb45a7e78fa391d031be 
>   support/hooks/post-rewrite 1ab14abf711d1923a7ae69beb33581317009a94a 
>   support/hooks/pre-commit 6faba98ab6db68aef1a54091a08b8db1eaac8701 
>   support/python3/apply-reviews.py PRE-CREATION 
>   support/python3/generate-endpoint-help.py PRE-CREATION 
>   support/python3/jsonurl.py PRE-CREATION 
>   support/python3/mesos-gtest-runner.py PRE-CREATION 
>   support/python3/mesos-split.py PRE-CREATION 
>   support/python3/mesos-style.py PRE-CREATION 
>   support/python3/post-reviews.py PRE-CREATION 
>   support/python3/push-commits.py PRE-CREATION 
>   support/python3/test-upgrade.py PRE-CREATION 
>   support/python3/verify-reviews.py PRE-CREATION 
> 
> 
> Diff: https://reviews.apache.org/r/67059/diff/4/
> 
> 
> Testing
> -------
> 
> All the files are OK for our linter, I have tested `mesos-style.py` and `post-reviews.py`
(used for this review request).
> 
> We will likely see error messages `TypeError: cannot use a string pattern on a bytes-like
object`, they are very easy to fix (we just need to add `.decode("utf-8")` but detecting all
of them requires to use the scripts. Please do so and create issues.
> 
> 
> Thanks,
> 
> Armand Grillet
> 
>


Mime
  • Unnamed multipart/alternative (inline, None, 0 bytes)
View raw message