mesos-reviews mailing list archives

Site index · List index
Message view « Date » · « Thread »
Top « Date » · « Thread »
From Mesos Reviewbot Windows <revi...@mesos.apache.org>
Subject Re: Review Request 65522: Fixed some log messages in `slave.cpp`.
Date Tue, 06 Feb 2018 05:06:18 GMT

-----------------------------------------------------------
This is an automatically generated e-mail. To reply, visit:
https://reviews.apache.org/r/65522/#review196865
-----------------------------------------------------------



FAIL: Some of the unit tests failed. Please check the relevant logs.

Reviews applied: `['65032', '65471', '65472', '65060', '65499', '65520', '65523', '65521',
'65061', '65522']`

Failed command: `Start-MesosCITesting`

All the build artifacts available at: http://dcos-win.westus.cloudapp.azure.com/mesos-build/review/65522

Relevant logs:

- [mesos-tests-cmake-stdout.log](http://dcos-win.westus.cloudapp.azure.com/mesos-build/review/65522/logs/mesos-tests-cmake-stdout.log):

```
         D:\DCOS\mesos\mesos\src\java\jni\convert.cpp(415): warning C4267: 'argument': conversion
from 'size_t' to 'jsize', possible loss of data [D:\DCOS\mesos\src\java\mesos-java.vcxproj]
         D:\DCOS\mesos\mesos\src\java\jni\convert.cpp(437): warning C4267: 'argument': conversion
from 'size_t' to 'jsize', possible loss of data [D:\DCOS\mesos\src\java\mesos-java.vcxproj]
         D:\DCOS\mesos\mesos\src\java\jni\convert.cpp(438): warning C4267: 'argument': conversion
from 'size_t' to 'jsize', possible loss of data [D:\DCOS\mesos\src\java\mesos-java.vcxproj]
         D:\DCOS\mesos\mesos\src\java\jni\convert.cpp(460): warning C4267: 'argument': conversion
from 'size_t' to 'jsize', possible loss of data [D:\DCOS\mesos\src\java\mesos-java.vcxproj]
         D:\DCOS\mesos\mesos\src\java\jni\convert.cpp(461): warning C4267: 'argument': conversion
from 'size_t' to 'jsize', possible loss of data [D:\DCOS\mesos\src\java\mesos-java.vcxproj]
         D:\DCOS\mesos\mesos\src\java\jni\convert.cpp(500): warning C4267: 'argument': conversion
from 'size_t' to 'jsize', possible loss of data [D:\DCOS\mesos\src\java\mesos-java.vcxproj]
         D:\DCOS\mesos\mesos\src\java\jni\convert.cpp(501): warning C4267: 'argument': conversion
from 'size_t' to 'jsize', possible loss of data [D:\DCOS\mesos\src\java\mesos-java.vcxproj]
         D:\DCOS\mesos\mesos\src\java\jni\org_apache_mesos_state_Variable.cpp(44): warning
C4267: 'argument': conversion from 'size_t' to 'jsize', possible loss of data [D:\DCOS\mesos\src\java\mesos-java.vcxproj]
         D:\DCOS\mesos\mesos\src\java\jni\org_apache_mesos_state_Variable.cpp(45): warning
C4267: 'argument': conversion from 'size_t' to 'jsize', possible loss of data [D:\DCOS\mesos\src\java\mesos-java.vcxproj]
         D:\DCOS\mesos\mesos\src\jvm\jvm.cpp(95): warning C4267: '=': conversion from 'size_t'
to 'jint', possible loss of data [D:\DCOS\mesos\src\java\mesos-java.vcxproj]
         D:\DCOS\mesos\mesos\src\jvm\jvm.cpp(463): warning C4244: 'initializing': conversion
from 'jchar' to 'char', possible loss of data [D:\DCOS\mesos\src\java\mesos-java.vcxproj]
         D:\DCOS\mesos\mesos\src\jvm\jvm.cpp(493): warning C4244: 'initializing': conversion
from 'jlong' to 'long', possible loss of data [D:\DCOS\mesos\src\java\mesos-java.vcxproj]
         D:\DCOS\mesos\mesos\src\jvm\jvm.cpp(654): warning C4244: 'initializing': conversion
from 'jchar' to 'char', possible loss of data [D:\DCOS\mesos\src\java\mesos-java.vcxproj]
         D:\DCOS\mesos\mesos\src\jvm\jvm.cpp(693): warning C4244: 'initializing': conversion
from 'jlong' to 'long', possible loss of data [D:\DCOS\mesos\src\java\mesos-java.vcxproj]
         D:\DCOS\mesos\mesos\src\jvm\jvm.cpp(770): warning C4244: 'initializing': conversion
from 'jchar' to 'char', possible loss of data [D:\DCOS\mesos\src\java\mesos-java.vcxproj]
         D:\DCOS\mesos\mesos\src\jvm\jvm.cpp(809): warning C4244: 'initializing': conversion
from 'jlong' to 'long', possible loss of data [D:\DCOS\mesos\src\java\mesos-java.vcxproj]


       "D:\DCOS\mesos\src\tests\mesos-tests.vcxproj" (default target) (1) ->
       (Link target) -> 
         cluster.obj : error LNK2019: unresolved external symbol "class Try<class std::list<class
std::basic_string<char,struct std::char_traits<char>,class std::allocator<char>
>,class std::allocator<class std::basic_string<char,struct std::char_traits<char>,class
std::allocator<char> > > >,class Error> __cdecl mesos::csi::paths::getContainerPaths(class
std::basic_string<char,struct std::char_traits<char>,class std::allocator<char>
> const &,class std::basic_string<char,struct std::char_traits<char>,class
std::allocator<char> > const &,class std::basic_string<char,struct std::char_traits<char>,class
std::allocator<char> > const &)" (?getContainerPaths@paths@csi@mesos@@YA?AV?$Try@V?$list@V?$basic_string@DU?$char_traits@D@std@@V?$allocator@D@2@@std@@V?$allocator@V?$basic_string@DU?$char_traits@D@std@@V?$allocator@D@2@@std@@@2@@std@@VError@@@@AEBV?$basic_string@DU?$char_traits@D@std@@V?$allocator@D@2@@std@@00@Z)
referenced in function "public: void __cdecl <lambda_ec4b6b812fb54f84d2a3b
 9cb43048194>::operator()(void)const " (??R<lambda_ec4b6b812fb54f84d2a3b9cb43048194>@@QEBAXXZ)
[D:\DCOS\mesos\src\tests\mesos-tests.vcxproj]
         cluster.obj : error LNK2019: unresolved external symbol "class Try<struct mesos::csi::paths::ContainerPath,class
Error> __cdecl mesos::csi::paths::parseContainerPath(class std::basic_string<char,struct
std::char_traits<char>,class std::allocator<char> > const &,class std::basic_string<char,struct
std::char_traits<char>,class std::allocator<char> > const &)" (?parseContainerPath@paths@csi@mesos@@YA?AV?$Try@UContainerPath@paths@csi@mesos@@VError@@@@AEBV?$basic_string@DU?$char_traits@D@std@@V?$allocator@D@2@@std@@0@Z)
referenced in function "public: void __cdecl <lambda_ec4b6b812fb54f84d2a3b9cb43048194>::operator()(void)const
" (??R<lambda_ec4b6b812fb54f84d2a3b9cb43048194>@@QEBAXXZ) [D:\DCOS\mesos\src\tests\mesos-tests.vcxproj]
         cluster.obj : error LNK2019: unresolved external symbol "class std::basic_string<char,struct
std::char_traits<char>,class std::allocator<char> > __cdecl mesos::csi::paths::getEndpointDirSymlinkPath(class
std::basic_string<char,struct std::char_traits<char>,class std::allocator<char>
> const &,class std::basic_string<char,struct std::char_traits<char>,class
std::allocator<char> > const &,class std::basic_string<char,struct std::char_traits<char>,class
std::allocator<char> > const &,class mesos::ContainerID const &)" (?getEndpointDirSymlinkPath@paths@csi@mesos@@YA?AV?$basic_string@DU?$char_traits@D@std@@V?$allocator@D@2@@std@@AEBV45@00AEBVContainerID@3@@Z)
referenced in function "public: void __cdecl <lambda_ec4b6b812fb54f84d2a3b9cb43048194>::operator()(void)const
" (??R<lambda_ec4b6b812fb54f84d2a3b9cb43048194>@@QEBAXXZ) [D:\DCOS\mesos\src\tests\mesos-tests.vcxproj]
         D:\DCOS\mesos\src\mesos-tests.exe : fatal error LNK1120: 3 unresolved externals [D:\DCOS\mesos\src\tests\mesos-tests.vcxproj]

    214 Warning(s)
    4 Error(s)

Time Elapsed 00:28:23.65
```

- Mesos Reviewbot Windows


On Feb. 5, 2018, 8:17 p.m., Chun-Hung Hsiao wrote:
> 
> -----------------------------------------------------------
> This is an automatically generated e-mail. To reply, visit:
> https://reviews.apache.org/r/65522/
> -----------------------------------------------------------
> 
> (Updated Feb. 5, 2018, 8:17 p.m.)
> 
> 
> Review request for mesos, Gaston Kleiman and Greg Mann.
> 
> 
> Repository: mesos
> 
> 
> Description
> -------
> 
> Fixed some log messages in `slave.cpp`.
> 
> 
> Diffs
> -----
> 
>   src/slave/slave.cpp a6a5c93ab2d541c870cb52587495de20ed5ac1f4 
> 
> 
> Diff: https://reviews.apache.org/r/65522/diff/1/
> 
> 
> Testing
> -------
> 
> sudo make check
> 
> 
> Thanks,
> 
> Chun-Hung Hsiao
> 
>


Mime
  • Unnamed multipart/alternative (inline, None, 0 bytes)
View raw message