mesos-reviews mailing list archives

Site index · List index
Message view « Date » · « Thread »
Top « Date » · « Thread »
From Mesos Reviewbot Windows <revi...@mesos.apache.org>
Subject Re: Review Request 64739: Upgraded resources that come from `protobuf::read`.
Date Wed, 20 Dec 2017 01:58:56 GMT

-----------------------------------------------------------
This is an automatically generated e-mail. To reply, visit:
https://reviews.apache.org/r/64739/#review194199
-----------------------------------------------------------



FAIL: Some Mesos tests failed.

Reviews applied: `['64737', '64738', '63976', '63977', '64739']`

Failed command: `D:\DCOS\mesos\src\mesos-tests.exe --verbose`

All the build artifacts available at: http://dcos-win.westus.cloudapp.azure.com/mesos-build/review/64739

Relevant logs:

- [mesos-tests-stdout.log](http://dcos-win.westus.cloudapp.azure.com/mesos-build/review/64739/logs/mesos-tests-stdout.log):

```
[----------] 9 tests from Endpoint/SlaveEndpointTest (948 ms total)

[----------] 2 tests from ContainerizerType/DefaultContainerDNSFlagTest
[ RUN      ] ContainerizerType/DefaultContainerDNSFlagTest.ValidateFlag/0
[       OK ] ContainerizerType/DefaultContainerDNSFlagTest.ValidateFlag/0 (32 ms)
[ RUN      ] ContainerizerType/DefaultContainerDNSFlagTest.ValidateFlag/1
[       OK ] ContainerizerType/DefaultContainerDNSFlagTest.ValidateFlag/1 (36 ms)
[----------] 2 tests from ContainerizerType/DefaultContainerDNSFlagTest (70 ms total)

[----------] 1 test from IsolationFlag/CpuIsolatorTest
[ RUN      ] IsolationFlag/CpuIsolatorTest.ROOT_UserCpuUsage/0
[       OK ] IsolationFlag/CpuIsolatorTest.ROOT_UserCpuUsage/0 (2151 ms)
[----------] 1 test from IsolationFlag/CpuIsolatorTest (2178 ms total)

[----------] 1 test from IsolationFlag/MemoryIsolatorTest
[ RUN      ] IsolationFlag/MemoryIsolatorTest.ROOT_MemUsage/0
[       OK ] IsolationFlag/MemoryIsolatorTest.ROOT_MemUsage/0 (2258 ms)
[----------] 1 test from IsolationFlag/MemoryIsolatorTest (2284 ms total)

[----------] Global test environment tear-down
[==========] 845 tests from 85 test cases ran. (299180 ms total)
[  PASSED  ] 843 tests.
[  FAILED  ] 2 tests, listed below:
[  FAILED  ] ResourceFormatTest.DowngradeWithResourcesWithoutRefinedReservations
[  FAILED  ] ResourceFormatTest.DowngradeWithResourcesWithRefinedReservations

 2 FAILED TESTS
  YOU HAVE 213 DISABLED TESTS

```

- [mesos-tests-stderr.log](http://dcos-win.westus.cloudapp.azure.com/mesos-build/review/64739/logs/mesos-tests-stderr.log):

```
I1220 01:58:37.800837  5172 master.cpp:10141] Updating the state of task cd39a23c-0cbc-45e2-9860-1d3cd5ff8b54
of framework 8c74b472-e0a3-4fd1-bdc5-4060860e1e40-0000 (latest state: TASK_KILLED, status
update state: TASK_KILLED)
I1220 01:58:37.800837  9044 slave.cpp:3392] Shutting down framework 8c74b472-e0a3-4fd1-bdc5-4060860e1e40-0000
I1220 01:58:37.800837  9044 slave.cpp:6083] Shutting down executor 'cd39a23c-0cbc-45e2-9860-1d3cd5ff8b54'
of framework 8c74b472-e0a3-4fd1-bdc5-4060860e1e40-0000 at executor(1)@10.3.1.5:I1220 01:58:37.159876
 3568 exec.cpp:162] Version: 1.5.0
I1220 01:58:37.181856  3820 exec.cpp:237] Executor registered on agent 8c74b472-e0a3-4fd1-bdc5-4060860e1e40-S0
I1220 01:58:37.184855  6504 executor.cpp:171] Received SUBSCRIBED event
I1220 01:58:37.188877  6504 executor.cpp:175] Subscribed executor on build-srv-04.zq4gs31qjdiunm1ryi1452nvnh.dx.internal.cloudapp.net
I1220 01:58:37.188877  6504 executor.cpp:171] Received LAUNCH event
I1220 01:58:37.192831  6504 executor.cpp:638] Starting task cd39a23c-0cbc-45e2-9860-1d3cd5ff8b54
I1220 01:58:37.266876  6504 executor.cpp:478] Running 'D:\DCOS\mesos\src\mesos-containerizer.exe
launch <POSSIBLY-SENSITIVE-DATA>'
I1220 01:58:37.778834  6504 executor.cpp:651] Forked command at 6856
I1220 01:58:37.802814  7272 exec.cpp:435] Executor asked to shutdown
I1220 01:58:37.803814  7400 executor.cpp:171] Received SHUTDOWN event
I1220 01:58:37.803814  7400 executor.cpp:748] Shutting down
I1220 01:58:37.803814  7400 executor.cpp:855] Sending SIGTERM to process tree at pid 653846
I1220 01:58:37.801834  9044 slave.cpp:931] Agent terminating
W1220 01:58:37.801834  9044 slave.cpp:3388] Ignoring shutdown framework 8c74b472-e0a3-4fd1-bdc5-4060860e1e40-0000
because it is terminating
I1220 01:58:37.802814  5172 master.cpp:10247] Removing task cd39a23c-0cbc-45e2-9860-1d3cd5ff8b54
with resources cpus(allocated: *):4; mem(allocated: *):2048; disk(allocated: *):1024; ports(allocated:
*):[31000-32000] of framework 8c74b472-e0a3-4fd1-bdc5-4060860e1e40-0000 on agent 8c74b472-e0a3-4fd1-bdc5-4060860e1e40-S0
at slave(327)@10.3.1.5:53825 (build-srv-04.zq4gs31qjdiunm1ryi1452nvnh.dx.internal.cloudapp.net)
I1220 01:58:37.805814  5200 containerizer.cpp:2352] Destroying container 9a438440-edb7-4fdb-9aef-c7d43254ed02
in RUNNING state
I1220 01:58:37.805814  5200 containerizer.cpp:2966] Transitioning the state of container 9a438440-edb7-4fdb-9aef-c7d43254ed02
from RUNNING to DESTROYING
I1220 01:58:37.805814  5172 master.cpp:1305] Agent 8c74b472-e0a3-4fd1-bdc5-4060860e1e40-S0
at slave(327)@10.3.1.5:53825 (build-srv-04.zq4gs31qjdiunm1ryi1452nvnh.dx.internal.cloudapp.net)
disconnected
I1220 01:58:37.805814  1696 hierarchical.cpp:344] Removed framework 8c74b472-e0a3-4fd1-bdc5-4060860e1e40-0000
I1220 01:58:37.805814  5172 master.cpp:3364] Disconnecting agent 8c74b472-e0a3-4fd1-bdc5-4060860e1e40-S0
at slave(327)@10.3.1.5:53825 (build-srv-04.zq4gs31qjdiunm1ryi1452nvnh.dx.internal.cloudapp.net)
I1220 01:58:37.805814  5172 master.cpp:3383] Deactivating agent 8c74b472-e0a3-4fd1-bdc5-4060860e1e40-S0
at slave(327)@10.3.1.5:53825 (build-srv-04.zq4gs31qjdiunm1ryi1452nvnh.dx.internal.cloudapp.net)
I1220 01:58:37.806814  5200 launcher.cpp:156] Asked to destroy container 9a438440-edb7-4fdb-9aef-c7d43254ed02
I1220 01:58:37.806814  2280 hierarchical.cpp:766] Agent 8c74b472-e0a3-4fd1-bdc5-4060860e1e40-S0
deactivated
I1220 01:58:37.867903  2280 containerizer.cpp:2805] Container 9a438440-edb7-4fdb-9aef-c7d43254ed02
has exited
I1220 01:58:37.895931  3948 master.cpp:1147] Master terminating
I1220 01:58:37.897913  1696 hierarchical.cpp:609] Removed agent 8c74b472-e0a3-4fd1-bdc5-4060860e1e40-S0
I1220 01:58:38.240924  8060 process.cpp:887] Failed to accept socket: future discarded
```

- Mesos Reviewbot Windows


On Dec. 20, 2017, 12:51 a.m., Michael Park wrote:
> 
> -----------------------------------------------------------
> This is an automatically generated e-mail. To reply, visit:
> https://reviews.apache.org/r/64739/
> -----------------------------------------------------------
> 
> (Updated Dec. 20, 2017, 12:51 a.m.)
> 
> 
> Review request for mesos and Benjamin Mahler.
> 
> 
> Repository: mesos
> 
> 
> Description
> -------
> 
> See summary.
> 
> 
> Diffs
> -----
> 
>   src/resource_provider/storage/provider.cpp 79d7f602bbc57bce308157dfbb6c2afaef806f23

>   src/slave/containerizer/mesos/paths.cpp 8a188a918873eef468a984b80f5ea7ebaa8fb923 
> 
> 
> Diff: https://reviews.apache.org/r/64739/diff/1/
> 
> 
> Testing
> -------
> 
> 
> Thanks,
> 
> Michael Park
> 
>


Mime
  • Unnamed multipart/alternative (inline, None, 0 bytes)
View raw message