mesos-reviews mailing list archives

Site index · List index
Message view « Date » · « Thread »
Top « Date » · « Thread »
From Mesos Reviewbot Windows <revi...@mesos.apache.org>
Subject Re: Review Request 64621: Fixed a corner case for pre-existing volumes created by old RPs.
Date Thu, 14 Dec 2017 20:42:26 GMT

-----------------------------------------------------------
This is an automatically generated e-mail. To reply, visit:
https://reviews.apache.org/r/64621/#review193843
-----------------------------------------------------------



FAIL: Some Mesos tests failed.

Reviews applied: `['64621']`

Failed command: `D:\DCOS\mesos\src\mesos-tests.exe --verbose`

All the build artifacts available at: http://dcos-win.westus.cloudapp.azure.com/mesos-build/review/64621

Relevant logs:

- [mesos-tests-stdout.log](http://dcos-win.westus.cloudapp.azure.com/mesos-build/review/64621/logs/mesos-tests-stdout.log):

```

[----------] 1 test from IsolationFlag/CpuIsolatorTest
[ RUN      ] IsolationFlag/CpuIsolatorTest.ROOT_UserCpuUsage/0
[       OK ] IsolationFlag/CpuIsolatorTest.ROOT_UserCpuUsage/0 (2414 ms)
[----------] 1 test from IsolationFlag/CpuIsolatorTest (2439 ms total)

[----------] 1 test from IsolationFlag/MemoryIsolatorTest
[ RUN      ] IsolationFlag/MemoryIsolatorTest.ROOT_MemUsage/0
[       OK ] IsolationFlag/MemoryIsolatorTest.ROOT_MemUsage/0 (2573 ms)
[----------] 1 test from IsolationFlag/MemoryIsolatorTest (2599 ms total)

[----------] Global test environment tear-down
[==========] 835 tests from 85 test cases ran. (320051 ms total)
[  PASSED  ] 825 tests.
[  FAILED  ] 10 tests, listed below:
[  FAILED  ] OfferOperationStatusUpdateManagerTest.UpdateAndAckNonTerminalUpdate
[  FAILED  ] OfferOperationStatusUpdateManagerTest.RecoverCheckpointedStream
[  FAILED  ] OfferOperationStatusUpdateManagerTest.RecoverEmptyFile
[  FAILED  ] OfferOperationStatusUpdateManagerTest.RecoverTerminatedStream
[  FAILED  ] OfferOperationStatusUpdateManagerTest.IgnoreDuplicateUpdate
[  FAILED  ] OfferOperationStatusUpdateManagerTest.IgnoreDuplicateUpdateAfterRecover
[  FAILED  ] OfferOperationStatusUpdateManagerTest.RejectDuplicateAck
[  FAILED  ] OfferOperationStatusUpdateManagerTest.RejectDuplicateAckAfterRecover
[  FAILED  ] OfferOperationStatusUpdateManagerTest.NonStrictRecoveryCorruptedFile
[  FAILED  ] OfferOperationStatusUpdateManagerTest.UpdateLatestWhenResending

10 FAILED TESTS
  YOU HAVE 205 DISABLED TESTS

```

- [mesos-tests-stderr.log](http://dcos-win.westus.cloudapp.azure.com/mesos-build/review/64621/logs/mesos-tests-stderr.log):

```
I1214 20:42:07.756968  3988 slave.cpp:3401] Shutting down framework d8b3a5e7-eaa7-4005-871c-3d6b1ad7ac58-0000
I1214 20:42:07.756968  2224 master.cpp:10160] Updating the state of task c6082892-555a-4848-9435-c586f5fd6d4f
of framework d8b3a5e7-eaa7-4005-871c-3d6b1ad7ac58-0000 (latest state: TASK_KILLED, status
update state: TASK_KILLED)
I1214 20:42:07.756968  3988 slave.cpp:6109] Shutting down executor 'c6082892-555a-4848-9435-c586f5fd6d4f'
of framework d8b3a5e7-eaa7-4005-871c-3d6b1ad7ac58-0000 at executor(1)@10.3.1.11:63032
I1214 20:42:07.758968  1116 slave.cpp:909] Agent terminating
W1214 20:42:07.758968  1116 slave.cpp:3397] Ignoring shutdown framework d8b3a5e7-eaa7-4005-871c-3d6b1ad7ac58-0000
becauseI1214 20:42:07.039916  2248 exec.cpp:162] Version: 1.5.0
I1214 20:42:07.064914  5700 exec.cpp:237] Executor registered on agent d8b3a5e7-eaa7-4005-871c-3d6b1ad7ac58-S0
I1214 20:42:07.067915  5716 executor.cpp:171] Received SUBSCRIBED event
I1214 20:42:07.070919  5716 executor.cpp:175] Subscribed executor on build-srv-03.zq4gs31qjdiunm1ryi1452nvnh.dx.internal.cloudapp.net
I1214 20:42:07.073451  5716 executor.cpp:171] Received LAUNCH event
I1214 20:42:07.076922  5716 executor.cpp:638] Starting task c6082892-555a-4848-9435-c586f5fd6d4f
I1214 20:42:07.154927  5716 executor.cpp:478] Running 'D:\DCOS\mesos\src\mesos-containerizer.exe
launch <POSSIBLY-SENSITIVE-DATA>'
I1214 20:42:07.732969  5716 executor.cpp:651] Forked command at 6480
I1214 20:42:07.758968  1008 exec.cpp:435] Executor asked to shutdown
I1214 20:42:07.758968  5716 executor.cpp:171] Received SHUTDOWN event
I1214 20:42:07.758968  5716 executor.cpp:748] Shutting down
I1214 20:42:07.759968  5716 executor.cpp:855] Sending SIGTERM to process tree at pid 6 it
is terminating
I1214 20:42:07.758968  2224 master.cpp:10266] Removing task c6082892-555a-4848-9435-c586f5fd6d4f
with resources cpus(allocated: *):4; mem(allocated: *):2048; disk(allocated: *):1024; ports(allocated:
*):[31000-32000] of framework d8b3a5e7-eaa7-4005-871c-3d6b1ad7ac58-0000 on agent d8b3a5e7-eaa7-4005-871c-3d6b1ad7ac58-S0
at slave(327)@10.3.1.11:63011 (build-srv-03.zq4gs31qjdiunm1ryi1452nvnh.dx.internal.cloudapp.net)
I1214 20:42:07.761968  2224 master.cpp:1305] Agent d8b3a5e7-eaa7-4005-871c-3d6b1ad7ac58-S0
at slave(327)@10.3.1.11:63011 (build-srv-03.zq4gs31qjdiunm1ryi1452nvnh.dx.internal.cloudapp.net)
disconnected
I1214 20:42:07.762971  2224 master.cpp:3364] Disconnecting agent d8b3a5e7-eaa7-4005-871c-3d6b1ad7ac58-S0
at slave(327)@10.3.1.11:63011 (build-srv-03.zq4gs31qjdiunm1ryi1452nvnh.dx.internal.cloudapp.net)
I1214 20:42:07.762971  2224 master.cpp:3383] Deactivating agent d8b3a5e7-eaa7-4005-871c-3d6b1ad7ac58-S0
at slave(327)@10.3.1.11:63011 (build-srv-03.zq4gs31qjdiunm1ryi1452nvnh.dx.internal.cloudapp.net)
I1214 20:42:07.763967  6904 hierarchical.cpp:344] Removed framework d8b3a5e7-eaa7-4005-871c-3d6b1ad7ac58-0000
I1214 20:42:07.763967  2304 containerizer.cpp:2337] Destroying container 786a33f0-f4c0-4392-aa4f-beb0103cd425
in RUNNING state
I1214 20:42:07.763967  2304 containerizer.cpp:2939] Transitioning the state of container 786a33f0-f4c0-4392-aa4f-beb0103cd425
from RUNNING to DESTROYING
I1214 20:42:07.763967  6904 hierarchical.cpp:766] Agent d8b3a5e7-eaa7-4005-871c-3d6b1ad7ac58-S0
deactivated
I1214 20:42:07.764971  2304 launcher.cpp:156] Asked to destroy container 786a33f0-f4c0-4392-aa4f-beb0103cd425
I1214 20:42:07.842067  6904 containerizer.cpp:2788] Container 786a33f0-f4c0-4392-aa4f-beb0103cd425
has exited
I1214 20:42:07.872117  1116 master.cpp:1147] Master terminating
I1214 20:42:07.874094  5524 hierarchical.cpp:609] Removed agent d8b3a5e7-eaa7-4005-871c-3d6b1ad7ac58-S0
I1214 20:42:08.167124  6056 process.cpp:887] Failed to accept socket: future discarded
```

- Mesos Reviewbot Windows


On Dec. 14, 2017, 7:34 p.m., Chun-Hung Hsiao wrote:
> 
> -----------------------------------------------------------
> This is an automatically generated e-mail. To reply, visit:
> https://reviews.apache.org/r/64621/
> -----------------------------------------------------------
> 
> (Updated Dec. 14, 2017, 7:34 p.m.)
> 
> 
> Review request for mesos, Jie Yu and Joseph Wu.
> 
> 
> Repository: mesos
> 
> 
> Description
> -------
> 
> When an agent failed over and registered as a new one, the RP will be
> registered as a new one as well, but it could pick up the checkpointed
> states for volumes created by an old RP as pre-existing volumes. We
> should use the checkpointed capabilities for these volumes instead of
> using the default mount or block capability.
> 
> 
> Diffs
> -----
> 
>   src/resource_provider/storage/provider.cpp 17acf1b430b81e31bd97b117a44477eebab7e6f4

> 
> 
> Diff: https://reviews.apache.org/r/64621/diff/1/
> 
> 
> Testing
> -------
> 
> sudo make check
> 
> 
> Thanks,
> 
> Chun-Hung Hsiao
> 
>


Mime
  • Unnamed multipart/alternative (inline, None, 0 bytes)
View raw message