mesos-reviews mailing list archives

Site index · List index
Message view « Date » · « Thread »
Top « Date » · « Thread »
From Mesos Reviewbot Windows <revi...@mesos.apache.org>
Subject Re: Review Request 64616: WIP: Modified SLRP to use the VolumeProfileAdaptor module.
Date Thu, 14 Dec 2017 16:30:57 GMT

-----------------------------------------------------------
This is an automatically generated e-mail. To reply, visit:
https://reviews.apache.org/r/64616/#review193811
-----------------------------------------------------------



FAIL: Mesos tests failed to build.

Reviews applied: `['64351', '63971', '64352', '64353', '64354', '64612', '64615', '64616']`

Failed command: `cmake.exe --build . --target mesos-tests --config Debug`

All the build artifacts available at: http://dcos-win.westus.cloudapp.azure.com/mesos-build/review/64616

Relevant logs:

- [mesos-tests-build-cmake-stdout.log](http://dcos-win.westus.cloudapp.azure.com/mesos-build/review/64616/logs/mesos-tests-build-cmake-stdout.log):

```
  D:\DCOS\mesos\mesos\src\authentication\cram_md5\authenticator.cpp(216): warning C4267: 'argument':
conversion from 'size_t' to 'unsigned int', possible loss of data [D:\DCOS\mesos\src\mesos.vcxproj]
  D:\DCOS\mesos\mesos\src\authentication\cram_md5\authenticator.cpp(242): warning C4267: 'argument':
conversion from 'size_t' to 'unsigned int', possible loss of data [D:\DCOS\mesos\src\mesos.vcxproj]
  D:\DCOS\mesos\mesos\src\authentication\cram_md5\authenticator.cpp(274): warning C4267: '=':
conversion from 'size_t' to 'unsigned int', possible loss of data [D:\DCOS\mesos\src\mesos.vcxproj]
  D:\DCOS\mesos\mesos\src\master/master.hpp(2093): warning C4244: 'return': conversion from
'unsigned __int64' to 'double', possible loss of data (compiling source file D:\DCOS\mesos\mesos\src\common\protobuf_utils.cpp)
[D:\DCOS\mesos\src\mesos.vcxproj]
  D:\DCOS\mesos\mesos\src\files\files.cpp(704): warning C4267: 'argument': conversion from
'size_t' to 'off_t', possible loss of data [D:\DCOS\mesos\src\mesos.vcxproj]
  D:\DCOS\mesos\mesos\src\master/master.hpp(2093): warning C4244: 'return': conversion from
'unsigned __int64' to 'double', possible loss of data (compiling source file D:\DCOS\mesos\mesos\src\master\master.cpp)
[D:\DCOS\mesos\src\mesos.vcxproj]
  D:\DCOS\mesos\mesos\src\master/master.hpp(2093): warning C4244: 'return': conversion from
'unsigned __int64' to 'double', possible loss of data (compiling source file D:\DCOS\mesos\mesos\src\master\quota_handler.cpp)
[D:\DCOS\mesos\src\mesos.vcxproj]
  D:\DCOS\mesos\mesos\src\master\master.cpp(6223): warning C4244: 'argument': conversion from
'const ::size_t' to 'double', possible loss of data [D:\DCOS\mesos\src\mesos.vcxproj]
  D:\DCOS\mesos\mesos\src\master\master.cpp(6325): warning C4244: 'argument': conversion from
'const ::size_t' to 'double', possible loss of data [D:\DCOS\mesos\src\mesos.vcxproj]
  D:\DCOS\mesos\mesos\src\master\master.cpp(6890): warning C4244: 'argument': conversion from
'const ::size_t' to 'double', possible loss of data [D:\DCOS\mesos\src\mesos.vcxproj]
  D:\DCOS\mesos\mesos\src\master/master.hpp(2093): warning C4244: 'return': conversion from
'unsigned __int64' to 'double', possible loss of data (compiling source file D:\DCOS\mesos\mesos\src\master\weights_handler.cpp)
[D:\DCOS\mesos\src\mesos.vcxproj]
  D:\DCOS\mesos\mesos\src\master\master.cpp(9008): warning C4244: 'argument': conversion from
'const ::size_t' to 'double', possible loss of data [D:\DCOS\mesos\src\mesos.vcxproj]
  D:\DCOS\mesos\mesos\src\master\allocator\sorter\drf\sorter.cpp(589): warning C4267: 'return':
conversion from 'size_t' to 'int', possible loss of data [D:\DCOS\mesos\src\mesos.vcxproj]
  D:\DCOS\mesos\mesos\src\master\master.cpp(10854): warning C4244: 'return': conversion from
'::size_t' to 'double', possible loss of data [D:\DCOS\mesos\src\mesos.vcxproj]


"D:\DCOS\mesos\src\tests\mesos-tests.vcxproj" (default target) (1) ->
"D:\DCOS\mesos\src\mesos.vcxproj" (default target) (12) ->
(ClCompile target) -> 
  D:\DCOS\mesos\mesos\include\csi/spec.hpp(21): fatal error C1083: Cannot open include file:
'csi/csi.grpc.pb.h': No such file or directory (compiling source file D:\DCOS\mesos\mesos\src\slave\task_status_update_manager.cpp)
[D:\DCOS\mesos\src\mesos.vcxproj]
  D:\DCOS\mesos\mesos\include\csi/spec.hpp(21): fatal error C1083: Cannot open include file:
'csi/csi.grpc.pb.h': No such file or directory (compiling source file D:\DCOS\mesos\mesos\src\slave\slave.cpp)
[D:\DCOS\mesos\src\mesos.vcxproj]
  D:\DCOS\mesos\mesos\include\csi/spec.hpp(21): fatal error C1083: Cannot open include file:
'csi/csi.grpc.pb.h': No such file or directory (compiling source file D:\DCOS\mesos\mesos\src\resource_provider\daemon.cpp)
[D:\DCOS\mesos\src\mesos.vcxproj]
  D:\DCOS\mesos\mesos\src\status_update_manager/status_update_manager_process.hpp(729): error
C2039: 'ftruncate': is not a member of 'os' (compiling source file D:\DCOS\mesos\mesos\src\status_update_manager\offer_operation.cpp)
[D:\DCOS\mesos\src\mesos.vcxproj]
  D:\DCOS\mesos\mesos\src\status_update_manager/status_update_manager_process.hpp(729): error
C3861: 'ftruncate': identifier not found (compiling source file D:\DCOS\mesos\mesos\src\status_update_manager\offer_operation.cpp)
[D:\DCOS\mesos\src\mesos.vcxproj]

    132 Warning(s)
    5 Error(s)

Time Elapsed 00:02:40.11
```

- [mesos-tests-CMakeOutput.log](http://dcos-win.westus.cloudapp.azure.com/mesos-build/review/64616/logs/mesos-tests-CMakeOutput.log):

```
  Creating directory "cmTC_8099f.dir\Debug\".

  Creating directory "D:\DCOS\mesos\CMakeFiles\CMakeTmp\Debug\".

  Creating directory "cmTC_8099f.dir\Debug\cmTC_8099f.tlog\".

InitializeBuildStatus:

  Creating "cmTC_8099f.dir\Debug\cmTC_8099f.tlog\unsuccessfulbuild" because "AlwaysCreate"
was specified.

ClCompile:

  C:\Program Files (x86)\Microsoft Visual Studio\2017\Community\VC\Tools\MSVC\14.12.25827\bin\HostX64\x64\CL.exe
/c /Zi /W3 /WX- /diagnostics:classic /Od /Ob0 /D WIN32 /D _WINDOWS /D COMPILER_SUPPORTS_CXX11
/D "CMAKE_INTDIR=\"Debug\"" /D _MBCS /Gm- /EHsc /RTC1 /MDd /GS /fp:precise /Zc:wchar_t /Zc:forScope
/Zc:inline /GR /Fo"cmTC_8099f.dir\Debug\" /Fd"cmTC_8099f.dir\Debug\vc141.pdb" /Gd /TP /errorReport:queue
D:\DCOS\mesos\CMakeFiles\CMakeTmp\src.cxx

  Microsoft (R) C/C++ Optimizing Compiler Version 19.12.25830.2 for x64

  Copyright (C) Microsoft Corporation.  All rights reserved.

  

  cl /c /Zi /W3 /WX- /diagnostics:classic /Od /Ob0 /D WIN32 /D _WINDOWS /D COMPILER_SUPPORTS_CXX11
/D "CMAKE_INTDIR=\"Debug\"" /D _MBCS /Gm- /EHsc /RTC1 /MDd /GS /fp:precise /Zc:wchar_t /Zc:forScope
/Zc:inline /GR /Fo"cmTC_8099f.dir\Debug\" /Fd"cmTC_8099f.dir\Debug\vc141.pdb" /Gd /TP /errorReport:queue
D:\DCOS\mesos\CMakeFiles\CMakeTmp\src.cxx

  src.cxx

  

Link:

  C:\Program Files (x86)\Microsoft Visual Studio\2017\Community\VC\Tools\MSVC\14.12.25827\bin\HostX64\x64\link.exe
/ERRORREPORT:QUEUE /OUT:"D:\DCOS\mesos\CMakeFiles\CMakeTmp\Debug\cmTC_8099f.exe" /INCREMENTAL
/NOLOGO kernel32.lib user32.lib gdi32.lib winspool.lib shell32.lib ole32.lib oleaut32.lib
uuid.lib comdlg32.lib advapi32.lib /MANIFEST /MANIFESTUAC:"level='asInvoker' uiAccess='false'"
/manifest:embed /DEBUG /PDB:"D:/DCOS/mesos/CMakeFiles/CMakeTmp/Debug/cmTC_8099f.pdb" /SUBSYSTEM:CONSOLE
/TLBID:1 /DYNAMICBASE /NXCOMPAT /IMPLIB:"D:/DCOS/mesos/CMakeFiles/CMakeTmp/Debug/cmTC_8099f.lib"
/MACHINE:X64  /machine:x64 cmTC_8099f.dir\Debug\src.obj

  cmTC_8099f.vcxproj -> D:\DCOS\mesos\CMakeFiles\CMakeTmp\Debug\cmTC_8099f.exe

FinalizeBuildStatus:

  Deleting file "cmTC_8099f.dir\Debug\cmTC_8099f.tlog\unsuccessfulbuild".

  Touching "cmTC_8099f.dir\Debug\cmTC_8099f.tlog\cmTC_8099f.lastbuildstate".

Done Building Project "D:\DCOS\mesos\CMakeFiles\CMakeTmp\cmTC_8099f.vcxproj" (default targets).



Build succeeded.

    0 Warning(s)

    0 Error(s)



Time Elapsed 00:00:00.94


Source file was:
int main() { return 0; }
```

- [mesos-tests-CMakeError.log](http://dcos-win.westus.cloudapp.azure.com/mesos-build/review/64616/logs/mesos-tests-CMakeError.log):

```
PrepareForBuild:

  Creating directory "cmTC_7f1c6.dir\Debug\".

  Creating directory "D:\DCOS\mesos\CMakeFiles\CMakeTmp\Debug\".

  Creating directory "cmTC_7f1c6.dir\Debug\cmTC_7f1c6.tlog\".

InitializeBuildStatus:

  Creating "cmTC_7f1c6.dir\Debug\cmTC_7f1c6.tlog\unsuccessfulbuild" because "AlwaysCreate"
was specified.

ClCompile:

  C:\Program Files (x86)\Microsoft Visual Studio\2017\Community\VC\Tools\MSVC\14.12.25827\bin\HostX64\x64\CL.exe
/c /Zi /W3 /WX- /diagnostics:classic /MP /Od /Ob0 /D WIN32 /D _WINDOWS /D UNICODE /D _UNICODE
/D "CMAKE_INTDIR=\"Debug\"" /D _UNICODE /D UNICODE /Gm- /RTC1 /MTd /GS /fp:precise /Zc:wchar_t
/Zc:forScope /Zc:inline /Fo"cmTC_7f1c6.dir\Debug\" /Fd"cmTC_7f1c6.dir\Debug\vc141.pdb" /Gd
/TC /errorReport:queue D:\DCOS\mesos\CMakeFiles\CMakeTmp\CheckIncludeFile.c

  Microsoft (R) C/C++ Optimizing Compiler Version 19.12.25830.2 for x64

  Copyright (C) Microsoft Corporation.  All rights reserved.

  

  cl /c /Zi /W3 /WX- /diagnostics:classic /MP /Od /Ob0 /D WIN32 /D _WINDOWS /D UNICODE /D
_UNICODE /D "CMAKE_INTDIR=\"Debug\"" /D _UNICODE /D UNICODE /Gm- /RTC1 /MTd /GS /fp:precise
/Zc:wchar_t /Zc:forScope /Zc:inline /Fo"cmTC_7f1c6.dir\Debug\" /Fd"cmTC_7f1c6.dir\Debug\vc141.pdb"
/Gd /TC /errorReport:queue D:\DCOS\mesos\CMakeFiles\CMakeTmp\CheckIncludeFile.c

  CheckIncludeFile.c

  

D:\DCOS\mesos\CMakeFiles\CMakeTmp\CheckIncludeFile.c(1): fatal error C1083: Cannot open include
file: 'pthread.h': No such file or directory [D:\DCOS\mesos\CMakeFiles\CMakeTmp\cmTC_7f1c6.vcxproj]

Done Building Project "D:\DCOS\mesos\CMakeFiles\CMakeTmp\cmTC_7f1c6.vcxproj" (default targets)
-- FAILED.



Build FAILED.



"D:\DCOS\mesos\CMakeFiles\CMakeTmp\cmTC_7f1c6.vcxproj" (default target) (1) ->

(ClCompile target) -> 

  D:\DCOS\mesos\CMakeFiles\CMakeTmp\CheckIncludeFile.c(1): fatal error C1083: Cannot open
include file: 'pthread.h': No such file or directory [D:\DCOS\mesos\CMakeFiles\CMakeTmp\cmTC_7f1c6.vcxproj]



    0 Warning(s)

    1 Error(s)



Time Elapsed 00:00:00.53



```

- Mesos Reviewbot Windows


On Dec. 14, 2017, 5:36 a.m., Joseph Wu wrote:
> 
> -----------------------------------------------------------
> This is an automatically generated e-mail. To reply, visit:
> https://reviews.apache.org/r/64616/
> -----------------------------------------------------------
> 
> (Updated Dec. 14, 2017, 5:36 a.m.)
> 
> 
> Review request for mesos, Chun-Hung Hsiao and Jie Yu.
> 
> 
> Bugs: MESOS-8251
>     https://issues.apache.org/jira/browse/MESOS-8251
> 
> 
> Repository: mesos
> 
> 
> Description
> -------
> 
> This changes the Storage Local Resource Provider's source of profile
> information from only using the default to using a VolumeProfileAdaptor
> module.
> 
> 
> This patch does not yet have logic for watching the module
> for profile changes and getting new capacities from the CSI
> plugins.
> 
> 
> Diffs
> -----
> 
>   src/resource_provider/storage/provider.cpp f00fe58e12dcaa911ab3d05c3d7719c65a1484fb

>   src/tests/storage_local_resource_provider_tests.cpp 1d6ce8ecd213315ae00b351b0f515449850b9df1

> 
> 
> Diff: https://reviews.apache.org/r/64616/diff/2/
> 
> 
> Testing
> -------
> 
> make
> 
> 
> Thanks,
> 
> Joseph Wu
> 
>


Mime
  • Unnamed multipart/alternative (inline, None, 0 bytes)
View raw message