juneau-dev mailing list archives

Site index · List index
Message view « Date » · « Thread »
Top « Date » · « Thread »
From Apache Jenkins Server <jenk...@builds.apache.org>
Subject Build failed in Jenkins: Juneau » Juneau-Java-1.8 #74
Date Mon, 11 Jan 2021 17:11:59 GMT
See <https://ci-builds.apache.org/job/Juneau/job/Juneau-Java-1.8/74/display/redirect?page=changes>

Changes:

[James Bognar] REST refactoring.


------------------------------------------
[...truncated 354.76 KB...]
[INFO] Tests run: 231, Failures: 0, Errors: 0, Skipped: 0, Time elapsed: 0.089 s - in org.apache.juneau.transforms.ReaderObjectSwapTest
[INFO] Running org.apache.juneau.transforms.TemporalCalendarSwapTest
[INFO] Tests run: 66, Failures: 0, Errors: 0, Skipped: 0, Time elapsed: 0.009 s - in org.apache.juneau.transforms.TemporalCalendarSwapTest
[INFO] Running org.apache.juneau.transforms.EnumerationSwapTest
[INFO] Tests run: 1, Failures: 0, Errors: 0, Skipped: 0, Time elapsed: 0 s - in org.apache.juneau.transforms.EnumerationSwapTest
[INFO] Running org.apache.juneau.transforms.StackTraceElementSwapTest
[INFO] Tests run: 1, Failures: 0, Errors: 0, Skipped: 0, Time elapsed: 0 s - in org.apache.juneau.transforms.StackTraceElementSwapTest
[INFO] Running org.apache.juneau.transforms.LocaleSwapTest
[INFO] Tests run: 6, Failures: 0, Errors: 0, Skipped: 0, Time elapsed: 0 s - in org.apache.juneau.transforms.LocaleSwapTest
[INFO] Running org.apache.juneau.transforms.SwapsAnnotationComboTest
[INFO] Tests run: 336, Failures: 0, Errors: 0, Skipped: 0, Time elapsed: 0.149 s - in org.apache.juneau.transforms.SwapsAnnotationComboTest
[INFO] Running org.apache.juneau.transforms.InputStreamBase64SwapTest
[INFO] Tests run: 3, Failures: 0, Errors: 0, Skipped: 0, Time elapsed: 0 s - in org.apache.juneau.transforms.InputStreamBase64SwapTest
[INFO] Running org.apache.juneau.transforms.DefaultSwapsTest
[INFO] Tests run: 60, Failures: 0, Errors: 0, Skipped: 0, Time elapsed: 0.139 s - in org.apache.juneau.transforms.DefaultSwapsTest
[INFO] Running org.apache.juneau.transforms.BeanDictionaryComboTest
[INFO] Tests run: 1560, Failures: 0, Errors: 0, Skipped: 0, Time elapsed: 1.145 s - in org.apache.juneau.transforms.BeanDictionaryComboTest
[INFO] Running org.apache.juneau.transforms.IteratorSwapTest
[INFO] Tests run: 1, Failures: 0, Errors: 0, Skipped: 0, Time elapsed: 0 s - in org.apache.juneau.transforms.IteratorSwapTest
[INFO] Running org.apache.juneau.transforms.ReaderFilterTest
[INFO] Tests run: 6, Failures: 0, Errors: 0, Skipped: 0, Time elapsed: 0.001 s - in org.apache.juneau.transforms.ReaderFilterTest
[INFO] Running org.apache.juneau.transforms.PojoSwapTest
[INFO] Tests run: 1, Failures: 0, Errors: 0, Skipped: 0, Time elapsed: 0.004 s - in org.apache.juneau.transforms.PojoSwapTest
[INFO] Running org.apache.juneau.cp.BeanFactory_Test
[INFO] Tests run: 18, Failures: 0, Errors: 0, Skipped: 0, Time elapsed: 0.022 s - in org.apache.juneau.cp.BeanFactory_Test
[INFO] Running org.apache.juneau.cp.FileFinder_Test
[INFO] Tests run: 21, Failures: 0, Errors: 0, Skipped: 0, Time elapsed: 0.329 s - in org.apache.juneau.cp.FileFinder_Test
[INFO] Running org.apache.juneau.cp.Messages_Test
[INFO] Tests run: 13, Failures: 0, Errors: 0, Skipped: 0, Time elapsed: 0.016 s - in org.apache.juneau.cp.Messages_Test
[INFO] Running org.apache.juneau.ClassMetaTest
[INFO] Tests run: 7, Failures: 0, Errors: 0, Skipped: 0, Time elapsed: 0.016 s - in org.apache.juneau.ClassMetaTest
[INFO] Running org.apache.juneau.reflection.ExecutableInfoTest
[INFO] Tests run: 53, Failures: 0, Errors: 0, Skipped: 0, Time elapsed: 0.018 s - in org.apache.juneau.reflection.ExecutableInfoTest
[INFO] Running org.apache.juneau.reflection.ConstructorInfoTest
[INFO] Tests run: 7, Failures: 0, Errors: 0, Skipped: 0, Time elapsed: 0.001 s - in org.apache.juneau.reflection.ConstructorInfoTest
[INFO] Running org.apache.juneau.reflection.MethodInfoTest
[INFO] Tests run: 21, Failures: 0, Errors: 0, Skipped: 0, Time elapsed: 0.017 s - in org.apache.juneau.reflection.MethodInfoTest
[INFO] Running org.apache.juneau.reflection.ClassInfoTest
[INFO] Tests run: 252, Failures: 0, Errors: 0, Skipped: 0, Time elapsed: 0.072 s - in org.apache.juneau.reflection.ClassInfoTest
[INFO] Running org.apache.juneau.reflection.ParamInfoTest
[INFO] Tests run: 33, Failures: 0, Errors: 0, Skipped: 0, Time elapsed: 0.009 s - in org.apache.juneau.reflection.ParamInfoTest
[INFO] Running org.apache.juneau.reflection.AnnotationInfoTest
[INFO] Tests run: 2, Failures: 0, Errors: 0, Skipped: 0, Time elapsed: 0.001 s - in org.apache.juneau.reflection.AnnotationInfoTest
[INFO] Running org.apache.juneau.reflection.FieldInfoTest
[INFO] Tests run: 28, Failures: 0, Errors: 0, Skipped: 0, Time elapsed: 0.007 s - in org.apache.juneau.reflection.FieldInfoTest
[INFO] Running org.apache.juneau.ParserReaderTest
[INFO] Tests run: 5, Failures: 0, Errors: 0, Skipped: 0, Time elapsed: 0 s - in org.apache.juneau.ParserReaderTest
[INFO] Running org.apache.juneau.PropertyNamerTest
[INFO] Tests run: 2, Failures: 0, Errors: 0, Skipped: 0, Time elapsed: 0 s - in org.apache.juneau.PropertyNamerTest
[INFO] Running org.apache.juneau.pojotools.PojoViewerTest
[INFO] Tests run: 38, Failures: 0, Errors: 0, Skipped: 0, Time elapsed: 0.01 s - in org.apache.juneau.pojotools.PojoViewerTest
[INFO] Running org.apache.juneau.pojotools.PojoSearcherTest
[WARNING] Tests run: 82, Failures: 0, Errors: 0, Skipped: 1, Time elapsed: 0.104 s - in org.apache.juneau.pojotools.PojoSearcherTest
[INFO] Running org.apache.juneau.pojotools.PojoSorterTest
[INFO] Tests run: 24, Failures: 0, Errors: 0, Skipped: 0, Time elapsed: 0.009 s - in org.apache.juneau.pojotools.PojoSorterTest
[INFO] Running org.apache.juneau.svl.vars.SystemPropertiesVarTest
[INFO] Tests run: 1, Failures: 0, Errors: 0, Skipped: 0, Time elapsed: 0 s - in org.apache.juneau.svl.vars.SystemPropertiesVarTest
[INFO] Running org.apache.juneau.svl.vars.SwitchVarTest
[INFO] Tests run: 1, Failures: 0, Errors: 0, Skipped: 0, Time elapsed: 0 s - in org.apache.juneau.svl.vars.SwitchVarTest
[INFO] Running org.apache.juneau.svl.vars.PatternExtractVarTest
[INFO] Tests run: 1, Failures: 0, Errors: 0, Skipped: 0, Time elapsed: 0 s - in org.apache.juneau.svl.vars.PatternExtractVarTest
[INFO] Running org.apache.juneau.svl.vars.SubstringVarTest
[INFO] Tests run: 1, Failures: 0, Errors: 0, Skipped: 0, Time elapsed: 0 s - in org.apache.juneau.svl.vars.SubstringVarTest
[INFO] Running org.apache.juneau.svl.vars.PatternReplaceVarTest
[INFO] Tests run: 1, Failures: 0, Errors: 0, Skipped: 0, Time elapsed: 0 s - in org.apache.juneau.svl.vars.PatternReplaceVarTest
[INFO] Running org.apache.juneau.svl.vars.LenVarTest
[INFO] Tests run: 1, Failures: 0, Errors: 0, Skipped: 0, Time elapsed: 0 s - in org.apache.juneau.svl.vars.LenVarTest
[INFO] Running org.apache.juneau.svl.vars.NotEmptyVarTest
[INFO] Tests run: 1, Failures: 0, Errors: 0, Skipped: 0, Time elapsed: 0 s - in org.apache.juneau.svl.vars.NotEmptyVarTest
[INFO] Running org.apache.juneau.svl.vars.LowerCaseVarTest
[INFO] Tests run: 1, Failures: 0, Errors: 0, Skipped: 0, Time elapsed: 0 s - in org.apache.juneau.svl.vars.LowerCaseVarTest
[INFO] Running org.apache.juneau.svl.vars.IfVarTest
[INFO] Tests run: 1, Failures: 0, Errors: 0, Skipped: 0, Time elapsed: 0 s - in org.apache.juneau.svl.vars.IfVarTest
[INFO] Running org.apache.juneau.svl.vars.PatternMatchVarTest
[INFO] Tests run: 1, Failures: 0, Errors: 0, Skipped: 0, Time elapsed: 0 s - in org.apache.juneau.svl.vars.PatternMatchVarTest
[INFO] Running org.apache.juneau.svl.vars.RestrictedVarsTest
[INFO] Tests run: 3, Failures: 0, Errors: 0, Skipped: 0, Time elapsed: 0 s - in org.apache.juneau.svl.vars.RestrictedVarsTest
[INFO] Running org.apache.juneau.svl.vars.UpperCaseVarTest
[INFO] Tests run: 1, Failures: 0, Errors: 0, Skipped: 0, Time elapsed: 0 s - in org.apache.juneau.svl.vars.UpperCaseVarTest
[INFO] Running org.apache.juneau.svl.ResolvingOMapTest
[INFO] Tests run: 4, Failures: 0, Errors: 0, Skipped: 0, Time elapsed: 0 s - in org.apache.juneau.svl.ResolvingOMapTest
[INFO] Running org.apache.juneau.dto.swagger.ResponseInfoTest
[INFO] Tests run: 11, Failures: 0, Errors: 0, Skipped: 0, Time elapsed: 0.02 s - in org.apache.juneau.dto.swagger.ResponseInfoTest
[INFO] Running org.apache.juneau.dto.swagger.HeaderInfoTest
[INFO] Tests run: 21, Failures: 0, Errors: 0, Skipped: 0, Time elapsed: 0.012 s - in org.apache.juneau.dto.swagger.HeaderInfoTest
[INFO] Running org.apache.juneau.dto.swagger.ExternalDocumentationTest
[INFO] Tests run: 3, Failures: 0, Errors: 0, Skipped: 0, Time elapsed: 0 s - in org.apache.juneau.dto.swagger.ExternalDocumentationTest
[INFO] Running org.apache.juneau.dto.swagger.ParameterInfoTest
[INFO] Tests run: 26, Failures: 0, Errors: 0, Skipped: 0, Time elapsed: 0.012 s - in org.apache.juneau.dto.swagger.ParameterInfoTest
[INFO] Running org.apache.juneau.dto.swagger.ItemsTest
[INFO] Tests run: 20, Failures: 0, Errors: 0, Skipped: 0, Time elapsed: 0.008 s - in org.apache.juneau.dto.swagger.ItemsTest
[INFO] Running org.apache.juneau.dto.swagger.OperationTest
[INFO] Tests run: 29, Failures: 0, Errors: 0, Skipped: 0, Time elapsed: 0.024 s - in org.apache.juneau.dto.swagger.OperationTest
[INFO] Running org.apache.juneau.dto.swagger.ContactTest
[INFO] Tests run: 4, Failures: 0, Errors: 0, Skipped: 0, Time elapsed: 0 s - in org.apache.juneau.dto.swagger.ContactTest
[INFO] Running org.apache.juneau.dto.swagger.SwaggerTest
[INFO] Tests run: 42, Failures: 0, Errors: 0, Skipped: 0, Time elapsed: 0.039 s - in org.apache.juneau.dto.swagger.SwaggerTest
[INFO] Running org.apache.juneau.dto.swagger.SecuritySchemeTest
[INFO] Tests run: 11, Failures: 0, Errors: 0, Skipped: 0, Time elapsed: 0.002 s - in org.apache.juneau.dto.swagger.SecuritySchemeTest
[INFO] Running org.apache.juneau.dto.swagger.XmlTest
[INFO] Tests run: 6, Failures: 0, Errors: 0, Skipped: 0, Time elapsed: 0 s - in org.apache.juneau.dto.swagger.XmlTest
[INFO] Running org.apache.juneau.dto.swagger.SwaggerBuilderTest
[INFO] Tests run: 31, Failures: 0, Errors: 0, Skipped: 0, Time elapsed: 0.007 s - in org.apache.juneau.dto.swagger.SwaggerBuilderTest
[INFO] Running org.apache.juneau.dto.swagger.InfoTest
[INFO] Tests run: 7, Failures: 0, Errors: 0, Skipped: 0, Time elapsed: 0 s - in org.apache.juneau.dto.swagger.InfoTest
[INFO] Running org.apache.juneau.dto.swagger.TagTest
[INFO] Tests run: 4, Failures: 0, Errors: 0, Skipped: 0, Time elapsed: 0.001 s - in org.apache.juneau.dto.swagger.TagTest
[INFO] Running org.apache.juneau.dto.swagger.LicenseTest
[INFO] Tests run: 3, Failures: 0, Errors: 0, Skipped: 0, Time elapsed: 0 s - in org.apache.juneau.dto.swagger.LicenseTest
[INFO] Running org.apache.juneau.dto.swagger.SchemaInfoTest
[INFO] Tests run: 37, Failures: 0, Errors: 0, Skipped: 0, Time elapsed: 0.01 s - in org.apache.juneau.dto.swagger.SchemaInfoTest
[INFO] Running org.apache.juneau.dto.jsonschema.JsonSchemaTest
[INFO] Tests run: 3, Failures: 0, Errors: 0, Skipped: 0, Time elapsed: 0.004 s - in org.apache.juneau.dto.jsonschema.JsonSchemaTest
[INFO] Running org.apache.juneau.dto.html5.Html5ComboTest
[INFO] Tests run: 5265, Failures: 0, Errors: 0, Skipped: 0, Time elapsed: 4.772 s - in org.apache.juneau.dto.html5.Html5ComboTest
[INFO] Running org.apache.juneau.dto.html5.Html5BasicTest
[INFO] Tests run: 1, Failures: 0, Errors: 0, Skipped: 0, Time elapsed: 0 s - in org.apache.juneau.dto.html5.Html5BasicTest
[INFO] Running org.apache.juneau.dto.html5.Html5TemplateComboTest
[INFO] Tests run: 65, Failures: 0, Errors: 0, Skipped: 0, Time elapsed: 0 s - in org.apache.juneau.dto.html5.Html5TemplateComboTest
[INFO] Running org.apache.juneau.dto.atom.AtomTest
[INFO] Tests run: 4, Failures: 0, Errors: 0, Skipped: 0, Time elapsed: 0.033 s - in org.apache.juneau.dto.atom.AtomTest
[INFO] Running org.apache.juneau.dto.cognos.CognosXmlTest
[INFO] Tests run: 1, Failures: 0, Errors: 0, Skipped: 0, Time elapsed: 0.008 s - in org.apache.juneau.dto.cognos.CognosXmlTest
[INFO] Running org.apache.juneau.SerializerPropertiesComboTest
[INFO] Tests run: 780, Failures: 0, Errors: 0, Skipped: 0, Time elapsed: 0.417 s - in org.apache.juneau.SerializerPropertiesComboTest
[INFO] Running org.apache.juneau.DataConversionTest
[INFO] Tests run: 2, Failures: 0, Errors: 0, Skipped: 0, Time elapsed: 0 s - in org.apache.juneau.DataConversionTest
[INFO] Running org.apache.juneau.OListTest
[INFO] Tests run: 6, Failures: 0, Errors: 0, Skipped: 0, Time elapsed: 0 s - in org.apache.juneau.OListTest
[INFO] Running org.apache.juneau.transform.AutoNumberSwapTest
[INFO] Tests run: 64, Failures: 0, Errors: 0, Skipped: 0, Time elapsed: 0.027 s - in org.apache.juneau.transform.AutoNumberSwapTest
[INFO] Running org.apache.juneau.transform.AutoMapSwapTest
[INFO] Tests run: 28, Failures: 0, Errors: 0, Skipped: 0, Time elapsed: 0.018 s - in org.apache.juneau.transform.AutoMapSwapTest
[INFO] Running org.apache.juneau.transform.AutoListSwapTest
[INFO] Tests run: 29, Failures: 0, Errors: 0, Skipped: 0, Time elapsed: 0.016 s - in org.apache.juneau.transform.AutoListSwapTest
[INFO] Running org.apache.juneau.transform.AutoObjectSwapTest
[INFO] Tests run: 27, Failures: 0, Errors: 0, Skipped: 0, Time elapsed: 0.015 s - in org.apache.juneau.transform.AutoObjectSwapTest
[INFO] Running org.apache.juneau.csv.annotation.CsvAnnotation_Test
[INFO] Tests run: 5, Failures: 0, Errors: 0, Skipped: 0, Time elapsed: 0.007 s - in org.apache.juneau.csv.annotation.CsvAnnotation_Test
[INFO] Running org.apache.juneau.csv.annotation.CsvConfig_Test
[INFO] Tests run: 4, Failures: 0, Errors: 0, Skipped: 0, Time elapsed: 0.019 s - in org.apache.juneau.csv.annotation.CsvConfig_Test
[INFO] Running org.apache.juneau.csv.Csv_Test
[INFO] Tests run: 1, Failures: 0, Errors: 0, Skipped: 0, Time elapsed: 0.001 s - in org.apache.juneau.csv.Csv_Test
[INFO] Running org.apache.juneau.PropertyStoreTest
[WARNING] Tests run: 67, Failures: 0, Errors: 0, Skipped: 1, Time elapsed: 0.055 s - in org.apache.juneau.PropertyStoreTest
[INFO] Running org.apache.juneau.assertions.StringAssertion_Test
[INFO] Tests run: 2, Failures: 0, Errors: 0, Skipped: 0, Time elapsed: 0.012 s - in org.apache.juneau.assertions.StringAssertion_Test
[INFO] Running org.apache.juneau.assertions.Assertions_Test
[INFO] Tests run: 2, Failures: 0, Errors: 0, Skipped: 0, Time elapsed: 0.003 s - in org.apache.juneau.assertions.Assertions_Test
[INFO] Running org.apache.juneau.assertions.ObjectAssertion_Test
[INFO] Tests run: 2, Failures: 0, Errors: 0, Skipped: 0, Time elapsed: 0.009 s - in org.apache.juneau.assertions.ObjectAssertion_Test
[INFO] Running org.apache.juneau.assertions.ArrayAssertion_Test
[INFO] Tests run: 2, Failures: 0, Errors: 0, Skipped: 0, Time elapsed: 0.002 s - in org.apache.juneau.assertions.ArrayAssertion_Test
[INFO] Running org.apache.juneau.assertions.CollectionAssertion_Test
[INFO] Tests run: 2, Failures: 0, Errors: 0, Skipped: 0, Time elapsed: 0.002 s - in org.apache.juneau.assertions.CollectionAssertion_Test
[INFO] Running org.apache.juneau.assertions.DateAssertion_Test
[INFO] Tests run: 2, Failures: 0, Errors: 0, Skipped: 0, Time elapsed: 0.007 s - in org.apache.juneau.assertions.DateAssertion_Test
[INFO] Running org.apache.juneau.assertions.ComparableAssertion_Test
[INFO] Tests run: 2, Failures: 0, Errors: 0, Skipped: 0, Time elapsed: 0.001 s - in org.apache.juneau.assertions.ComparableAssertion_Test
[INFO] Running org.apache.juneau.assertions.Verify_Test
[INFO] Tests run: 1, Failures: 0, Errors: 0, Skipped: 0, Time elapsed: 0 s - in org.apache.juneau.assertions.Verify_Test
[INFO] Running org.apache.juneau.assertions.ListAssertion_Test
[INFO] Tests run: 2, Failures: 0, Errors: 0, Skipped: 0, Time elapsed: 0.002 s - in org.apache.juneau.assertions.ListAssertion_Test
[INFO] Running org.apache.juneau.assertions.ByteArrayAssertion_Test
[INFO] Tests run: 2, Failures: 0, Errors: 0, Skipped: 0, Time elapsed: 0.003 s - in org.apache.juneau.assertions.ByteArrayAssertion_Test
[INFO] Running org.apache.juneau.assertions.ThrowableAssertion_Test
[INFO] Tests run: 2, Failures: 0, Errors: 0, Skipped: 0, Time elapsed: 0.006 s - in org.apache.juneau.assertions.ThrowableAssertion_Test
[INFO] Running org.apache.juneau.assertions.FluentIntegerAssertion_Test
[INFO] Tests run: 2, Failures: 0, Errors: 0, Skipped: 0, Time elapsed: 0.007 s - in org.apache.juneau.assertions.FluentIntegerAssertion_Test
[INFO] Running org.apache.juneau.assertions.FluentLongAssertion_Test
[INFO] Tests run: 2, Failures: 0, Errors: 0, Skipped: 0, Time elapsed: 0.006 s - in org.apache.juneau.assertions.FluentLongAssertion_Test
[INFO] Running org.apache.juneau.PojoSwapTest
[INFO] Tests run: 1, Failures: 0, Errors: 0, Skipped: 0, Time elapsed: 0.003 s - in org.apache.juneau.PojoSwapTest
[INFO] 
[INFO] Results:
[INFO] 
[ERROR] Failures: 
[ERROR]   ConfigBuilderTest.testGet_LONGRUNNING:60 Unexpected value.
	Expect=[{'':{},Test:{A:'b'}}]
	Actual=[{'':{},Test:{A:'a'}}]
[INFO] 
[ERROR] Tests run: 22702, Failures: 1, Errors: 0, Skipped: 4
[INFO] 
[INFO]                                                                         
[INFO] ------------------------------------------------------------------------
[INFO] Skipping juneau
[INFO] This project has been banned from the build due to previous failures.
[INFO] ------------------------------------------------------------------------
[INFO] ------------------------------------------------------------------------
[INFO] Reactor Summary:
[INFO] 
[INFO] juneau ............................................. SUCCESS [  6.820 s]
[INFO] juneau/core ........................................ SUCCESS [  2.552 s]
[INFO] juneau/core/marshall ............................... SUCCESS [ 58.910 s]
[INFO] juneau/core/marshall-rdf ........................... SUCCESS [ 12.130 s]
[INFO] juneau/core/dto .................................... SUCCESS [ 16.744 s]
[INFO] juneau/core/config ................................. SUCCESS [  9.550 s]
[INFO] juneau/rest ........................................ SUCCESS [  2.335 s]
[INFO] juneau/rest/rest-server ............................ SUCCESS [ 19.486 s]
[INFO] juneau/rest/rest-client ............................ SUCCESS [  9.893 s]
[INFO] juneau/rest/rest-mock .............................. SUCCESS [  9.956 s]
[INFO] juneau/rest/rest-server-rdf ........................ SUCCESS [ 10.723 s]
[INFO] juneau/core/core-utest ............................. FAILURE [ 50.686 s]
[INFO] juneau/rest/rest-server-jaxrs ...................... SKIPPED
[INFO] juneau/rest/rest-server-springboot ................. SKIPPED
[INFO] juneau/rest/rest-mock-utest ........................ SKIPPED
[INFO] juneau/rest/rest-server-utest ...................... SKIPPED
[INFO] juneau/rest/rest-client-utest ...................... SKIPPED
[INFO] juneau/microservice ................................ SKIPPED
[INFO] juneau/microservice/microservice-core .............. SKIPPED
[INFO] juneau/microservice/microservice-jetty ............. SKIPPED
[INFO] juneau/microservice/my-jetty-microservice .......... SKIPPED
[INFO] juneau/examples .................................... SKIPPED
[INFO] juneau/examples/rest ............................... SKIPPED
[INFO] juneau/microservice/microservice-ftest ............. SKIPPED
[INFO] juneau/microservice/my-springboot-microservice ..... SKIPPED
[INFO] juneau/sc .......................................... SKIPPED
[INFO] juneau/sc/sc-server ................................ SKIPPED
[INFO] juneau/sc/sc-client ................................ SKIPPED
[INFO] juneau/examples/examples-core ...................... SKIPPED
[INFO] juneau/examples/examples-rest-jetty ................ SKIPPED
[INFO] juneau/examples/examples-rest-springboot ........... SKIPPED
[INFO] juneau/examples/examples-rest-jetty-ftest .......... SKIPPED
[INFO] juneau/all ......................................... SKIPPED
[INFO] juneau/distrib ..................................... SKIPPED
[INFO] ------------------------------------------------------------------------
[INFO] BUILD FAILURE
[INFO] ------------------------------------------------------------------------
[INFO] Total time: 03:31 min
[INFO] Finished at: 2021-01-11T17:11:46+00:00
[INFO] Final Memory: 127M/4748M
[INFO] ------------------------------------------------------------------------
[ERROR] Failed to execute goal org.apache.maven.plugins:maven-surefire-plugin:2.22.0:test
(default-test) on project juneau-core-utest: There are test failures.
[ERROR] 
[ERROR] Please refer to <https://ci-builds.apache.org/job/Juneau/job/Juneau-Java-1.8/ws/juneau-core/juneau-core-utest/target/surefire-reports>
for the individual test results.
[ERROR] Please refer to dump files (if any exist) [date]-jvmRun[N].dump, [date].dumpstream
and [date]-jvmRun[N].dumpstream.
[ERROR] -> [Help 1]
[ERROR] 
[ERROR] To see the full stack trace of the errors, re-run Maven with the -e switch.
[ERROR] Re-run Maven using the -X switch to enable full debug logging.
[ERROR] 
[ERROR] For more information about the errors and possible solutions, please read the following
articles:
[ERROR] [Help 1] http://cwiki.apache.org/confluence/display/MAVEN/MojoFailureException
[ERROR] 
[ERROR] After correcting the problems, you can resume the build with the command
[ERROR]   mvn <goals> -rf :juneau-core-utest
Build step 'Invoke top-level Maven targets' marked build as failure
Recording test results
[TASKS] Skipping publisher since build result is FAILURE

Mime
View raw message