juneau-dev mailing list archives

Site index · List index
Message view « Date » · « Thread »
Top « Date » · « Thread »
From Apache Jenkins Server <jenk...@builds.apache.org>
Subject Build failed in Jenkins: Juneau » Juneau-Java-1.8 #59
Date Mon, 14 Dec 2020 22:26:09 GMT
See <https://ci-builds.apache.org/job/Juneau/job/Juneau-Java-1.8/59/display/redirect?page=changes>

Changes:

[lcc2] Fix unecessary closes

[lcc2] Fix synchronization issues for addAll

[lcc2] Fix flush outputstream before using it

[James Bognar] Fix Java 11 compilation errors/warnings.


------------------------------------------
[...truncated 1.14 MB...]
2/16 KB   4/16 KB   6/16 KB   8/16 KB   10/16 KB   12/16 KB   14/16 KB   16/16 KB        
     Uploaded: https://repository.apache.org/content/repositories/snapshots/org/apache/juneau/juneau-examples-rest-springboot/9.0.0-SNAPSHOT/juneau-examples-rest-springboot-9.0.0-20201214.222537-13-sources.jar
(16 KB at 31.5 KB/sec)
Uploading: https://repository.apache.org/content/repositories/snapshots/org/apache/juneau/juneau-examples-rest-springboot/9.0.0-SNAPSHOT/maven-metadata.xml
2/2 KB              Uploaded: https://repository.apache.org/content/repositories/snapshots/org/apache/juneau/juneau-examples-rest-springboot/9.0.0-SNAPSHOT/maven-metadata.xml
(2 KB at 2.3 KB/sec)
[INFO]                                                                         
[INFO] ------------------------------------------------------------------------
[INFO] Building juneau/examples/examples-rest-jetty-ftest 9.0.0-SNAPSHOT
[INFO] ------------------------------------------------------------------------
[INFO] 
[INFO] --- maven-clean-plugin:3.1.0:clean (default-clean) @ juneau-examples-rest-jetty-ftest
---
[INFO] Deleting <https://ci-builds.apache.org/job/Juneau/job/Juneau-Java-1.8/ws/juneau-examples/juneau-examples-rest-jetty-ftest/target>
[INFO] 
[INFO] --- maven-enforcer-plugin:1.4.1:enforce (enforce-maven-version) @ juneau-examples-rest-jetty-ftest
---
[INFO] 
[INFO] --- maven-enforcer-plugin:1.4.1:enforce (enforce-maven) @ juneau-examples-rest-jetty-ftest
---
[INFO] 
[INFO] --- jacoco-maven-plugin:0.8.2:prepare-agent (default-prepare-agent) @ juneau-examples-rest-jetty-ftest
---
[INFO] argLine set to -javaagent:/home/jenkins/.m2/repository/org/jacoco/org.jacoco.agent/0.8.2/org.jacoco.agent-0.8.2-runtime.jar=destfile=<https://ci-builds.apache.org/job/Juneau/job/Juneau-Java-1.8/ws/juneau-examples/juneau-examples-rest-jetty-ftest/target/jacoco.exec>
[INFO] 
[INFO] --- maven-remote-resources-plugin:1.5:process (process-resource-bundles) @ juneau-examples-rest-jetty-ftest
---
[INFO] 
[INFO] --- maven-resources-plugin:3.1.0:resources (default-resources) @ juneau-examples-rest-jetty-ftest
---
[INFO] Using 'UTF-8' encoding to copy filtered resources.
[INFO] skip non existing resourceDirectory <https://ci-builds.apache.org/job/Juneau/job/Juneau-Java-1.8/ws/juneau-examples/juneau-examples-rest-jetty-ftest/src/main/resources>
[INFO] Copying 3 resources
[INFO] 
[INFO] --- maven-compiler-plugin:3.7.0:compile (default-compile) @ juneau-examples-rest-jetty-ftest
---
[INFO] Nothing to compile - all classes are up to date
[INFO] 
[INFO] --- maven-resources-plugin:3.1.0:testResources (default-testResources) @ juneau-examples-rest-jetty-ftest
---
[INFO] Using 'UTF-8' encoding to copy filtered resources.
[INFO] skip non existing resourceDirectory <https://ci-builds.apache.org/job/Juneau/job/Juneau-Java-1.8/ws/juneau-examples/juneau-examples-rest-jetty-ftest/src/test/resources>
[INFO] Copying 3 resources
[INFO] 
[INFO] --- maven-compiler-plugin:3.7.0:testCompile (default-testCompile) @ juneau-examples-rest-jetty-ftest
---
[INFO] Changes detected - recompiling the module!
[INFO] Compiling 7 source files to <https://ci-builds.apache.org/job/Juneau/job/Juneau-Java-1.8/ws/juneau-examples/juneau-examples-rest-jetty-ftest/target/test-classes>
[INFO] 
[INFO] --- maven-surefire-plugin:2.22.0:test (default-test) @ juneau-examples-rest-jetty-ftest
---
[INFO] 
[INFO] -------------------------------------------------------
[INFO]  T E S T S
[INFO] -------------------------------------------------------
[INFO] Running org.apache.juneau.examples.rest._TestSuite
Running class 'JettyMicroservice' using config file 'juneau-examples-rest-jetty.cfg'.
Server started on port 10000
SLF4J: Failed to load class "org.slf4j.impl.StaticLoggerBinder".
SLF4J: Defaulting to no-operation (NOP) logger implementation
SLF4J: See http://www.slf4j.org/codes.html#StaticLoggerBinder for further details.
Stopping server.
Server stopped.
[INFO] Tests run: 24, Failures: 0, Errors: 0, Skipped: 0, Time elapsed: 7.059 s - in org.apache.juneau.examples.rest._TestSuite
[INFO] 
[INFO] Results:
[INFO] 
[INFO] Tests run: 24, Failures: 0, Errors: 0, Skipped: 0
[INFO] 
[INFO] 
[INFO] --- jacoco-maven-plugin:0.8.2:report (default-report) @ juneau-examples-rest-jetty-ftest
---
[INFO] Loading execution data file <https://ci-builds.apache.org/job/Juneau/job/Juneau-Java-1.8/ws/juneau-examples/juneau-examples-rest-jetty-ftest/target/jacoco.exec>
[INFO] Analyzed bundle 'juneau/examples/examples-rest-jetty-ftest' with 0 classes
[INFO] 
[INFO] --- maven-jar-plugin:3.1.0:jar (default-jar) @ juneau-examples-rest-jetty-ftest ---
[INFO] Building jar: <https://ci-builds.apache.org/job/Juneau/job/Juneau-Java-1.8/ws/juneau-examples/juneau-examples-rest-jetty-ftest/target/juneau-examples-rest-jetty-ftest-9.0.0-SNAPSHOT.jar>
[INFO] 
[INFO] --- maven-site-plugin:3.7.1:attach-descriptor (attach-descriptor) @ juneau-examples-rest-jetty-ftest
---
[INFO] Skipping because packaging 'jar' is not pom.
[INFO] 
[INFO] --- apache-rat-plugin:0.12:check (default) @ juneau-examples-rest-jetty-ftest ---
[INFO] Enabled default license matchers.
[INFO] Will parse SCM ignores for exclusions...
[INFO] Parsing exclusions from <https://ci-builds.apache.org/job/Juneau/job/Juneau-Java-1.8/ws/juneau-examples/juneau-examples-rest-jetty-ftest/.gitignore>
[INFO] Finished adding exclusions from SCM ignore files.
[INFO] 65 implicit excludes (use -debug for more details).
[INFO] Exclude: **/DEPENDENCIES
[INFO] Exclude: **/target/**
[INFO] Exclude: **/empty.txt
[INFO] Exclude: **/TODO.txt
[INFO] Exclude: **/.settings/**
[INFO] Exclude: **/.project
[INFO] Exclude: **/.classpath
[INFO] Exclude: **/*.launch
[INFO] Exclude: **/*.prefs
[INFO] Exclude: **/*.2
[INFO] Exclude: **/jetty.out.xml
[INFO] Exclude: **/*.log
[INFO] Exclude: **/dependency-reduced-pom.xml
[INFO] Exclude: **/docs.txt
[INFO] Exclude: **/toc.txt
[INFO] Exclude: **/app.json
[INFO] Exclude: **/Procfile
[INFO] 8 resources included (use -debug for more details)
[INFO] Rat check: Summary over all files. Unapproved: 0, unknown: 0, generated: 0, approved:
8 licenses.
[INFO] 
[INFO] --- maven-install-plugin:2.5.2:install (default-install) @ juneau-examples-rest-jetty-ftest
---
[INFO] Installing <https://ci-builds.apache.org/job/Juneau/job/Juneau-Java-1.8/ws/juneau-examples/juneau-examples-rest-jetty-ftest/target/juneau-examples-rest-jetty-ftest-9.0.0-SNAPSHOT.jar>
to /home/jenkins/.m2/repository/org/apache/juneau/juneau-examples-rest-jetty-ftest/9.0.0-SNAPSHOT/juneau-examples-rest-jetty-ftest-9.0.0-SNAPSHOT.jar
[INFO] Installing <https://ci-builds.apache.org/job/Juneau/job/Juneau-Java-1.8/ws/juneau-examples/juneau-examples-rest-jetty-ftest/pom.xml>
to /home/jenkins/.m2/repository/org/apache/juneau/juneau-examples-rest-jetty-ftest/9.0.0-SNAPSHOT/juneau-examples-rest-jetty-ftest-9.0.0-SNAPSHOT.pom
[INFO] 
[INFO] --- maven-enforcer-plugin:1.4.1:enforce (enforce-maven-version) @ juneau-examples-rest-jetty-ftest
---
[INFO] 
[INFO] --- maven-enforcer-plugin:1.4.1:enforce (enforce-maven) @ juneau-examples-rest-jetty-ftest
---
[INFO] 
[INFO] --- jacoco-maven-plugin:0.8.2:prepare-agent (default-prepare-agent) @ juneau-examples-rest-jetty-ftest
---
[INFO] argLine set to -javaagent:/home/jenkins/.m2/repository/org/jacoco/org.jacoco.agent/0.8.2/org.jacoco.agent-0.8.2-runtime.jar=destfile=<https://ci-builds.apache.org/job/Juneau/job/Juneau-Java-1.8/ws/juneau-examples/juneau-examples-rest-jetty-ftest/target/jacoco.exec>
[INFO] 
[INFO] --- maven-remote-resources-plugin:1.5:process (process-resource-bundles) @ juneau-examples-rest-jetty-ftest
---
[INFO] 
[INFO] --- maven-resources-plugin:3.1.0:resources (default-resources) @ juneau-examples-rest-jetty-ftest
---
[INFO] Using 'UTF-8' encoding to copy filtered resources.
[INFO] skip non existing resourceDirectory <https://ci-builds.apache.org/job/Juneau/job/Juneau-Java-1.8/ws/juneau-examples/juneau-examples-rest-jetty-ftest/src/main/resources>
[INFO] Copying 3 resources
[INFO] Copying 3 resources
[INFO] 
[INFO] --- maven-compiler-plugin:3.7.0:compile (default-compile) @ juneau-examples-rest-jetty-ftest
---
[INFO] Nothing to compile - all classes are up to date
[INFO] 
[INFO] --- maven-resources-plugin:3.1.0:testResources (default-testResources) @ juneau-examples-rest-jetty-ftest
---
[INFO] Using 'UTF-8' encoding to copy filtered resources.
[INFO] skip non existing resourceDirectory <https://ci-builds.apache.org/job/Juneau/job/Juneau-Java-1.8/ws/juneau-examples/juneau-examples-rest-jetty-ftest/src/test/resources>
[INFO] Copying 3 resources
[INFO] Copying 3 resources
[INFO] 
[INFO] --- maven-compiler-plugin:3.7.0:testCompile (default-testCompile) @ juneau-examples-rest-jetty-ftest
---
[INFO] Nothing to compile - all classes are up to date
[INFO] 
[INFO] --- maven-surefire-plugin:2.22.0:test (default-test) @ juneau-examples-rest-jetty-ftest
---
[INFO] Skipping execution of surefire because it has already been run for this configuration
[INFO] 
[INFO] --- jacoco-maven-plugin:0.8.2:report (default-report) @ juneau-examples-rest-jetty-ftest
---
[INFO] Loading execution data file <https://ci-builds.apache.org/job/Juneau/job/Juneau-Java-1.8/ws/juneau-examples/juneau-examples-rest-jetty-ftest/target/jacoco.exec>
[INFO] Analyzed bundle 'juneau/examples/examples-rest-jetty-ftest' with 0 classes
[INFO] 
[INFO] --- maven-jar-plugin:3.1.0:jar (default-jar) @ juneau-examples-rest-jetty-ftest ---
[INFO] Building jar: <https://ci-builds.apache.org/job/Juneau/job/Juneau-Java-1.8/ws/juneau-examples/juneau-examples-rest-jetty-ftest/target/juneau-examples-rest-jetty-ftest-9.0.0-SNAPSHOT.jar>
[INFO] 
[INFO] --- maven-site-plugin:3.7.1:attach-descriptor (attach-descriptor) @ juneau-examples-rest-jetty-ftest
---
[INFO] Skipping because packaging 'jar' is not pom.
[INFO] 
[INFO] --- apache-rat-plugin:0.12:check (default) @ juneau-examples-rest-jetty-ftest ---
[INFO] Enabled default license matchers.
[INFO] Will parse SCM ignores for exclusions...
[INFO] Parsing exclusions from <https://ci-builds.apache.org/job/Juneau/job/Juneau-Java-1.8/ws/juneau-examples/juneau-examples-rest-jetty-ftest/.gitignore>
[INFO] Finished adding exclusions from SCM ignore files.
[INFO] 65 implicit excludes (use -debug for more details).
[INFO] Exclude: **/DEPENDENCIES
[INFO] Exclude: **/target/**
[INFO] Exclude: **/empty.txt
[INFO] Exclude: **/TODO.txt
[INFO] Exclude: **/.settings/**
[INFO] Exclude: **/.project
[INFO] Exclude: **/.classpath
[INFO] Exclude: **/*.launch
[INFO] Exclude: **/*.prefs
[INFO] Exclude: **/*.2
[INFO] Exclude: **/jetty.out.xml
[INFO] Exclude: **/*.log
[INFO] Exclude: **/dependency-reduced-pom.xml
[INFO] Exclude: **/docs.txt
[INFO] Exclude: **/toc.txt
[INFO] Exclude: **/app.json
[INFO] Exclude: **/Procfile
[INFO] 8 resources included (use -debug for more details)
[INFO] Rat check: Summary over all files. Unapproved: 0, unknown: 0, generated: 0, approved:
8 licenses.
[INFO] 
[INFO] --- maven-install-plugin:2.5.2:install (default-install) @ juneau-examples-rest-jetty-ftest
---
[INFO] Installing <https://ci-builds.apache.org/job/Juneau/job/Juneau-Java-1.8/ws/juneau-examples/juneau-examples-rest-jetty-ftest/target/juneau-examples-rest-jetty-ftest-9.0.0-SNAPSHOT.jar>
to /home/jenkins/.m2/repository/org/apache/juneau/juneau-examples-rest-jetty-ftest/9.0.0-SNAPSHOT/juneau-examples-rest-jetty-ftest-9.0.0-SNAPSHOT.jar
[INFO] Installing <https://ci-builds.apache.org/job/Juneau/job/Juneau-Java-1.8/ws/juneau-examples/juneau-examples-rest-jetty-ftest/pom.xml>
to /home/jenkins/.m2/repository/org/apache/juneau/juneau-examples-rest-jetty-ftest/9.0.0-SNAPSHOT/juneau-examples-rest-jetty-ftest-9.0.0-SNAPSHOT.pom
[INFO] 
[INFO] --- maven-deploy-plugin:2.8.2:deploy (default-deploy) @ juneau-examples-rest-jetty-ftest
---
Downloading: https://repository.apache.org/content/repositories/snapshots/org/apache/juneau/juneau-examples-rest-jetty-ftest/9.0.0-SNAPSHOT/maven-metadata.xml
802/802 B               Downloaded: https://repository.apache.org/content/repositories/snapshots/org/apache/juneau/juneau-examples-rest-jetty-ftest/9.0.0-SNAPSHOT/maven-metadata.xml
(802 B at 1.4 KB/sec)
Uploading: https://repository.apache.org/content/repositories/snapshots/org/apache/juneau/juneau-examples-rest-jetty-ftest/9.0.0-SNAPSHOT/juneau-examples-rest-jetty-ftest-9.0.0-20201214.222559-13.jar
2/10 KB     4/10 KB   6/10 KB   8/10 KB   10/10 KB              Uploaded: https://repository.apache.org/content/repositories/snapshots/org/apache/juneau/juneau-examples-rest-jetty-ftest/9.0.0-SNAPSHOT/juneau-examples-rest-jetty-ftest-9.0.0-20201214.222559-13.jar
(10 KB at 18.3 KB/sec)
Uploading: https://repository.apache.org/content/repositories/snapshots/org/apache/juneau/juneau-examples-rest-jetty-ftest/9.0.0-SNAPSHOT/juneau-examples-rest-jetty-ftest-9.0.0-20201214.222559-13.pom
2/4 KB     4/4 KB            Uploaded: https://repository.apache.org/content/repositories/snapshots/org/apache/juneau/juneau-examples-rest-jetty-ftest/9.0.0-SNAPSHOT/juneau-examples-rest-jetty-ftest-9.0.0-20201214.222559-13.pom
(4 KB at 7.7 KB/sec)
Downloading: https://repository.apache.org/content/repositories/snapshots/org/apache/juneau/juneau-examples-rest-jetty-ftest/maven-metadata.xml
489/489 B               Downloaded: https://repository.apache.org/content/repositories/snapshots/org/apache/juneau/juneau-examples-rest-jetty-ftest/maven-metadata.xml
(489 B at 1.1 KB/sec)
Uploading: https://repository.apache.org/content/repositories/snapshots/org/apache/juneau/juneau-examples-rest-jetty-ftest/9.0.0-SNAPSHOT/maven-metadata.xml
802/802 B               Uploaded: https://repository.apache.org/content/repositories/snapshots/org/apache/juneau/juneau-examples-rest-jetty-ftest/9.0.0-SNAPSHOT/maven-metadata.xml
(802 B at 1.3 KB/sec)
Uploading: https://repository.apache.org/content/repositories/snapshots/org/apache/juneau/juneau-examples-rest-jetty-ftest/maven-metadata.xml
489/489 B               Uploaded: https://repository.apache.org/content/repositories/snapshots/org/apache/juneau/juneau-examples-rest-jetty-ftest/maven-metadata.xml
(489 B at 1.0 KB/sec)
[INFO]                                                                         
[INFO] ------------------------------------------------------------------------
[INFO] Building juneau/doc 9.0.0-SNAPSHOT
[INFO] ------------------------------------------------------------------------
[INFO]                                                                         
[INFO] ------------------------------------------------------------------------
[INFO] Skipping juneau
[INFO] This project has been banned from the build due to previous failures.
[INFO] ------------------------------------------------------------------------
[INFO] ------------------------------------------------------------------------
[INFO] Reactor Summary:
[INFO] 
[INFO] juneau ............................................. SUCCESS [ 16.406 s]
[INFO] juneau/core ........................................ SUCCESS [  3.132 s]
[INFO] juneau/core/marshall ............................... SUCCESS [ 58.756 s]
[INFO] juneau/core/marshall-rdf ........................... SUCCESS [ 11.378 s]
[INFO] juneau/core/dto .................................... SUCCESS [ 12.329 s]
[INFO] juneau/core/config ................................. SUCCESS [ 10.239 s]
[INFO] juneau/rest ........................................ SUCCESS [  5.470 s]
[INFO] juneau/rest/rest-server ............................ SUCCESS [ 17.273 s]
[INFO] juneau/rest/rest-client ............................ SUCCESS [ 10.178 s]
[INFO] juneau/rest/rest-mock .............................. SUCCESS [ 13.170 s]
[INFO] juneau/rest/rest-server-rdf ........................ SUCCESS [ 13.138 s]
[INFO] juneau/core/core-utest ............................. SUCCESS [01:04 min]
[INFO] juneau/rest/rest-server-jaxrs ...................... SUCCESS [  8.753 s]
[INFO] juneau/rest/rest-server-springboot ................. SUCCESS [ 16.959 s]
[INFO] juneau/rest/rest-mock-utest ........................ SUCCESS [ 12.584 s]
[INFO] juneau/rest/rest-server-utest ...................... SUCCESS [ 28.048 s]
[INFO] juneau/rest/rest-client-utest ...................... SUCCESS [ 15.371 s]
[INFO] juneau/microservice ................................ SUCCESS [  3.534 s]
[INFO] juneau/microservice/microservice-core .............. SUCCESS [  6.465 s]
[INFO] juneau/microservice/microservice-jetty ............. SUCCESS [  6.804 s]
[INFO] juneau/microservice/my-jetty-microservice .......... SUCCESS [  6.977 s]
[INFO] juneau/examples .................................... SUCCESS [  2.618 s]
[INFO] juneau/examples/rest ............................... SUCCESS [  8.610 s]
[INFO] juneau/microservice/microservice-ftest ............. SUCCESS [ 35.808 s]
[INFO] juneau/microservice/my-springboot-microservice ..... SUCCESS [  7.869 s]
[INFO] juneau/sc .......................................... SUCCESS [  2.477 s]
[INFO] juneau/sc/sc-server ................................ SUCCESS [  8.400 s]
[INFO] juneau/sc/sc-client ................................ SUCCESS [  6.349 s]
[INFO] juneau/examples/examples-core ...................... SUCCESS [  7.015 s]
[INFO] juneau/examples/examples-rest-jetty ................ SUCCESS [  9.382 s]
[INFO] juneau/examples/examples-rest-springboot ........... SUCCESS [ 17.925 s]
[INFO] juneau/examples/examples-rest-jetty-ftest .......... SUCCESS [ 12.491 s]
[INFO] juneau/doc ......................................... FAILURE [  0.015 s]
[INFO] juneau/releng ...................................... SKIPPED
[INFO] juneau/releng/all .................................. SKIPPED
[INFO] juneau/releng/distrib .............................. SKIPPED
[INFO] ------------------------------------------------------------------------
[INFO] BUILD FAILURE
[INFO] ------------------------------------------------------------------------
[INFO] Total time: 07:42 min
[INFO] Finished at: 2020-12-14T22:26:02+00:00
[INFO] Final Memory: 162M/4783M
[INFO] ------------------------------------------------------------------------
[ERROR] Failed to execute goal on project juneau-doc: Could not resolve dependencies for project
org.apache.juneau:juneau-doc:bundle:9.0.0-SNAPSHOT: Could not find artifact com.sun:tools:jar:1.8.0
at specified path /Library/Java/JavaVirtualMachines/sfdc-openjdk1.8.0_212.jdk/Contents/Home/lib/tools.jar
-> [Help 1]
[ERROR] 
[ERROR] To see the full stack trace of the errors, re-run Maven with the -e switch.
[ERROR] Re-run Maven using the -X switch to enable full debug logging.
[ERROR] 
[ERROR] For more information about the errors and possible solutions, please read the following
articles:
[ERROR] [Help 1] http://cwiki.apache.org/confluence/display/MAVEN/DependencyResolutionException
[ERROR] 
[ERROR] After correcting the problems, you can resume the build with the command
[ERROR]   mvn <goals> -rf :juneau-doc
Build step 'Invoke top-level Maven targets' marked build as failure
Recording test results
[TASKS] Skipping publisher since build result is FAILURE
Not sending mail to unregistered user lcc2@cesar.org.br

Mime
View raw message