juneau-dev mailing list archives

Site index · List index
Message view « Date » · « Thread »
Top « Date » · « Thread »
From Apache Jenkins Server <jenk...@builds.apache.org>
Subject Build failed in Jenkins: Juneau » Juneau-Java-1.8 #57
Date Sun, 06 Dec 2020 15:03:53 GMT
See <https://ci-builds.apache.org/job/Juneau/job/Juneau-Java-1.8/57/display/redirect?page=changes>

Changes:

[lcc2] Fix unecessary closes

[lcc2] Fix synchronization issues for addAll

[lcc2] Fix flush outputstream before using it


------------------------------------------
[...truncated 8.35 KB...]
[INFO] Exclude: **/app.json
[INFO] Exclude: **/Procfile
[INFO] 21 resources included (use -debug for more details)
[INFO] Rat check: Summary over all files. Unapproved: 0, unknown: 0, generated: 0, approved:
18 licenses.
[INFO] 
[INFO] --- maven-install-plugin:2.5.2:install (default-install) @ juneau ---
[INFO] Installing <https://ci-builds.apache.org/job/Juneau/job/Juneau-Java-1.8/ws/pom.xml>
to /home/jenkins/.m2/repository/org/apache/juneau/juneau/9.0.0-SNAPSHOT/juneau-9.0.0-SNAPSHOT.pom
[INFO] 
[INFO] --- maven-enforcer-plugin:1.4.1:enforce (enforce-maven-version) @ juneau ---
[INFO] 
[INFO] --- maven-enforcer-plugin:1.4.1:enforce (enforce-maven) @ juneau ---
[INFO] 
[INFO] --- maven-remote-resources-plugin:1.5:process (process-resource-bundles) @ juneau ---
[INFO] 
[INFO] --- maven-site-plugin:3.7.1:attach-descriptor (attach-descriptor) @ juneau ---
[INFO] No site descriptor found: nothing to attach.
[INFO] 
[INFO] --- apache-rat-plugin:0.12:check (default) @ juneau ---
[INFO] Enabled default license matchers.
[INFO] Will parse SCM ignores for exclusions...
[INFO] Parsing exclusions from <https://ci-builds.apache.org/job/Juneau/job/Juneau-Java-1.8/ws/.gitignore>
[INFO] Finished adding exclusions from SCM ignore files.
[INFO] 72 implicit excludes (use -debug for more details).
[INFO] Exclude: **/DEPENDENCIES
[INFO] Exclude: **/target/**
[INFO] Exclude: **/empty.txt
[INFO] Exclude: **/TODO.txt
[INFO] Exclude: **/.settings/**
[INFO] Exclude: **/.project
[INFO] Exclude: **/.classpath
[INFO] Exclude: **/*.launch
[INFO] Exclude: **/*.prefs
[INFO] Exclude: **/*.2
[INFO] Exclude: **/jetty.out.xml
[INFO] Exclude: **/*.log
[INFO] Exclude: **/dependency-reduced-pom.xml
[INFO] Exclude: **/docs.txt
[INFO] Exclude: **/toc.txt
[INFO] Exclude: **/app.json
[INFO] Exclude: **/Procfile
[INFO] 21 resources included (use -debug for more details)
[INFO] Rat check: Summary over all files. Unapproved: 0, unknown: 0, generated: 0, approved:
18 licenses.
[INFO] 
[INFO] --- maven-install-plugin:2.5.2:install (default-install) @ juneau ---
[INFO] Installing <https://ci-builds.apache.org/job/Juneau/job/Juneau-Java-1.8/ws/pom.xml>
to /home/jenkins/.m2/repository/org/apache/juneau/juneau/9.0.0-SNAPSHOT/juneau-9.0.0-SNAPSHOT.pom
[INFO] 
[INFO] --- maven-deploy-plugin:2.8.2:deploy (default-deploy) @ juneau ---
Downloading: https://repository.apache.org/content/repositories/snapshots/org/apache/juneau/juneau/9.0.0-SNAPSHOT/maven-metadata.xml
602/602 B               Downloaded: https://repository.apache.org/content/repositories/snapshots/org/apache/juneau/juneau/9.0.0-SNAPSHOT/maven-metadata.xml
(602 B at 0.4 KB/sec)
Uploading: https://repository.apache.org/content/repositories/snapshots/org/apache/juneau/juneau/9.0.0-SNAPSHOT/juneau-9.0.0-20201206.150340-12.pom
2/15 KB     4/15 KB   6/15 KB   8/15 KB   10/15 KB   12/15 KB   14/15 KB   15/15 KB      
       Uploaded: https://repository.apache.org/content/repositories/snapshots/org/apache/juneau/juneau/9.0.0-SNAPSHOT/juneau-9.0.0-20201206.150340-12.pom
(15 KB at 20.7 KB/sec)
Downloading: https://repository.apache.org/content/repositories/snapshots/org/apache/juneau/juneau/maven-metadata.xml
838/838 B               Downloaded: https://repository.apache.org/content/repositories/snapshots/org/apache/juneau/juneau/maven-metadata.xml
(838 B at 1.6 KB/sec)
Uploading: https://repository.apache.org/content/repositories/snapshots/org/apache/juneau/juneau/9.0.0-SNAPSHOT/maven-metadata.xml
602/602 B               Uploaded: https://repository.apache.org/content/repositories/snapshots/org/apache/juneau/juneau/9.0.0-SNAPSHOT/maven-metadata.xml
(602 B at 1.0 KB/sec)
Uploading: https://repository.apache.org/content/repositories/snapshots/org/apache/juneau/juneau/maven-metadata.xml
838/838 B               Uploaded: https://repository.apache.org/content/repositories/snapshots/org/apache/juneau/juneau/maven-metadata.xml
(838 B at 1.4 KB/sec)
[INFO]                                                                         
[INFO] ------------------------------------------------------------------------
[INFO] Building juneau/core 9.0.0-SNAPSHOT
[INFO] ------------------------------------------------------------------------
[INFO] 
[INFO] --- maven-clean-plugin:3.1.0:clean (default-clean) @ juneau-core ---
[INFO] 
[INFO] --- maven-enforcer-plugin:1.4.1:enforce (enforce-maven-version) @ juneau-core ---
[INFO] 
[INFO] --- maven-enforcer-plugin:1.4.1:enforce (enforce-maven) @ juneau-core ---
[INFO] 
[INFO] --- maven-remote-resources-plugin:1.5:process (process-resource-bundles) @ juneau-core
---
[INFO] 
[INFO] --- maven-site-plugin:3.7.1:attach-descriptor (attach-descriptor) @ juneau-core ---
[INFO] No site descriptor found: nothing to attach.
[INFO] 
[INFO] --- apache-rat-plugin:0.12:check (default) @ juneau-core ---
[INFO] Enabled default license matchers.
[INFO] Will parse SCM ignores for exclusions...
[INFO] Parsing exclusions from <https://ci-builds.apache.org/job/Juneau/job/Juneau-Java-1.8/ws/juneau-core/.gitignore>
[INFO] Finished adding exclusions from SCM ignore files.
[INFO] 69 implicit excludes (use -debug for more details).
[INFO] Exclude: **/DEPENDENCIES
[INFO] Exclude: **/target/**
[INFO] Exclude: **/empty.txt
[INFO] Exclude: **/TODO.txt
[INFO] Exclude: **/.settings/**
[INFO] Exclude: **/.project
[INFO] Exclude: **/.classpath
[INFO] Exclude: **/*.launch
[INFO] Exclude: **/*.prefs
[INFO] Exclude: **/*.2
[INFO] Exclude: **/jetty.out.xml
[INFO] Exclude: **/*.log
[INFO] Exclude: **/dependency-reduced-pom.xml
[INFO] Exclude: **/docs.txt
[INFO] Exclude: **/toc.txt
[INFO] Exclude: **/app.json
[INFO] Exclude: **/Procfile
[INFO] 1 resources included (use -debug for more details)
[INFO] Rat check: Summary over all files. Unapproved: 0, unknown: 0, generated: 0, approved:
1 licenses.
[INFO] 
[INFO] --- maven-install-plugin:2.5.2:install (default-install) @ juneau-core ---
[INFO] Installing <https://ci-builds.apache.org/job/Juneau/job/Juneau-Java-1.8/ws/juneau-core/pom.xml>
to /home/jenkins/.m2/repository/org/apache/juneau/juneau-core/9.0.0-SNAPSHOT/juneau-core-9.0.0-SNAPSHOT.pom
[INFO] 
[INFO] --- maven-enforcer-plugin:1.4.1:enforce (enforce-maven-version) @ juneau-core ---
[INFO] 
[INFO] --- maven-enforcer-plugin:1.4.1:enforce (enforce-maven) @ juneau-core ---
[INFO] 
[INFO] --- maven-remote-resources-plugin:1.5:process (process-resource-bundles) @ juneau-core
---
[INFO] 
[INFO] --- maven-site-plugin:3.7.1:attach-descriptor (attach-descriptor) @ juneau-core ---
[INFO] No site descriptor found: nothing to attach.
[INFO] 
[INFO] --- apache-rat-plugin:0.12:check (default) @ juneau-core ---
[INFO] Enabled default license matchers.
[INFO] Will parse SCM ignores for exclusions...
[INFO] Parsing exclusions from <https://ci-builds.apache.org/job/Juneau/job/Juneau-Java-1.8/ws/juneau-core/.gitignore>
[INFO] Finished adding exclusions from SCM ignore files.
[INFO] 69 implicit excludes (use -debug for more details).
[INFO] Exclude: **/DEPENDENCIES
[INFO] Exclude: **/target/**
[INFO] Exclude: **/empty.txt
[INFO] Exclude: **/TODO.txt
[INFO] Exclude: **/.settings/**
[INFO] Exclude: **/.project
[INFO] Exclude: **/.classpath
[INFO] Exclude: **/*.launch
[INFO] Exclude: **/*.prefs
[INFO] Exclude: **/*.2
[INFO] Exclude: **/jetty.out.xml
[INFO] Exclude: **/*.log
[INFO] Exclude: **/dependency-reduced-pom.xml
[INFO] Exclude: **/docs.txt
[INFO] Exclude: **/toc.txt
[INFO] Exclude: **/app.json
[INFO] Exclude: **/Procfile
[INFO] 1 resources included (use -debug for more details)
[INFO] Rat check: Summary over all files. Unapproved: 0, unknown: 0, generated: 0, approved:
1 licenses.
[INFO] 
[INFO] --- maven-install-plugin:2.5.2:install (default-install) @ juneau-core ---
[INFO] Installing <https://ci-builds.apache.org/job/Juneau/job/Juneau-Java-1.8/ws/juneau-core/pom.xml>
to /home/jenkins/.m2/repository/org/apache/juneau/juneau-core/9.0.0-SNAPSHOT/juneau-core-9.0.0-SNAPSHOT.pom
[INFO] 
[INFO] --- maven-deploy-plugin:2.8.2:deploy (default-deploy) @ juneau-core ---
Downloading: https://repository.apache.org/content/repositories/snapshots/org/apache/juneau/juneau-core/9.0.0-SNAPSHOT/maven-metadata.xml
607/607 B               Downloaded: https://repository.apache.org/content/repositories/snapshots/org/apache/juneau/juneau-core/9.0.0-SNAPSHOT/maven-metadata.xml
(607 B at 1.4 KB/sec)
Uploading: https://repository.apache.org/content/repositories/snapshots/org/apache/juneau/juneau-core/9.0.0-SNAPSHOT/juneau-core-9.0.0-20201206.150344-12.pom
2/3 KB      3/3 KB            Uploaded: https://repository.apache.org/content/repositories/snapshots/org/apache/juneau/juneau-core/9.0.0-SNAPSHOT/juneau-core-9.0.0-20201206.150344-12.pom
(3 KB at 4.4 KB/sec)
Downloading: https://repository.apache.org/content/repositories/snapshots/org/apache/juneau/juneau-core/maven-metadata.xml
843/843 B               Downloaded: https://repository.apache.org/content/repositories/snapshots/org/apache/juneau/juneau-core/maven-metadata.xml
(843 B at 2.4 KB/sec)
Uploading: https://repository.apache.org/content/repositories/snapshots/org/apache/juneau/juneau-core/9.0.0-SNAPSHOT/maven-metadata.xml
607/607 B               Uploaded: https://repository.apache.org/content/repositories/snapshots/org/apache/juneau/juneau-core/9.0.0-SNAPSHOT/maven-metadata.xml
(607 B at 1.2 KB/sec)
Uploading: https://repository.apache.org/content/repositories/snapshots/org/apache/juneau/juneau-core/maven-metadata.xml
843/843 B               Uploaded: https://repository.apache.org/content/repositories/snapshots/org/apache/juneau/juneau-core/maven-metadata.xml
(843 B at 1.6 KB/sec)
[INFO]                                                                         
[INFO] ------------------------------------------------------------------------
[INFO] Building juneau/core/marshall 9.0.0-SNAPSHOT
[INFO] ------------------------------------------------------------------------
[INFO] 
[INFO] --- maven-clean-plugin:3.1.0:clean (default-clean) @ juneau-marshall ---
[INFO] 
[INFO] --- maven-enforcer-plugin:1.4.1:enforce (enforce-maven-version) @ juneau-marshall ---
[INFO] 
[INFO] --- maven-enforcer-plugin:1.4.1:enforce (enforce-maven) @ juneau-marshall ---
[INFO] 
[INFO] --- jacoco-maven-plugin:0.8.2:prepare-agent (default-prepare-agent) @ juneau-marshall
---
[INFO] argLine set to -javaagent:/home/jenkins/.m2/repository/org/jacoco/org.jacoco.agent/0.8.2/org.jacoco.agent-0.8.2-runtime.jar=destfile=<https://ci-builds.apache.org/job/Juneau/job/Juneau-Java-1.8/ws/juneau-core/juneau-marshall/target/jacoco.exec>
[INFO] 
[INFO] --- maven-remote-resources-plugin:1.5:process (process-resource-bundles) @ juneau-marshall
---
[INFO] 
[INFO] --- maven-resources-plugin:3.1.0:resources (default-resources) @ juneau-marshall ---
[INFO] Using 'UTF-8' encoding to copy filtered resources.
[INFO] Copying 1 resource
[INFO] Copying 3 resources
[INFO] 
[INFO] --- maven-compiler-plugin:3.7.0:compile (default-compile) @ juneau-marshall ---
[INFO] Changes detected - recompiling the module!
[INFO] Compiling 853 source files to <https://ci-builds.apache.org/job/Juneau/job/Juneau-Java-1.8/ws/juneau-core/juneau-marshall/target/classes>
[INFO] -------------------------------------------------------------
[ERROR] COMPILATION ERROR : 
[INFO] -------------------------------------------------------------
[ERROR] <https://ci-builds.apache.org/job/Juneau/job/Juneau-Java-1.8/ws/juneau-core/juneau-marshall/src/main/java/org/apache/juneau/internal/IOUtils.java>:[239,9]
'try' without 'catch', 'finally' or resource declarations
[INFO] 1 error
[INFO] -------------------------------------------------------------
[INFO]                                                                         
[INFO] ------------------------------------------------------------------------
[INFO] Skipping juneau
[INFO] This project has been banned from the build due to previous failures.
[INFO] ------------------------------------------------------------------------
[INFO] ------------------------------------------------------------------------
[INFO] Reactor Summary:
[INFO] 
[INFO] juneau ............................................. SUCCESS [  7.794 s]
[INFO] juneau/core ........................................ SUCCESS [  2.640 s]
[INFO] juneau/core/marshall ............................... FAILURE [  3.952 s]
[INFO] juneau/core/marshall-rdf ........................... SKIPPED
[INFO] juneau/core/dto .................................... SKIPPED
[INFO] juneau/core/config ................................. SKIPPED
[INFO] juneau/rest ........................................ SKIPPED
[INFO] juneau/rest/rest-server ............................ SKIPPED
[INFO] juneau/rest/rest-client ............................ SKIPPED
[INFO] juneau/rest/rest-mock .............................. SKIPPED
[INFO] juneau/rest/rest-server-rdf ........................ SKIPPED
[INFO] juneau/core/core-utest ............................. SKIPPED
[INFO] juneau/rest/rest-server-jaxrs ...................... SKIPPED
[INFO] juneau/rest/rest-server-springboot ................. SKIPPED
[INFO] juneau/rest/rest-mock-utest ........................ SKIPPED
[INFO] juneau/rest/rest-server-utest ...................... SKIPPED
[INFO] juneau/rest/rest-client-utest ...................... SKIPPED
[INFO] juneau/microservice ................................ SKIPPED
[INFO] juneau/microservice/microservice-core .............. SKIPPED
[INFO] juneau/microservice/microservice-jetty ............. SKIPPED
[INFO] juneau/microservice/my-jetty-microservice .......... SKIPPED
[INFO] juneau/examples .................................... SKIPPED
[INFO] juneau/examples/rest ............................... SKIPPED
[INFO] juneau/microservice/microservice-ftest ............. SKIPPED
[INFO] juneau/microservice/my-springboot-microservice ..... SKIPPED
[INFO] juneau/sc .......................................... SKIPPED
[INFO] juneau/sc/sc-server ................................ SKIPPED
[INFO] juneau/sc/sc-client ................................ SKIPPED
[INFO] juneau/examples/examples-core ...................... SKIPPED
[INFO] juneau/examples/examples-rest-jetty ................ SKIPPED
[INFO] juneau/examples/examples-rest-springboot ........... SKIPPED
[INFO] juneau/examples/examples-rest-jetty-ftest .......... SKIPPED
[INFO] juneau/doc ......................................... SKIPPED
[INFO] juneau/releng ...................................... SKIPPED
[INFO] juneau/releng/all .................................. SKIPPED
[INFO] juneau/releng/distrib .............................. SKIPPED
[INFO] ------------------------------------------------------------------------
[INFO] BUILD FAILURE
[INFO] ------------------------------------------------------------------------
[INFO] Total time: 16.683 s
[INFO] Finished at: 2020-12-06T15:03:49+00:00
[INFO] Final Memory: 48M/1375M
[INFO] ------------------------------------------------------------------------
[ERROR] Failed to execute goal org.apache.maven.plugins:maven-compiler-plugin:3.7.0:compile
(default-compile) on project juneau-marshall: Compilation failure
[ERROR] <https://ci-builds.apache.org/job/Juneau/job/Juneau-Java-1.8/ws/juneau-core/juneau-marshall/src/main/java/org/apache/juneau/internal/IOUtils.java>:[239,9]
'try' without 'catch', 'finally' or resource declarations
[ERROR] -> [Help 1]
[ERROR] 
[ERROR] To see the full stack trace of the errors, re-run Maven with the -e switch.
[ERROR] Re-run Maven using the -X switch to enable full debug logging.
[ERROR] 
[ERROR] For more information about the errors and possible solutions, please read the following
articles:
[ERROR] [Help 1] http://cwiki.apache.org/confluence/display/MAVEN/MojoFailureException
[ERROR] 
[ERROR] After correcting the problems, you can resume the build with the command
[ERROR]   mvn <goals> -rf :juneau-marshall
Build step 'Invoke top-level Maven targets' marked build as failure
Recording test results
ERROR: Step ?Publish JUnit test result report? failed: No test report files were found. Configuration
error?
[TASKS] Skipping publisher since build result is FAILURE
Not sending mail to unregistered user lcc2@cesar.org.br

Mime
View raw message