juneau-dev mailing list archives

Site index · List index
Message view « Date » · « Thread »
Top « Date » · « Thread »
From Apache Jenkins Server <jenk...@builds.apache.org>
Subject Build failed in Jenkins: Juneau-Java-1.8 #1457
Date Sat, 02 Nov 2019 15:12:44 GMT
See <https://builds.apache.org/job/Juneau-Java-1.8/1457/display/redirect?page=changes>

Changes:

[JamesBognar] Minor API additions.


------------------------------------------
[...truncated 190.76 KB...]
[INFO] Running org.apache.juneau.svl.vars.IfVarTest
[INFO] Tests run: 1, Failures: 0, Errors: 0, Skipped: 0, Time elapsed: 0 s - in org.apache.juneau.svl.vars.IfVarTest
[INFO] Running org.apache.juneau.svl.vars.NotEmptyVarTest
[INFO] Tests run: 1, Failures: 0, Errors: 0, Skipped: 0, Time elapsed: 0 s - in org.apache.juneau.svl.vars.NotEmptyVarTest
[INFO] Running org.apache.juneau.svl.vars.UpperCaseVarTest
[INFO] Tests run: 1, Failures: 0, Errors: 0, Skipped: 0, Time elapsed: 0 s - in org.apache.juneau.svl.vars.UpperCaseVarTest
[INFO] Running org.apache.juneau.svl.ResolvingObjectMapTest
[INFO] Tests run: 4, Failures: 0, Errors: 0, Skipped: 0, Time elapsed: 0 s - in org.apache.juneau.svl.ResolvingObjectMapTest
[INFO] Running org.apache.juneau.BeanMapTest
[INFO] Tests run: 36, Failures: 0, Errors: 0, Skipped: 0, Time elapsed: 0.255 s - in org.apache.juneau.BeanMapTest
[INFO] Running org.apache.juneau.ObjectMapTest
[INFO] Tests run: 8, Failures: 0, Errors: 0, Skipped: 0, Time elapsed: 0.011 s - in org.apache.juneau.ObjectMapTest
[INFO] Running org.apache.juneau.jsonschema.JsonSchemaConfigAnnotationTest
[INFO] Tests run: 3, Failures: 0, Errors: 0, Skipped: 0, Time elapsed: 0.009 s - in org.apache.juneau.jsonschema.JsonSchemaConfigAnnotationTest
[INFO] Running org.apache.juneau.jsonschema.JsonSchemaGeneratorTest
[INFO] Tests run: 95, Failures: 0, Errors: 0, Skipped: 0, Time elapsed: 0.347 s - in org.apache.juneau.jsonschema.JsonSchemaGeneratorTest
[INFO] Running org.apache.juneau.jena.CommonXmlTest
[INFO] Tests run: 2, Failures: 0, Errors: 0, Skipped: 0, Time elapsed: 0.003 s - in org.apache.juneau.jena.CommonXmlTest
[INFO] Running org.apache.juneau.jena.RdfTest
[INFO] Tests run: 4, Failures: 0, Errors: 0, Skipped: 0, Time elapsed: 0.129 s - in org.apache.juneau.jena.RdfTest
[INFO] Running org.apache.juneau.jena.CommonParserTest
[INFO] Tests run: 4, Failures: 0, Errors: 0, Skipped: 0, Time elapsed: 0.038 s - in org.apache.juneau.jena.CommonParserTest
[INFO] Running org.apache.juneau.jena.RdfConfigAnnotationTest
[INFO] Tests run: 6, Failures: 0, Errors: 0, Skipped: 0, Time elapsed: 0.014 s - in org.apache.juneau.jena.RdfConfigAnnotationTest
[INFO] Running org.apache.juneau.jena.CommonTest
[INFO] Tests run: 8, Failures: 0, Errors: 0, Skipped: 0, Time elapsed: 0.082 s - in org.apache.juneau.jena.CommonTest
[INFO] Running org.apache.juneau.jena.RdfParserTest
[INFO] Tests run: 1, Failures: 0, Errors: 0, Skipped: 0, Time elapsed: 0.013 s - in org.apache.juneau.jena.RdfParserTest
[INFO] Running org.apache.juneau.utils.PojoRestTest
[INFO] Tests run: 10, Failures: 0, Errors: 0, Skipped: 0, Time elapsed: 0.081 s - in org.apache.juneau.utils.PojoRestTest
[INFO] Running org.apache.juneau.utils.UriContextResolutionComboTest
[INFO] Tests run: 720, Failures: 0, Errors: 0, Skipped: 0, Time elapsed: 0.072 s - in org.apache.juneau.utils.UriContextResolutionComboTest
[INFO] Running org.apache.juneau.utils.UriContextUriComboTest
[INFO] Tests run: 70, Failures: 0, Errors: 0, Skipped: 0, Time elapsed: 0.001 s - in org.apache.juneau.utils.UriContextUriComboTest
[INFO] Running org.apache.juneau.utils.ByteArrayInOutStreamTest
[INFO] Tests run: 1, Failures: 0, Errors: 0, Skipped: 0, Time elapsed: 0 s - in org.apache.juneau.utils.ByteArrayInOutStreamTest
[INFO] Running org.apache.juneau.utils.StringExpressionMatcherTest
[INFO] Tests run: 131, Failures: 0, Errors: 0, Skipped: 0, Time elapsed: 0.023 s - in org.apache.juneau.utils.StringExpressionMatcherTest
[INFO] Running org.apache.juneau.utils.StackTraceDatabaseTest
[INFO] Tests run: 2, Failures: 0, Errors: 0, Skipped: 0, Time elapsed: 0 s - in org.apache.juneau.utils.StackTraceDatabaseTest
[INFO] Running org.apache.juneau.utils.ArgsTest
[INFO] Tests run: 1, Failures: 0, Errors: 0, Skipped: 0, Time elapsed: 0 s - in org.apache.juneau.utils.ArgsTest
[INFO] Running org.apache.juneau.utils.KeywordStoreTest
[INFO] Tests run: 1, Failures: 0, Errors: 0, Skipped: 0, Time elapsed: 0 s - in org.apache.juneau.utils.KeywordStoreTest
[INFO] Running org.apache.juneau.utils.CharSetTest
[INFO] Tests run: 1, Failures: 0, Errors: 0, Skipped: 0, Time elapsed: 0 s - in org.apache.juneau.utils.CharSetTest
[INFO] Running org.apache.juneau.utils.StringBuilderWriterTest
[INFO] Tests run: 1, Failures: 0, Errors: 0, Skipped: 0, Time elapsed: 0 s - in org.apache.juneau.utils.StringBuilderWriterTest
[INFO] Running org.apache.juneau.utils.StringVarResolverTest
[INFO] Tests run: 7, Failures: 0, Errors: 0, Skipped: 0, Time elapsed: 0.002 s - in org.apache.juneau.utils.StringVarResolverTest
[INFO] Running org.apache.juneau.utils.IOUtilsTest
[INFO] Tests run: 2, Failures: 0, Errors: 0, Skipped: 0, Time elapsed: 0.004 s - in org.apache.juneau.utils.IOUtilsTest
[INFO] Running org.apache.juneau.utils.PojoQueryTest
[INFO] Tests run: 5, Failures: 0, Errors: 0, Skipped: 0, Time elapsed: 0.074 s - in org.apache.juneau.utils.PojoQueryTest
[INFO] Running org.apache.juneau.utils.StringUtilsTest
[INFO] Tests run: 33, Failures: 0, Errors: 0, Skipped: 0, Time elapsed: 0.024 s - in org.apache.juneau.utils.StringUtilsTest
[INFO] Running org.apache.juneau.utils.FilteredMapTest
[INFO] Tests run: 1, Failures: 0, Errors: 0, Skipped: 0, Time elapsed: 0 s - in org.apache.juneau.utils.FilteredMapTest
[INFO] Running org.apache.juneau.utils.ArrayUtilsTest
[INFO] Tests run: 9, Failures: 0, Errors: 0, Skipped: 0, Time elapsed: 0.003 s - in org.apache.juneau.utils.ArrayUtilsTest
[INFO] Running org.apache.juneau.utils.MutatersTest
[INFO] Tests run: 13, Failures: 0, Errors: 0, Skipped: 0, Time elapsed: 0.008 s - in org.apache.juneau.utils.MutatersTest
[INFO] Running org.apache.juneau.utils.ParserReaderTest
[INFO] Tests run: 1, Failures: 0, Errors: 0, Skipped: 0, Time elapsed: 0 s - in org.apache.juneau.utils.ParserReaderTest
[INFO] Running org.apache.juneau.utils.BeanDiffTest
[INFO] Tests run: 11, Failures: 0, Errors: 0, Skipped: 0, Time elapsed: 0.005 s - in org.apache.juneau.utils.BeanDiffTest
[INFO] Running org.apache.juneau.utils.MultiSetTest
[INFO] Tests run: 1, Failures: 0, Errors: 0, Skipped: 0, Time elapsed: 0.004 s - in org.apache.juneau.utils.MultiSetTest
[INFO] Running org.apache.juneau.utils.PojoIntrospectorTest
[INFO] Tests run: 1, Failures: 0, Errors: 0, Skipped: 0, Time elapsed: 0 s - in org.apache.juneau.utils.PojoIntrospectorTest
[INFO] Running org.apache.juneau.utils.IOPipeTest
[INFO] Tests run: 5, Failures: 0, Errors: 0, Skipped: 0, Time elapsed: 0.004 s - in org.apache.juneau.utils.IOPipeTest
[INFO] Running org.apache.juneau.utils.CollectionUtilsTest
[INFO] Tests run: 4, Failures: 0, Errors: 0, Skipped: 0, Time elapsed: 0.022 s - in org.apache.juneau.utils.CollectionUtilsTest
[INFO] Running org.apache.juneau.utils.ClassUtilsTest
[INFO] Tests run: 1, Failures: 0, Errors: 0, Skipped: 0, Time elapsed: 0 s - in org.apache.juneau.utils.ClassUtilsTest
[INFO] Running org.apache.juneau.utils.PojoMergeTest
[INFO] Tests run: 1, Failures: 0, Errors: 0, Skipped: 0, Time elapsed: 0.003 s - in org.apache.juneau.utils.PojoMergeTest
[INFO] Running org.apache.juneau.utils.MultiIterableTest
[INFO] Tests run: 1, Failures: 0, Errors: 0, Skipped: 0, Time elapsed: 0.002 s - in org.apache.juneau.utils.MultiIterableTest
[INFO] Running org.apache.juneau.utils.HttpUtilsTest
[INFO] Tests run: 8, Failures: 0, Errors: 0, Skipped: 0, Time elapsed: 0.003 s - in org.apache.juneau.utils.HttpUtilsTest
[INFO] Running org.apache.juneau.utils.SimpleMapTest
[INFO] Tests run: 1, Failures: 0, Errors: 0, Skipped: 0, Time elapsed: 0.003 s - in org.apache.juneau.utils.SimpleMapTest
[INFO] Running org.apache.juneau.ContextCacheTest
[INFO] Tests run: 2, Failures: 0, Errors: 0, Skipped: 0, Time elapsed: 0.018 s - in org.apache.juneau.ContextCacheTest
[INFO] Running org.apache.juneau.AnnotationsTest
[INFO] Tests run: 2, Failures: 0, Errors: 0, Skipped: 0, Time elapsed: 0.002 s - in org.apache.juneau.AnnotationsTest
[INFO] Running org.apache.juneau.ObjectListTest
[INFO] Tests run: 6, Failures: 0, Errors: 0, Skipped: 0, Time elapsed: 0.002 s - in org.apache.juneau.ObjectListTest
[INFO] Running org.apache.juneau.PropertyStoreTest
[INFO] Tests run: 64, Failures: 0, Errors: 0, Skipped: 0, Time elapsed: 0.079 s - in org.apache.juneau.PropertyStoreTest
[INFO] Running org.apache.juneau.xml.CommonXmlTest
[INFO] Tests run: 2, Failures: 0, Errors: 0, Skipped: 0, Time elapsed: 0.012 s - in org.apache.juneau.xml.CommonXmlTest
[INFO] Running org.apache.juneau.xml.XmlIgnoreCommentsTest
[INFO] Tests run: 248, Failures: 0, Errors: 0, Skipped: 0, Time elapsed: 0.29 s - in org.apache.juneau.xml.XmlIgnoreCommentsTest
[INFO] Running org.apache.juneau.xml.BasicXmlTest
[INFO] Tests run: 384, Failures: 0, Errors: 0, Skipped: 0, Time elapsed: 0.268 s - in org.apache.juneau.xml.BasicXmlTest
[INFO] Running org.apache.juneau.xml.CommonParserTest
[INFO] Tests run: 4, Failures: 0, Errors: 0, Skipped: 0, Time elapsed: 0.014 s - in org.apache.juneau.xml.CommonParserTest
[INFO] Running org.apache.juneau.xml.XmlTest
[INFO] Tests run: 27, Failures: 0, Errors: 0, Skipped: 0, Time elapsed: 0.333 s - in org.apache.juneau.xml.XmlTest
[INFO] Running org.apache.juneau.xml.CommonTest
[INFO] Tests run: 8, Failures: 0, Errors: 0, Skipped: 0, Time elapsed: 0.051 s - in org.apache.juneau.xml.CommonTest
[INFO] Running org.apache.juneau.xml.XmlConfigAnnotationTest
[INFO] Tests run: 6, Failures: 0, Errors: 0, Skipped: 0, Time elapsed: 0.017 s - in org.apache.juneau.xml.XmlConfigAnnotationTest
[INFO] Running org.apache.juneau.xml.XmlContentTest
[INFO] Tests run: 2, Failures: 0, Errors: 0, Skipped: 0, Time elapsed: 0.015 s - in org.apache.juneau.xml.XmlContentTest
[INFO] Running org.apache.juneau.xml.XmlParserTest
[INFO] Tests run: 3, Failures: 0, Errors: 0, Skipped: 0, Time elapsed: 0.003 s - in org.apache.juneau.xml.XmlParserTest
[INFO] Running org.apache.juneau.xml.InvalidXmlBeansTest
[INFO] Tests run: 15, Failures: 0, Errors: 0, Skipped: 0, Time elapsed: 0.021 s - in org.apache.juneau.xml.InvalidXmlBeansTest
[INFO] Running org.apache.juneau.xml.XmlCollapsedTest
[INFO] Tests run: 9, Failures: 0, Errors: 0, Skipped: 0, Time elapsed: 0.072 s - in org.apache.juneau.xml.XmlCollapsedTest
[INFO] Running org.apache.juneau.transform.AutoMapSwapTest
[INFO] Tests run: 24, Failures: 0, Errors: 0, Skipped: 0, Time elapsed: 0.022 s - in org.apache.juneau.transform.AutoMapSwapTest
[INFO] Running org.apache.juneau.transform.AutoNumberSwapTest
[INFO] Tests run: 60, Failures: 0, Errors: 0, Skipped: 0, Time elapsed: 0.055 s - in org.apache.juneau.transform.AutoNumberSwapTest
[INFO] Running org.apache.juneau.transform.AutoListSwapTest
[INFO] Tests run: 24, Failures: 0, Errors: 0, Skipped: 0, Time elapsed: 0.015 s - in org.apache.juneau.transform.AutoListSwapTest
[INFO] Running org.apache.juneau.transform.AutoObjectSwapTest
[INFO] Tests run: 23, Failures: 0, Errors: 0, Skipped: 0, Time elapsed: 0.016 s - in org.apache.juneau.transform.AutoObjectSwapTest
[INFO] Running org.apache.juneau.dto.atom.AtomTest
[INFO] Tests run: 4, Failures: 0, Errors: 0, Skipped: 0, Time elapsed: 0.13 s - in org.apache.juneau.dto.atom.AtomTest
[INFO] Running org.apache.juneau.dto.html5.Html5BasicTest
[INFO] Tests run: 1, Failures: 0, Errors: 0, Skipped: 0, Time elapsed: 0.733 s - in org.apache.juneau.dto.html5.Html5BasicTest
[INFO] Running org.apache.juneau.dto.html5.Html5TemplateComboTest
[INFO] Tests run: 65, Failures: 0, Errors: 0, Skipped: 0, Time elapsed: 0.447 s - in org.apache.juneau.dto.html5.Html5TemplateComboTest
[INFO] Running org.apache.juneau.dto.html5.Html5ComboTest
[INFO] Tests run: 4550, Failures: 0, Errors: 0, Skipped: 0, Time elapsed: 5.035 s - in org.apache.juneau.dto.html5.Html5ComboTest
[INFO] Running org.apache.juneau.dto.jsonschema.JsonSchemaTest
[INFO] Tests run: 3, Failures: 0, Errors: 0, Skipped: 0, Time elapsed: 0 s - in org.apache.juneau.dto.jsonschema.JsonSchemaTest
[INFO] Running org.apache.juneau.dto.cognos.CognosXmlTest
[INFO] Tests run: 1, Failures: 0, Errors: 0, Skipped: 0, Time elapsed: 0 s - in org.apache.juneau.dto.cognos.CognosXmlTest
[INFO] Running org.apache.juneau.dto.swagger.InfoTest
[INFO] Tests run: 7, Failures: 0, Errors: 0, Skipped: 0, Time elapsed: 0 s - in org.apache.juneau.dto.swagger.InfoTest
[INFO] Running org.apache.juneau.dto.swagger.TagTest
[INFO] Tests run: 4, Failures: 0, Errors: 0, Skipped: 0, Time elapsed: 0.001 s - in org.apache.juneau.dto.swagger.TagTest
[INFO] Running org.apache.juneau.dto.swagger.ContactTest
[INFO] Tests run: 4, Failures: 0, Errors: 0, Skipped: 0, Time elapsed: 0.001 s - in org.apache.juneau.dto.swagger.ContactTest
[INFO] Running org.apache.juneau.dto.swagger.SwaggerTest
[INFO] Tests run: 42, Failures: 0, Errors: 0, Skipped: 0, Time elapsed: 0.175 s - in org.apache.juneau.dto.swagger.SwaggerTest
[INFO] Running org.apache.juneau.dto.swagger.XmlTest
[INFO] Tests run: 6, Failures: 0, Errors: 0, Skipped: 0, Time elapsed: 0.001 s - in org.apache.juneau.dto.swagger.XmlTest
[INFO] Running org.apache.juneau.dto.swagger.ExternalDocumentationTest
[INFO] Tests run: 3, Failures: 0, Errors: 0, Skipped: 0, Time elapsed: 0 s - in org.apache.juneau.dto.swagger.ExternalDocumentationTest
[INFO] Running org.apache.juneau.dto.swagger.LicenseTest
[INFO] Tests run: 3, Failures: 0, Errors: 0, Skipped: 0, Time elapsed: 0.001 s - in org.apache.juneau.dto.swagger.LicenseTest
[INFO] Running org.apache.juneau.dto.swagger.ResponseInfoTest
[INFO] Tests run: 11, Failures: 0, Errors: 0, Skipped: 0, Time elapsed: 0.002 s - in org.apache.juneau.dto.swagger.ResponseInfoTest
[INFO] Running org.apache.juneau.dto.swagger.SecuritySchemeTest
[INFO] Tests run: 11, Failures: 0, Errors: 0, Skipped: 0, Time elapsed: 0.005 s - in org.apache.juneau.dto.swagger.SecuritySchemeTest
[INFO] Running org.apache.juneau.dto.swagger.SwaggerBuilderTest
[INFO] Tests run: 31, Failures: 0, Errors: 0, Skipped: 0, Time elapsed: 0.021 s - in org.apache.juneau.dto.swagger.SwaggerBuilderTest
[INFO] Running org.apache.juneau.dto.swagger.OperationTest
[INFO] Tests run: 29, Failures: 0, Errors: 0, Skipped: 0, Time elapsed: 0.014 s - in org.apache.juneau.dto.swagger.OperationTest
[INFO] Running org.apache.juneau.dto.swagger.SchemaInfoTest
[INFO] Tests run: 37, Failures: 0, Errors: 0, Skipped: 0, Time elapsed: 0.014 s - in org.apache.juneau.dto.swagger.SchemaInfoTest
[INFO] Running org.apache.juneau.dto.swagger.ParameterInfoTest
[INFO] Tests run: 26, Failures: 0, Errors: 0, Skipped: 0, Time elapsed: 0.01 s - in org.apache.juneau.dto.swagger.ParameterInfoTest
[INFO] Running org.apache.juneau.dto.swagger.HeaderInfoTest
[INFO] Tests run: 21, Failures: 0, Errors: 0, Skipped: 0, Time elapsed: 0.004 s - in org.apache.juneau.dto.swagger.HeaderInfoTest
[INFO] Running org.apache.juneau.dto.swagger.ItemsTest
[INFO] Tests run: 20, Failures: 0, Errors: 0, Skipped: 0, Time elapsed: 0.004 s - in org.apache.juneau.dto.swagger.ItemsTest
[INFO] Running org.apache.juneau.soap.SoapXmlConfigAnnotationTest
[INFO] Tests run: 3, Failures: 0, Errors: 0, Skipped: 0, Time elapsed: 0.031 s - in org.apache.juneau.soap.SoapXmlConfigAnnotationTest
[INFO] 
[INFO] Results:
[INFO] 
[ERROR] Errors: 
[ERROR]   RoundTripSimpleObjectsTest.testObjectList:626->RoundTripTest.roundTrip:245->RoundTripTest.roundTrip:252
» Parse
[ERROR]   RoundTripSimpleObjectsTest.testObjectList:626->RoundTripTest.roundTrip:245->RoundTripTest.roundTrip:252
» Parse
[ERROR]   RoundTripSimpleObjectsTest.testObjectList:626->RoundTripTest.roundTrip:245->RoundTripTest.roundTrip:252
» Parse
[ERROR]   RoundTripSimpleObjectsTest.testObjectList:626->RoundTripTest.roundTrip:245->RoundTripTest.roundTrip:252
» Parse
[ERROR]   RoundTripTrimStringsTest.test:61 » Parse Exception occurred.  exception=Illega...
[ERROR]   RoundTripTrimStringsTest.test:61 » Parse Exception occurred.  exception=Illega...
[ERROR]   RoundTripTrimStringsTest.test:61 » Parse Exception occurred.  exception=Illega...
[ERROR]   RoundTripTrimStringsTest.test:61 » Parse Invalid data type ARRAY encountered f...
[INFO] 
[ERROR] Tests run: 21171, Failures: 0, Errors: 8, Skipped: 2
[INFO] 
[INFO]                                                                         
[INFO] ------------------------------------------------------------------------
[INFO] Skipping Apache Juneau
[INFO] This project has been banned from the build due to previous failures.
[INFO] ------------------------------------------------------------------------
[INFO] ------------------------------------------------------------------------
[INFO] Reactor Summary:
[INFO] 
[INFO] Apache Juneau ...................................... SUCCESS [  8.615 s]
[INFO] Apache Juneau - Core APIs .......................... SUCCESS [  4.313 s]
[INFO] Apache Juneau Marshall ............................. SUCCESS [01:09 min]
[INFO] Apache Juneau Marshal RDF .......................... SUCCESS [ 13.854 s]
[INFO] Apache Juneau Data Transfer Objects ................ SUCCESS [ 18.133 s]
[INFO] Apache Juneau Config File API ...................... SUCCESS [ 12.634 s]
[INFO] Apache Juneau Core (Unit Tests) .................... FAILURE [ 53.819 s]
[INFO] Apache Juneau - REST APIs .......................... SKIPPED
[INFO] Apache Juneau REST Servlet API ..................... SKIPPED
[INFO] Apache Juneau REST JAX/RS API ...................... SKIPPED
[INFO] Apache Juneau REST Servlet API, RDF support ........ SKIPPED
[INFO] Apache Juneau REST Spring Boot Integration ......... SKIPPED
[INFO] Apache Juneau REST Client API ...................... SKIPPED
[INFO] Apache Juneau REST Mock API ........................ SKIPPED
[INFO] Apache Juneau REST Mock API (Unit Tests) ........... SKIPPED
[INFO] Apache Juneau REST Servlet API (Unit Tests) ........ SKIPPED
[INFO] Apache Juneau REST Client API (Unit Tests) ......... SKIPPED
[INFO] Apache Juneau - Microservice APIs .................. SKIPPED
[INFO] Apache Juneau Microservice Core Library ............ SKIPPED
[INFO] Apache Juneau Microservice Server .................. SKIPPED
[INFO] Apache Juneau Jetty Microservice Template .......... SKIPPED
[INFO] Apache Juneau - Examples ........................... SKIPPED
[INFO] Apache Juneau REST Examples ........................ SKIPPED
[INFO] Apache Juneau Microservice (Function Tests) ........ SKIPPED
[INFO] Apache Juneau Spring Boot Microservice Template .... SKIPPED
[INFO] Apache Juneau Core Examples ........................ SKIPPED
[INFO] Apache Juneau REST Examples using Jetty ............ SKIPPED
[INFO] Apache Juneau REST Examples using Spring Boot ...... SKIPPED
[INFO] Apache Juneau REST Examples (Function Tests) ....... SKIPPED
[INFO] Apache Juneau Javadocs ............................. SKIPPED
[INFO] Apache Juneau - Release Engineering ................ SKIPPED
[INFO] Apache Juneau UberJar .............................. SKIPPED
[INFO] Apache Juneau Distribution ......................... SKIPPED
[INFO] Apache Juneau - Configuration Server ............... SKIPPED
[INFO] Apache Juneau Configuration Server API ............. SKIPPED
[INFO] Apache Juneau Configuration Server - Client API .... SKIPPED
[INFO] ------------------------------------------------------------------------
[INFO] BUILD FAILURE
[INFO] ------------------------------------------------------------------------
[INFO] Total time: 03:03 min
[INFO] Finished at: 2019-11-02T15:12:34+00:00
[INFO] Final Memory: 96M/3755M
[INFO] ------------------------------------------------------------------------
[ERROR] Failed to execute goal org.apache.maven.plugins:maven-surefire-plugin:2.22.0:test
(default-test) on project juneau-core-utest: There are test failures.
[ERROR] 
[ERROR] Please refer to <https://builds.apache.org/job/Juneau-Java-1.8/ws/juneau-core/juneau-core-utest/target/surefire-reports>
for the individual test results.
[ERROR] Please refer to dump files (if any exist) [date]-jvmRun[N].dump, [date].dumpstream
and [date]-jvmRun[N].dumpstream.
[ERROR] -> [Help 1]
[ERROR] 
[ERROR] To see the full stack trace of the errors, re-run Maven with the -e switch.
[ERROR] Re-run Maven using the -X switch to enable full debug logging.
[ERROR] 
[ERROR] For more information about the errors and possible solutions, please read the following
articles:
[ERROR] [Help 1] http://cwiki.apache.org/confluence/display/MAVEN/MojoFailureException
[ERROR] 
[ERROR] After correcting the problems, you can resume the build with the command
[ERROR]   mvn <goals> -rf :juneau-core-utest
Build step 'Invoke top-level Maven targets' marked build as failure
Recording test results
[TASKS] Skipping publisher since build result is FAILURE

Mime
View raw message