juneau-dev mailing list archives

Site index · List index
Message view « Date » · « Thread »
Top « Date » · « Thread »
From Apache Jenkins Server <jenk...@builds.apache.org>
Subject Build failed in Jenkins: Juneau-Java-1.8 #1372
Date Sat, 29 Jun 2019 18:13:57 GMT
See <https://builds.apache.org/job/Juneau-Java-1.8/1372/display/redirect?page=changes>

Changes:

[JamesBognar] JUNEAU-100 REST_allowedMethodHeaders /

------------------------------------------
[...truncated 725.49 KB...]
[INFO] Running org.apache.juneau.rest.annotation2.RestHookTest
[INFO] Tests run: 14, Failures: 0, Errors: 0, Skipped: 0, Time elapsed: 0.09 s - in org.apache.juneau.rest.annotation2.RestHookTest
[INFO] Running org.apache.juneau.rest.annotation2.HeaderAnnotationTest
[INFO] Tests run: 19, Failures: 0, Errors: 0, Skipped: 0, Time elapsed: 0.062 s - in org.apache.juneau.rest.annotation2.HeaderAnnotationTest
[INFO] Running org.apache.juneau.rest.annotation2.QueryAnnotationTest
[INFO] Tests run: 31, Failures: 0, Errors: 0, Skipped: 0, Time elapsed: 0.107 s - in org.apache.juneau.rest.annotation2.QueryAnnotationTest
[INFO] Running org.apache.juneau.rest.annotation2.HasFormDataAnnotationTest
[INFO] Tests run: 1, Failures: 0, Errors: 0, Skipped: 0, Time elapsed: 0.008 s - in org.apache.juneau.rest.annotation2.HasFormDataAnnotationTest
[INFO] Running org.apache.juneau.rest.annotation2.RestResourceParsersTest
[INFO] Tests run: 5, Failures: 0, Errors: 0, Skipped: 0, Time elapsed: 0.012 s - in org.apache.juneau.rest.annotation2.RestResourceParsersTest
[INFO] Running org.apache.juneau.rest.annotation2.BodyAnnotationTest
[INFO] Tests run: 98, Failures: 0, Errors: 0, Skipped: 0, Time elapsed: 0.229 s - in org.apache.juneau.rest.annotation2.BodyAnnotationTest
[INFO] Running org.apache.juneau.rest.annotation2.HasQueryAnnotationTest
[INFO] Tests run: 2, Failures: 0, Errors: 0, Skipped: 0, Time elapsed: 0.008 s - in org.apache.juneau.rest.annotation2.HasQueryAnnotationTest
[INFO] Running org.apache.jueau.rest.helper.StreamResourceTest
[INFO] Tests run: 7, Failures: 0, Errors: 0, Skipped: 0, Time elapsed: 0.01 s - in org.apache.jueau.rest.helper.StreamResourceTest
[INFO] Running org.apache.jueau.rest.helper.ReaderResourceTest
[INFO] Tests run: 7, Failures: 0, Errors: 0, Skipped: 0, Time elapsed: 0.012 s - in org.apache.jueau.rest.helper.ReaderResourceTest
[INFO] 
[INFO] Results:
[INFO] 
[WARNING] Tests run: 1512, Failures: 0, Errors: 0, Skipped: 1
[INFO] 
[INFO] 
[INFO] --- jacoco-maven-plugin:0.8.2:report (default-report) @ juneau-rest-server-utest ---
[INFO] Loading execution data file <https://builds.apache.org/job/Juneau-Java-1.8/ws/juneau-rest/juneau-rest-server-utest/target/jacoco.exec>
[INFO] Analyzed bundle 'Apache Juneau REST Servlet API (Unit Tests)' with 0 classes
[INFO] 
[INFO] --- maven-bundle-plugin:3.2.0:bundle (default-bundle) @ juneau-rest-server-utest ---
[INFO] 
[INFO] --- maven-site-plugin:3.7.1:attach-descriptor (attach-descriptor) @ juneau-rest-server-utest
---
[INFO] Skipping because packaging 'bundle' is not pom.
[INFO] 
[INFO] --- maven-jar-plugin:3.1.0:test-jar (default) @ juneau-rest-server-utest ---
[INFO] Building jar: <https://builds.apache.org/job/Juneau-Java-1.8/ws/juneau-rest/juneau-rest-server-utest/target/juneau-rest-server-utest-8.0.1-SNAPSHOT-tests.jar>
[INFO] 
[INFO] --- apache-rat-plugin:0.12:check (default) @ juneau-rest-server-utest ---
[INFO] Enabled default license matchers.
[INFO] Will parse SCM ignores for exclusions...
[INFO] Parsing exclusions from <https://builds.apache.org/job/Juneau-Java-1.8/ws/juneau-rest/juneau-rest-server-utest/.gitignore>
[INFO] Finished adding exclusions from SCM ignore files.
[INFO] 62 implicit excludes (use -debug for more details).
[INFO] Exclude: **/DEPENDENCIES
[INFO] Exclude: **/target/**
[INFO] Exclude: **/.settings/**
[INFO] Exclude: **/.project
[INFO] Exclude: **/.classpath
[INFO] Exclude: **/*.launch
[INFO] Exclude: **/jetty.out.xml
[INFO] Exclude: **/derby.log
[INFO] Exclude: **/dependency-reduced-pom.xml
[INFO] Exclude: **/docs.txt
[INFO] Exclude: **/toc.txt
[INFO] Exclude: **/app.json
[INFO] Exclude: **/Procfile
[INFO] 73 resources included (use -debug for more details)
[INFO] Rat check: Summary over all files. Unapproved: 0, unknown: 0, generated: 0, approved:
73 licenses.
[INFO] 
[INFO] --- maven-source-plugin:3.0.1:jar-no-fork (attach-sources) @ juneau-rest-server-utest
---
[INFO] Building jar: <https://builds.apache.org/job/Juneau-Java-1.8/ws/juneau-rest/juneau-rest-server-utest/target/juneau-rest-server-utest-8.0.1-SNAPSHOT-sources.jar>
[INFO] 
[INFO] --- maven-install-plugin:2.5.2:install (default-install) @ juneau-rest-server-utest
---
[INFO] Installing <https://builds.apache.org/job/Juneau-Java-1.8/ws/juneau-rest/juneau-rest-server-utest/target/juneau-rest-server-utest-8.0.1-SNAPSHOT.jar>
to /home/jenkins/.m2/repository/org/apache/juneau/juneau-rest-server-utest/8.0.1-SNAPSHOT/juneau-rest-server-utest-8.0.1-SNAPSHOT.jar
[INFO] Installing <https://builds.apache.org/job/Juneau-Java-1.8/ws/juneau-rest/juneau-rest-server-utest/pom.xml>
to /home/jenkins/.m2/repository/org/apache/juneau/juneau-rest-server-utest/8.0.1-SNAPSHOT/juneau-rest-server-utest-8.0.1-SNAPSHOT.pom
[INFO] Installing <https://builds.apache.org/job/Juneau-Java-1.8/ws/juneau-rest/juneau-rest-server-utest/target/juneau-rest-server-utest-8.0.1-SNAPSHOT-tests.jar>
to /home/jenkins/.m2/repository/org/apache/juneau/juneau-rest-server-utest/8.0.1-SNAPSHOT/juneau-rest-server-utest-8.0.1-SNAPSHOT-tests.jar
[INFO] Installing <https://builds.apache.org/job/Juneau-Java-1.8/ws/juneau-rest/juneau-rest-server-utest/target/juneau-rest-server-utest-8.0.1-SNAPSHOT-sources.jar>
to /home/jenkins/.m2/repository/org/apache/juneau/juneau-rest-server-utest/8.0.1-SNAPSHOT/juneau-rest-server-utest-8.0.1-SNAPSHOT-sources.jar
[INFO] 
[INFO] --- maven-bundle-plugin:3.2.0:install (default-install) @ juneau-rest-server-utest
---
[INFO] Installing org/apache/juneau/juneau-rest-server-utest/8.0.1-SNAPSHOT/juneau-rest-server-utest-8.0.1-SNAPSHOT.jar
[INFO] Writing OBR metadata
[INFO] 
[INFO] --- maven-enforcer-plugin:1.4.1:enforce (enforce-maven-version) @ juneau-rest-server-utest
---
[INFO] 
[INFO] --- maven-enforcer-plugin:1.4.1:enforce (enforce-maven) @ juneau-rest-server-utest
---
[INFO] 
[INFO] --- jacoco-maven-plugin:0.8.2:prepare-agent (default-prepare-agent) @ juneau-rest-server-utest
---
[INFO] argLine set to -javaagent:/home/jenkins/.m2/repository/org/jacoco/org.jacoco.agent/0.8.2/org.jacoco.agent-0.8.2-runtime.jar=destfile=<https://builds.apache.org/job/Juneau-Java-1.8/ws/juneau-rest/juneau-rest-server-utest/target/jacoco.exec>
[INFO] 
[INFO] --- maven-remote-resources-plugin:1.5:process (process-resource-bundles) @ juneau-rest-server-utest
---
[INFO] 
[INFO] --- maven-resources-plugin:3.1.0:resources (default-resources) @ juneau-rest-server-utest
---
[INFO] Using 'UTF-8' encoding to copy filtered resources.
[INFO] skip non existing resourceDirectory <https://builds.apache.org/job/Juneau-Java-1.8/ws/juneau-rest/juneau-rest-server-utest/src/main/resources>
[INFO] Copying 3 resources
[INFO] Copying 3 resources
[INFO] 
[INFO] --- maven-compiler-plugin:3.7.0:compile (default-compile) @ juneau-rest-server-utest
---
[INFO] No sources to compile
[INFO] 
[INFO] --- maven-resources-plugin:3.1.0:testResources (default-testResources) @ juneau-rest-server-utest
---
[INFO] Using 'UTF-8' encoding to copy filtered resources.
[INFO] Copying 9 resources
[INFO] Copying 3 resources
[INFO] Copying 3 resources
[INFO] 
[INFO] --- maven-compiler-plugin:3.7.0:testCompile (default-testCompile) @ juneau-rest-server-utest
---
[INFO] Nothing to compile - all classes are up to date
[INFO] 
[INFO] --- maven-surefire-plugin:2.22.0:test (default-test) @ juneau-rest-server-utest ---
[INFO] Skipping execution of surefire because it has already been run for this configuration
[INFO] 
[INFO] --- jacoco-maven-plugin:0.8.2:report (default-report) @ juneau-rest-server-utest ---
[INFO] Loading execution data file <https://builds.apache.org/job/Juneau-Java-1.8/ws/juneau-rest/juneau-rest-server-utest/target/jacoco.exec>
[INFO] Analyzed bundle 'Apache Juneau REST Servlet API (Unit Tests)' with 0 classes
[INFO] 
[INFO] --- maven-bundle-plugin:3.2.0:bundle (default-bundle) @ juneau-rest-server-utest ---
[INFO] 
[INFO] --- maven-site-plugin:3.7.1:attach-descriptor (attach-descriptor) @ juneau-rest-server-utest
---
[INFO] Skipping because packaging 'bundle' is not pom.
[INFO] 
[INFO] --- maven-jar-plugin:3.1.0:test-jar (default) @ juneau-rest-server-utest ---
[INFO] 
[INFO] --- apache-rat-plugin:0.12:check (default) @ juneau-rest-server-utest ---
[INFO] Enabled default license matchers.
[INFO] Will parse SCM ignores for exclusions...
[INFO] Parsing exclusions from <https://builds.apache.org/job/Juneau-Java-1.8/ws/juneau-rest/juneau-rest-server-utest/.gitignore>
[INFO] Finished adding exclusions from SCM ignore files.
[INFO] 62 implicit excludes (use -debug for more details).
[INFO] Exclude: **/DEPENDENCIES
[INFO] Exclude: **/target/**
[INFO] Exclude: **/.settings/**
[INFO] Exclude: **/.project
[INFO] Exclude: **/.classpath
[INFO] Exclude: **/*.launch
[INFO] Exclude: **/jetty.out.xml
[INFO] Exclude: **/derby.log
[INFO] Exclude: **/dependency-reduced-pom.xml
[INFO] Exclude: **/docs.txt
[INFO] Exclude: **/toc.txt
[INFO] Exclude: **/app.json
[INFO] Exclude: **/Procfile
[INFO] 73 resources included (use -debug for more details)
[INFO] Rat check: Summary over all files. Unapproved: 0, unknown: 0, generated: 0, approved:
73 licenses.
[INFO] 
[INFO] --- maven-source-plugin:3.0.1:jar-no-fork (attach-sources) @ juneau-rest-server-utest
---
[INFO] 
[INFO] --- maven-install-plugin:2.5.2:install (default-install) @ juneau-rest-server-utest
---
[INFO] Installing <https://builds.apache.org/job/Juneau-Java-1.8/ws/juneau-rest/juneau-rest-server-utest/target/juneau-rest-server-utest-8.0.1-SNAPSHOT.jar>
to /home/jenkins/.m2/repository/org/apache/juneau/juneau-rest-server-utest/8.0.1-SNAPSHOT/juneau-rest-server-utest-8.0.1-SNAPSHOT.jar
[INFO] Installing <https://builds.apache.org/job/Juneau-Java-1.8/ws/juneau-rest/juneau-rest-server-utest/pom.xml>
to /home/jenkins/.m2/repository/org/apache/juneau/juneau-rest-server-utest/8.0.1-SNAPSHOT/juneau-rest-server-utest-8.0.1-SNAPSHOT.pom
[INFO] Installing <https://builds.apache.org/job/Juneau-Java-1.8/ws/juneau-rest/juneau-rest-server-utest/target/juneau-rest-server-utest-8.0.1-SNAPSHOT-tests.jar>
to /home/jenkins/.m2/repository/org/apache/juneau/juneau-rest-server-utest/8.0.1-SNAPSHOT/juneau-rest-server-utest-8.0.1-SNAPSHOT-tests.jar
[INFO] Installing <https://builds.apache.org/job/Juneau-Java-1.8/ws/juneau-rest/juneau-rest-server-utest/target/juneau-rest-server-utest-8.0.1-SNAPSHOT-sources.jar>
to /home/jenkins/.m2/repository/org/apache/juneau/juneau-rest-server-utest/8.0.1-SNAPSHOT/juneau-rest-server-utest-8.0.1-SNAPSHOT-sources.jar
[INFO] Installing <https://builds.apache.org/job/Juneau-Java-1.8/ws/juneau-rest/juneau-rest-server-utest/target/juneau-rest-server-utest-8.0.1-SNAPSHOT-tests.jar>
to /home/jenkins/.m2/repository/org/apache/juneau/juneau-rest-server-utest/8.0.1-SNAPSHOT/juneau-rest-server-utest-8.0.1-SNAPSHOT-tests.jar
[INFO] Installing <https://builds.apache.org/job/Juneau-Java-1.8/ws/juneau-rest/juneau-rest-server-utest/target/juneau-rest-server-utest-8.0.1-SNAPSHOT-sources.jar>
to /home/jenkins/.m2/repository/org/apache/juneau/juneau-rest-server-utest/8.0.1-SNAPSHOT/juneau-rest-server-utest-8.0.1-SNAPSHOT-sources.jar
[INFO] 
[INFO] --- maven-bundle-plugin:3.2.0:install (default-install) @ juneau-rest-server-utest
---
[INFO] Installing org/apache/juneau/juneau-rest-server-utest/8.0.1-SNAPSHOT/juneau-rest-server-utest-8.0.1-SNAPSHOT.jar
[INFO] Writing OBR metadata
[INFO] 
[INFO] --- maven-deploy-plugin:2.8.2:deploy (default-deploy) @ juneau-rest-server-utest ---
Downloading: https://repository.apache.org/content/repositories/snapshots/org/apache/juneau/juneau-rest-server-utest/8.0.1-SNAPSHOT/maven-metadata.xml
2/2 KB            Downloaded: https://repository.apache.org/content/repositories/snapshots/org/apache/juneau/juneau-rest-server-utest/8.0.1-SNAPSHOT/maven-metadata.xml
(2 KB at 1.9 KB/sec)
Uploading: https://repository.apache.org/content/repositories/snapshots/org/apache/juneau/juneau-rest-server-utest/8.0.1-SNAPSHOT/juneau-rest-server-utest-8.0.1-20190629.181339-6.jar
2/9 KB   4/9 KB   6/9 KB   8/9 KB   9/9 KB            Uploaded: https://repository.apache.org/content/repositories/snapshots/org/apache/juneau/juneau-rest-server-utest/8.0.1-SNAPSHOT/juneau-rest-server-utest-8.0.1-20190629.181339-6.jar
(9 KB at 9.3 KB/sec)
Uploading: https://repository.apache.org/content/repositories/snapshots/org/apache/juneau/juneau-rest-server-utest/8.0.1-SNAPSHOT/juneau-rest-server-utest-8.0.1-20190629.181339-6.pom
2/6 KB   4/6 KB   6/6 KB            Uploaded: https://repository.apache.org/content/repositories/snapshots/org/apache/juneau/juneau-rest-server-utest/8.0.1-SNAPSHOT/juneau-rest-server-utest-8.0.1-20190629.181339-6.pom
(6 KB at 5.5 KB/sec)
Downloading: https://repository.apache.org/content/repositories/snapshots/org/apache/juneau/juneau-rest-server-utest/maven-metadata.xml
301/301 B               Downloaded: https://repository.apache.org/content/repositories/snapshots/org/apache/juneau/juneau-rest-server-utest/maven-metadata.xml
(301 B at 0.5 KB/sec)
Uploading: https://repository.apache.org/content/repositories/snapshots/org/apache/juneau/juneau-rest-server-utest/8.0.1-SNAPSHOT/maven-metadata.xml
2/2 KB               Uploaded: https://repository.apache.org/content/repositories/snapshots/org/apache/juneau/juneau-rest-server-utest/8.0.1-SNAPSHOT/maven-metadata.xml
(2 KB at 1.3 KB/sec)
Uploading: https://repository.apache.org/content/repositories/snapshots/org/apache/juneau/juneau-rest-server-utest/maven-metadata.xml
301/301 B               Uploaded: https://repository.apache.org/content/repositories/snapshots/org/apache/juneau/juneau-rest-server-utest/maven-metadata.xml
(301 B at 0.3 KB/sec)
Uploading: https://repository.apache.org/content/repositories/snapshots/org/apache/juneau/juneau-rest-server-utest/8.0.1-SNAPSHOT/juneau-rest-server-utest-8.0.1-20190629.181339-6-tests.jar
2/598 KB    4/598 KB   6/598 KB   8/598 KB   10/598 KB   12/598 KB   14/598 KB   16/598 KB
  18/598 KB   20/598 KB   22/598 KB   24/598 KB   26/598 KB   28/598 KB   30/598 KB   32/598
KB   34/598 KB   36/598 KB   38/598 KB   40/598 KB   42/598 KB   44/598 KB   46/598 KB   48/598
KB   50/598 KB   52/598 KB   54/598 KB   56/598 KB   58/598 KB   60/598 KB   62/598 KB   64/598
KB   66/598 KB   68/598 KB   70/598 KB   72/598 KB   74/598 KB   76/598 KB   78/598 KB   80/598
KB   82/598 KB   84/598 KB   86/598 KB   88/598 KB   90/598 KB   92/598 KB   94/598 KB   96/598
KB   98/598 KB   100/598 KB   102/598 KB   104/598 KB   106/598 KB   108/598 KB   110/598
KB   112/598 KB   114/598 KB   116/598 KB   118/598 KB   120/598 KB   122/598 KB   124/598
KB   126/598 KB   128/598 KB   130/598 KB   132/598 KB   134/598 KB   136/598 KB   138/598
KB   140/598 KB   142/598 KB   144/598 KB   146/598 KB   148/598 KB   150/598 KB   152/598
KB   154/598 KB   156/598 KB   158/598 KB   160/598 KB   162/598 KB   164/598 KB   166/598
KB   168/598 KB   170/598 KB   172/598 KB   174/598 KB   176/598 KB   178/598 KB   180/598
KB   182/598 KB   184/598 KB   186/598 KB   188/598 KB   190/598 KB   192/598 KB   194/598
KB   196/598 KB   198/598 KB   200/598 KB   202/598 KB   204/598 KB   206/598 KB   208/598
KB   210/598 KB   212/598 KB   214/598 KB   216/598 KB   218/598 KB   220/598 KB   222/598
KB   224/598 KB   226/598 KB   228/598 KB   230/598 KB   232/598 KB   234/598 KB   236/598
KB   238/598 KB   240/598 KB   242/598 KB   244/598 KB   246/598 KB   248/598 KB   250/598
KB   252/598 KB   254/598 KB   256/598 KB   258/598 KB   260/598 KB   262/598 KB   264/598
KB   266/598 KB   268/598 KB   270/598 KB   272/598 KB   274/598 KB   276/598 KB   278/598
KB   280/598 KB   282/598 KB   284/598 KB   286/598 KB   288/598 KB   290/598 KB   292/598
KB   294/598 KB   296/598 KB   298/598 KB   300/598 KB   302/598 KB   304/598 KB   306/598
KB   308/598 KB   310/598 KB   312/598 KB   314/598 KB   316/598 KB   318/598 KB   320/598
KB   322/598 KB   324/598 KB   326/598 KB   328/598 KB   330/598 KB   332/598 KB   334/598
KB   336/598 KB   338/598 KB   340/598 KB   342/598 KB   344/598 KB   346/598 KB   348/598
KB   350/598 KB   352/598 KB   354/598 KB   356/598 KB   358/598 KB   360/598 KB   362/598
KB   364/598 KB   366/598 KB   368/598 KB   370/598 KB   372/598 KB   374/598 KB   376/598
KB   378/598 KB   380/598 KB   382/598 KB   384/598 KB   386/598 KB   388/598 KB   390/598
KB   392/598 KB   394/598 KB   396/598 KB   398/598 KB   400/598 KB   402/598 KB   404/598
KB   406/598 KB   408/598 KB   410/598 KB   412/598 KB   414/598 KB   416/598 KB   418/598
KB   420/598 KB   422/598 KB   424/598 KB   426/598 KB   428/598 KB   430/598 KB   432/598
KB   434/598 KB   436/598 KB   438/598 KB   440/598 KB   442/598 KB   444/598 KB   446/598
KB   448/598 KB   450/598 KB   452/598 KB   454/598 KB   456/598 KB   458/598 KB   460/598
KB   462/598 KB   464/598 KB   466/598 KB   468/598 KB   470/598 KB   472/598 KB   474/598
KB   476/598 KB   478/598 KB   480/598 KB   482/598 KB   484/598 KB   486/598 KB   488/598
KB   490/598 KB   492/598 KB   494/598 KB   496/598 KB   498/598 KB   500/598 KB   502/598
KB   504/598 KB   506/598 KB   508/598 KB   510/598 KB   512/598 KB   514/598 KB   516/598
KB   518/598 KB   520/598 KB   522/598 KB   524/598 KB   526/598 KB   528/598 KB   530/598
KB   532/598 KB   534/598 KB   536/598 KB   538/598 KB   540/598 KB   542/598 KB   544/598
KB   546/598 KB   548/598 KB   550/598 KB   552/598 KB   554/598 KB   556/598 KB   558/598
KB   560/598 KB   562/598 KB   564/598 KB   566/598 KB   568/598 KB   570/598 KB   572/598
KB   574/598 KB   576/598 KB   578/598 KB   580/598 KB   582/598 KB   584/598 KB   586/598
KB   588/598 KB   590/598 KB   592/598 KB   594/598 KB   596/598 KB   598/598 KB         
      Uploaded: https://repository.apache.org/content/repositories/snapshots/org/apache/juneau/juneau-rest-server-utest/8.0.1-SNAPSHOT/juneau-rest-server-utest-8.0.1-20190629.181339-6-tests.jar
(598 KB at 471.3 KB/sec)
Uploading: https://repository.apache.org/content/repositories/snapshots/org/apache/juneau/juneau-rest-server-utest/8.0.1-SNAPSHOT/maven-metadata.xml
2/2 KB                Uploaded: https://repository.apache.org/content/repositories/snapshots/org/apache/juneau/juneau-rest-server-utest/8.0.1-SNAPSHOT/maven-metadata.xml
(2 KB at 1.3 KB/sec)
Uploading: https://repository.apache.org/content/repositories/snapshots/org/apache/juneau/juneau-rest-server-utest/8.0.1-SNAPSHOT/juneau-rest-server-utest-8.0.1-20190629.181339-6-sources.jar
2/9 KB   4/9 KB   6/9 KB   8/9 KB   9/9 KB            Uploaded: https://repository.apache.org/content/repositories/snapshots/org/apache/juneau/juneau-rest-server-utest/8.0.1-SNAPSHOT/juneau-rest-server-utest-8.0.1-20190629.181339-6-sources.jar
(9 KB at 8.9 KB/sec)
Uploading: https://repository.apache.org/content/repositories/snapshots/org/apache/juneau/juneau-rest-server-utest/8.0.1-SNAPSHOT/maven-metadata.xml
2/2 KB            Uploaded: https://repository.apache.org/content/repositories/snapshots/org/apache/juneau/juneau-rest-server-utest/8.0.1-SNAPSHOT/maven-metadata.xml
(2 KB at 1.3 KB/sec)
Uploading: https://repository.apache.org/content/repositories/snapshots/org/apache/juneau/juneau-rest-server-utest/8.0.1-SNAPSHOT/juneau-rest-server-utest-8.0.1-20190629.181339-6-tests.jar
2/598 KB   4/598 KB   6/598 KB   8/598 KB   10/598 KB   12/598 KB   14/598 KB   16/598 KB
  18/598 KB   20/598 KB   22/598 KB   24/598 KB   26/598 KB   28/598 KB   30/598 KB   32/598
KB   34/598 KB   36/598 KB   38/598 KB   40/598 KB   42/598 KB   44/598 KB   46/598 KB   48/598
KB   50/598 KB   52/598 KB   54/598 KB   56/598 KB   58/598 KB   60/598 KB   62/598 KB   64/598
KB   66/598 KB   68/598 KB   70/598 KB   72/598 KB   74/598 KB   76/598 KB   78/598 KB   80/598
KB   82/598 KB   84/598 KB   86/598 KB   88/598 KB   90/598 KB   92/598 KB   94/598 KB   96/598
KB   98/598 KB   100/598 KB   102/598 KB   104/598 KB   106/598 KB   108/598 KB   110/598
KB   112/598 KB   114/598 KB   116/598 KB   118/598 KB   120/598 KB   122/598 KB   124/598
KB   126/598 KB   128/598 KB   130/598 KB   132/598 KB   134/598 KB   136/598 KB   138/598
KB   140/598 KB   142/598 KB   144/598 KB   146/598 KB   148/598 KB   150/598 KB   152/598
KB   154/598 KB   156/598 KB   158/598 KB   160/598 KB   162/598 KB   164/598 KB   166/598
KB   168/598 KB   170/598 KB   172/598 KB   174/598 KB   176/598 KB   178/598 KB   180/598
KB   182/598 KB   184/598 KB   186/598 KB   188/598 KB   190/598 KB   192/598 KB   194/598
KB   196/598 KB   198/598 KB   200/598 KB   202/598 KB   204/598 KB   206/598 KB   208/598
KB   210/598 KB   212/598 KB   214/598 KB   216/598 KB   218/598 KB   220/598 KB   222/598
KB   224/598 KB   226/598 KB   228/598 KB   230/598 KB   232/598 KB   234/598 KB   236/598
KB   238/598 KB   240/598 KB   242/598 KB   244/598 KB   246/598 KB   248/598 KB   250/598
KB   252/598 KB   254/598 KB   256/598 KB   258/598 KB   260/598 KB   262/598 KB   264/598
KB   266/598 KB   268/598 KB   270/598 KB   272/598 KB   274/598 KB   276/598 KB   278/598
KB   280/598 KB   282/598 KB   284/598 KB   286/598 KB   288/598 KB   290/598 KB   292/598
KB   294/598 KB   296/598 KB   298/598 KB   300/598 KB   302/598 KB   304/598 KB   306/598
KB   308/598 KB   310/598 KB   312/598 KB   314/598 KB   316/598 KB   318/598 KB   320/598
KB   322/598 KB   324/598 KB   326/598 KB   328/598 KB   330/598 KB   332/598 KB   334/598
KB   336/598 KB   338/598 KB   340/598 KB   342/598 KB   344/598 KB   346/598 KB   348/598
KB   350/598 KB   352/598 KB   354/598 KB   356/598 KB   358/598 KB   360/598 KB   362/598
KB   364/598 KB   366/598 KB   368/598 KB   370/598 KB   372/598 KB   374/598 KB   376/598
KB   378/598 KB   380/598 KB   382/598 KB   384/598 KB   386/598 KB   388/598 KB   390/598
KB   392/598 KB   394/598 KB   396/598 KB   398/598 KB   400/598 KB   402/598 KB   404/598
KB   406/598 KB   408/598 KB   410/598 KB   412/598 KB   414/598 KB   416/598 KB   418/598
KB   420/598 KB   422/598 KB   424/598 KB   426/598 KB   428/598 KB   430/598 KB   432/598
KB   434/598 KB   436/598 KB   438/598 KB   440/598 KB   442/598 KB   444/598 KB   446/598
KB   448/598 KB   450/598 KB   452/598 KB   454/598 KB   456/598 KB   458/598 KB   460/598
KB   462/598 KB   464/598 KB   466/598 KB   468/598 KB   470/598 KB   472/598 KB   474/598
KB   476/598 KB   478/598 KB   480/598 KB   482/598 KB   484/598 KB   486/598 KB   488/598
KB   490/598 KB   492/598 KB   494/598 KB   496/598 KB   498/598 KB   500/598 KB   502/598
KB   504/598 KB   506/598 KB   508/598 KB   510/598 KB   512/598 KB   514/598 KB   516/598
KB   518/598 KB   520/598 KB   522/598 KB   524/598 KB   526/598 KB   528/598 KB   530/598
KB   532/598 KB   534/598 KB   536/598 KB   538/598 KB   540/598 KB   542/598 KB   544/598
KB   546/598 KB   548/598 KB   550/598 KB   552/598 KB   554/598 KB   556/598 KB   558/598
KB   560/598 KB   562/598 KB   564/598 KB   566/598 KB   568/598 KB   570/598 KB   572/598
KB   574/598 KB   576/598 KB   578/598 KB   580/598 KB   582/598 KB   584/598 KB   586/598
KB   588/598 KB   590/598 KB   592/598 KB   594/598 KB   596/598 KB   598/598 KB         
      Uploaded: https://repository.apache.org/content/repositories/snapshots/org/apache/juneau/juneau-rest-server-utest/8.0.1-SNAPSHOT/juneau-rest-server-utest-8.0.1-20190629.181339-6-tests.jar
(598 KB at 472.0 KB/sec)
Uploading: https://repository.apache.org/content/repositories/snapshots/org/apache/juneau/juneau-rest-server-utest/8.0.1-SNAPSHOT/maven-metadata.xml
2/2 KB                Uploaded: https://repository.apache.org/content/repositories/snapshots/org/apache/juneau/juneau-rest-server-utest/8.0.1-SNAPSHOT/maven-metadata.xml
(2 KB at 1.3 KB/sec)
Uploading: https://repository.apache.org/content/repositories/snapshots/org/apache/juneau/juneau-rest-server-utest/8.0.1-SNAPSHOT/juneau-rest-server-utest-8.0.1-20190629.181339-6-sources.jar
2/9 KB   4/9 KB   6/9 KB   8/9 KB   9/9 KB            Uploaded: https://repository.apache.org/content/repositories/snapshots/org/apache/juneau/juneau-rest-server-utest/8.0.1-SNAPSHOT/juneau-rest-server-utest-8.0.1-20190629.181339-6-sources.jar
(9 KB at 8.9 KB/sec)
Uploading: https://repository.apache.org/content/repositories/snapshots/org/apache/juneau/juneau-rest-server-utest/8.0.1-SNAPSHOT/maven-metadata.xml
2/2 KB            Uploaded: https://repository.apache.org/content/repositories/snapshots/org/apache/juneau/juneau-rest-server-utest/8.0.1-SNAPSHOT/maven-metadata.xml
(2 KB at 1.3 KB/sec)
[INFO] 
[INFO] --- maven-bundle-plugin:3.2.0:deploy (default-deploy) @ juneau-rest-server-utest ---
[INFO] Remote OBR update disabled (enable with -DremoteOBR)
[INFO]                                                                         
[INFO] ------------------------------------------------------------------------
[INFO] Building Apache Juneau REST Client API (Unit Tests) 8.0.1-SNAPSHOT
[INFO] ------------------------------------------------------------------------
Downloading: http://repository.apache.org/snapshots/org/apache/juneau/juneau-rest-mock/8.0.1-SNAPSHOT/juneau-rest-mock-8.0.1-SNAPSHOT-tests.jar
         [INFO]                                                                         
[INFO] ------------------------------------------------------------------------
[INFO] Skipping Apache Juneau
[INFO] This project has been banned from the build due to previous failures.
[INFO] ------------------------------------------------------------------------
[INFO] ------------------------------------------------------------------------
[INFO] Reactor Summary:
[INFO] 
[INFO] Apache Juneau ...................................... SUCCESS [  5.947 s]
[INFO] Apache Juneau - Core APIs .......................... SUCCESS [  4.217 s]
[INFO] Apache Juneau Marshall ............................. SUCCESS [ 40.859 s]
[INFO] Apache Juneau Marshal RDF .......................... SUCCESS [ 12.244 s]
[INFO] Apache Juneau Data Transfer Objects ................ SUCCESS [ 13.533 s]
[INFO] Apache Juneau Core ................................. SUCCESS [  9.352 s]
[INFO] Apache Juneau Config File API ...................... SUCCESS [ 10.203 s]
[INFO] Apache Juneau Core (Unit Tests) .................... SUCCESS [ 49.299 s]
[INFO] Apache Juneau - REST APIs .......................... SUCCESS [  4.062 s]
[INFO] Apache Juneau REST Servlet API ..................... SUCCESS [ 18.700 s]
[INFO] Apache Juneau REST JAX/RS API ...................... SUCCESS [  9.586 s]
[INFO] Apache Juneau REST Servlet API, RDF support ........ SUCCESS [ 13.748 s]
[INFO] Apache Juneau REST Spring Boot Integration ......... SUCCESS [ 13.431 s]
[INFO] Apache Juneau REST Client API ...................... SUCCESS [ 10.686 s]
[INFO] Apache Juneau REST Mock API ........................ SUCCESS [  9.716 s]
[INFO] Apache Juneau REST Mock API (Unit Tests) ........... SUCCESS [ 13.070 s]
[INFO] Apache Juneau REST Servlet API (Unit Tests) ........ SUCCESS [ 26.131 s]
[INFO] Apache Juneau REST Client API (Unit Tests) ......... FAILURE [  0.174 s]
[INFO] Apache Juneau - Microservice APIs .................. SKIPPED
[INFO] Apache Juneau Microservice Core Library ............ SKIPPED
[INFO] Apache Juneau Microservice Server .................. SKIPPED
[INFO] Apache Juneau Jetty Microservice Template .......... SKIPPED
[INFO] Apache Juneau - Examples ........................... SKIPPED
[INFO] Apache Juneau REST Examples ........................ SKIPPED
[INFO] Apache Juneau Microservice (Function Tests) ........ SKIPPED
[INFO] Apache Juneau Spring Boot Microservice Template .... SKIPPED
[INFO] Apache Juneau Core Examples ........................ SKIPPED
[INFO] Apache Juneau REST Examples using Jetty ............ SKIPPED
[INFO] Apache Juneau REST Examples using Spring Boot ...... SKIPPED
[INFO] Apache Juneau REST Examples (Function Tests) ....... SKIPPED
[INFO] Apache Juneau Javadocs ............................. SKIPPED
[INFO] Apache Juneau - Release Engineering ................ SKIPPED
[INFO] Apache Juneau UberJar .............................. SKIPPED
[INFO] Apache Juneau Distribution ......................... SKIPPED
[INFO] Apache Juneau - Configuration Server ............... SKIPPED
[INFO] Apache Juneau Configuration Server API ............. SKIPPED
[INFO] ------------------------------------------------------------------------
[INFO] BUILD FAILURE
[INFO] ------------------------------------------------------------------------
[INFO] Total time: 04:27 min
[INFO] Finished at: 2019-06-29T18:13:51+00:00
[INFO] Final Memory: 96M/1883M
[INFO] ------------------------------------------------------------------------
[ERROR] Failed to execute goal on project juneau-rest-client-utest: Could not resolve dependencies
for project org.apache.juneau:juneau-rest-client-utest:jar:8.0.1-SNAPSHOT: Could not find
artifact org.apache.juneau:juneau-rest-mock:jar:tests:8.0.1-SNAPSHOT in Nexus (http://repository.apache.org/snapshots)
-> [Help 1]
[ERROR] 
[ERROR] To see the full stack trace of the errors, re-run Maven with the -e switch.
[ERROR] Re-run Maven using the -X switch to enable full debug logging.
[ERROR] 
[ERROR] For more information about the errors and possible solutions, please read the following
articles:
[ERROR] [Help 1] http://cwiki.apache.org/confluence/display/MAVEN/DependencyResolutionException
[ERROR] 
[ERROR] After correcting the problems, you can resume the build with the command
[ERROR]   mvn <goals> -rf :juneau-rest-client-utest
Build step 'Invoke top-level Maven targets' marked build as failure
Recording test results
[TASKS] Skipping publisher since build result is FAILURE

Mime
View raw message