juneau-dev mailing list archives

Site index · List index
Message view « Date » · « Thread »
Top « Date » · « Thread »
From James Bognar <james.bog...@salesforce.com>
Subject Re: Build failed in Jenkins: Juneau-Java-1.7 #99
Date Mon, 10 Oct 2016 12:58:42 GMT
Hi Peter,

Yea...you didn't cause these.  I submitted a change a couple of days ago
that compiled cleanly locally but caused two compilation errors on
Jenkins.  They're fixed now.

On Sat, Oct 8, 2016 at 10:21 PM, Peter Haumer <phaumer@us.ibm.com> wrote:

> Apologies if I made a mess with my first push to the Apache Git, but I did
> not change these files. I did make the mistake to commit before fetching
> the latest changes, but then I merged and pushed.
> Could these compilation errors have already been in the previous push
> "JUNEAU-16 - Support for Swagger documentation"?
>
>
> Thanks and best regards,
> Peter Haumer.
>
> ______________________________________________________________
>
> PETER HAUMER, Dr. rer. nat.
> IBM zSystems Software
> ______________________________________________________________
>
> [image: Inactive hide details for Apache Jenkins Server ---10/08/2016
> 06:58:36 PM---See <https://builds.apache.org/job/Juneau-Java-1.7/]Apache
> Jenkins Server ---10/08/2016 06:58:36 PM---See <https://builds.apache.org/
> job/Juneau-Java-1.7/99/changes> Changes:
>
> From: Apache Jenkins Server <jenkins@builds.apache.org>
> To: dev@juneau.incubator.apache.org
> Date: 10/08/2016 06:58 PM
> Subject: Build failed in Jenkins: Juneau-Java-1.7 #99
> ------------------------------
>
>
>
> See <https://builds.apache.org/job/Juneau-Java-1.7/99/changes>
>
> Changes:
>
> [phaumer] StringUtils.parseNumber() returns doubles always as floats
>
> ------------------------------------------
> Started by an SCM change
> [EnvInject] - Loading node environment variables.
> Building remotely on ubuntu-2 (Ubuntu yahoo-not-h2 ubuntu docker) in
> workspace <https://builds.apache.org/job/Juneau-Java-1.7/ws/>
> > git rev-parse --is-inside-work-tree # timeout=10
> Fetching changes from the remote Git repository
> > git config remote.origin.url https://git-wip-us.apache.org/
> repos/asf/incubator-juneau.git # timeout=10
> Fetching upstream changes from https://git-wip-us.apache.org/
> repos/asf/incubator-juneau.git
> > git --version # timeout=10
> > git -c core.askpass=true fetch --tags --progress
> https://git-wip-us.apache.org/repos/asf/incubator-juneau.git
>  +refs/heads/*:refs/remotes/origin/*
> > git rev-parse refs/remotes/origin/master^{commit} # timeout=10
> > git rev-parse refs/remotes/origin/origin/master^{commit} # timeout=10
> Checking out Revision 8dde0c9dba486335c19c8e4d57886a828c2461d2
> (refs/remotes/origin/master)
> > git config core.sparsecheckout # timeout=10
> > git checkout -f 8dde0c9dba486335c19c8e4d57886a828c2461d2
> > git rev-list 7f2bcfdd9750c74b0d11444eb009ebf59fd3f088 # timeout=10
> [Juneau-Java-1.7] $ /home/jenkins/tools/maven/apache-maven-3.2.5/bin/mvn
> clean install deploy
> [INFO] Scanning for projects...
> [WARNING]
> [WARNING] Some problems were encountered while building the effective
> model for org.apache.juneau:juneau-core:bundle:6.0.0-incubating-SNAPSHOT
> [WARNING] 'build.plugins.plugin.version' for org.apache.felix:maven-bundle-plugin
> is missing. @ org.apache.juneau:juneau-core:[unknown-version], <
> https://builds.apache.org/job/Juneau-Java-1.7/ws/juneau-core/pom.xml,>
> line 50, column 12
> [WARNING]
> [WARNING] Some problems were encountered while building the effective
> model for org.apache.juneau:juneau-client:bundle:6.0.0-incubating-SNAPSHOT
> [WARNING] 'build.plugins.plugin.version' for org.apache.felix:maven-bundle-plugin
> is missing. @ org.apache.juneau:juneau-client:[unknown-version], <
> https://builds.apache.org/job/Juneau-Java-1.7/ws/juneau-client/pom.xml,>
> line 50, column 12
> [WARNING]
> [WARNING] Some problems were encountered while building the effective
> model for org.apache.juneau:juneau-server:bundle:6.0.0-incubating-SNAPSHOT
> [WARNING] 'build.plugins.plugin.version' for org.apache.felix:maven-bundle-plugin
> is missing. @ org.apache.juneau:juneau-server:[unknown-version], <
> https://builds.apache.org/job/Juneau-Java-1.7/ws/juneau-server/pom.xml,>
> line 69, column 12
> [WARNING]
> [WARNING] Some problems were encountered while building the effective
> model for org.apache.juneau:juneau-samples:jar:6.0.0-incubating-SNAPSHOT
> [WARNING] 'build.plugins.plugin.version' for org.codehaus.mojo:build-helper-maven-plugin
> is missing. @ org.apache.juneau:juneau-samples:[unknown-version], <
> https://builds.apache.org/job/Juneau-Java-1.7/ws/juneau-samples/pom.xml,>
> line 127, column 12
> [WARNING]
> [WARNING] It is highly recommended to fix these problems because they
> threaten the stability of your build.
> [WARNING]
> [WARNING] For this reason, future Maven versions might no longer support
> building such malformed projects.
> [WARNING]
> [INFO] ------------------------------------------------------------
> ------------
> [INFO] Reactor Build Order:
> [INFO]
> [INFO] Apache Juneau (incubating)
> [INFO] Apache Juneau Core
> [INFO] Apache Juneau Client
> [INFO] Apache Juneau Server
> [INFO] Apache Juneau Microservice
> [INFO] Apache Juneau Samples
> [INFO] Apache Juneau Server Test
> [INFO] Apache Juneau UberJar
> [INFO] Apache Juneau Distribution
> [INFO]
>
> [INFO] ------------------------------------------------------------
> ------------
> [INFO] Building Apache Juneau (incubating) 6.0.0-incubating-SNAPSHOT
> [INFO] ------------------------------------------------------------
> ------------
> [INFO]
> [INFO] --- maven-clean-plugin:3.0.0:clean (default-clean) @ juneau ---
> [INFO] Deleting <https://builds.apache.org/job/Juneau-Java-1.7/ws/target>
> [INFO]
> [INFO] --- maven-remote-resources-plugin:1.5:process
> (process-resource-bundles) @ juneau ---
> [INFO]
> [INFO] --- maven-site-plugin:3.5.1:attach-descriptor (attach-descriptor)
> @ juneau ---
> [INFO]
> [INFO] --- apache-rat-plugin:0.11:check (default) @ juneau ---
> [INFO] 59 implicit excludes (use -debug for more details).
> [INFO] Exclude: **/*.log
> [INFO] Exclude: **/*.log.*
> [INFO] Exclude: **/target/**
> [INFO] Exclude: DEPENDENCIES
> [INFO] Exclude: true
> [INFO] 32 resources included (use -debug for more details)
> [INFO] Rat check: Summary of files. Unapproved: 0 unknown: 0 generated: 0
> approved: 28 licence.
> [INFO]
> [INFO] --- maven-install-plugin:2.5.2:install (default-install) @ juneau
> ---
> [INFO] Installing <https://builds.apache.org/
> job/Juneau-Java-1.7/ws/pom.xml> to /home/jenkins/.m2/repository/
> org/apache/juneau/juneau/6.0.0-incubating-SNAPSHOT/juneau-
> 6.0.0-incubating-SNAPSHOT.pom
> [INFO]
> [INFO] --- maven-remote-resources-plugin:1.5:process
> (process-resource-bundles) @ juneau ---
> [INFO]
> [INFO] --- maven-site-plugin:3.5.1:attach-descriptor (attach-descriptor)
> @ juneau ---
> [INFO]
> [INFO] --- apache-rat-plugin:0.11:check (default) @ juneau ---
> [INFO] 59 implicit excludes (use -debug for more details).
> [INFO] Exclude: **/*.log
> [INFO] Exclude: **/*.log.*
> [INFO] Exclude: **/target/**
> [INFO] Exclude: DEPENDENCIES
> [INFO] Exclude: true
> [INFO] 32 resources included (use -debug for more details)
> [INFO] Rat check: Summary of files. Unapproved: 0 unknown: 0 generated: 0
> approved: 28 licence.
> [INFO]
> [INFO] --- maven-install-plugin:2.5.2:install (default-install) @ juneau
> ---
> [INFO] Installing <https://builds.apache.org/
> job/Juneau-Java-1.7/ws/pom.xml> to /home/jenkins/.m2/repository/
> org/apache/juneau/juneau/6.0.0-incubating-SNAPSHOT/juneau-
> 6.0.0-incubating-SNAPSHOT.pom
> [INFO]
> [INFO] --- maven-deploy-plugin:2.8.2:deploy (default-deploy) @ juneau ---
> Downloading: https://repository.apache.org/content/repositories/
> snapshots/org/apache/juneau/juneau/6.0.0-incubating-
> SNAPSHOT/maven-metadata.xml
> 624/624 B
>
> Downloaded: https://repository.apache.org/content/repositories/
> snapshots/org/apache/juneau/juneau/6.0.0-incubating-
> SNAPSHOT/maven-metadata.xml (624 B at 0.5 KB/sec)
> Uploading: https://repository.apache.org/content/repositories/
> snapshots/org/apache/juneau/juneau/6.0.0-incubating-SNAPSHOT/juneau-6.0.0-
> incubating-20161009.015534-89.pom
> 2/10 KB
> 4/10 KB
> 6/10 KB
> 8/10 KB
> 10/10 KB
>
> Uploaded: https://repository.apache.org/content/repositories/
> snapshots/org/apache/juneau/juneau/6.0.0-incubating-SNAPSHOT/juneau-6.0.0-
> incubating-20161009.015534-89.pom (10 KB at 7.9 KB/sec)
> Downloading: https://repository.apache.org/content/repositories/
> snapshots/org/apache/juneau/juneau/maven-metadata.xml
> 416/416 B
>
> Downloaded: https://repository.apache.org/content/repositories/
> snapshots/org/apache/juneau/juneau/maven-metadata.xml (416 B at 0.4
> KB/sec)
> Uploading: https://repository.apache.org/content/repositories/
> snapshots/org/apache/juneau/juneau/6.0.0-incubating-
> SNAPSHOT/maven-metadata.xml
> 624/624 B
>
> Uploaded: https://repository.apache.org/content/repositories/
> snapshots/org/apache/juneau/juneau/6.0.0-incubating-
> SNAPSHOT/maven-metadata.xml (624 B at 0.7 KB/sec)
> Uploading: https://repository.apache.org/content/repositories/
> snapshots/org/apache/juneau/juneau/maven-metadata.xml
> 416/416 B
>
> Uploaded: https://repository.apache.org/content/repositories/
> snapshots/org/apache/juneau/juneau/maven-metadata.xml (416 B at 0.5
> KB/sec)
> [INFO]
>
> [INFO] ------------------------------------------------------------
> ------------
> [INFO] Building Apache Juneau Core 6.0.0-incubating-SNAPSHOT
> [INFO] ------------------------------------------------------------
> ------------
> [INFO]
> [INFO] --- maven-clean-plugin:3.0.0:clean (default-clean) @ juneau-core ---
> [INFO] Deleting <https://builds.apache.org/job/Juneau-Java-1.7/ws/juneau-
> core/target>
> [INFO]
> [INFO] --- jacoco-maven-plugin:0.7.2.201409121644:prepare-agent
> (default-prepare-agent) @ juneau-core ---
> [INFO] argLine set to -javaagent:/home/jenkins/.m2/
> repository/org/jacoco/org.jacoco.agent/0.7.2.
> 201409121644/org.jacoco.agent-0.7.2.201409121644-runtime.jar=destfile=<
> https://builds.apache.org/job/Juneau-Java-1.7/ws/juneau-core/target/
> jacoco.exec>
> [INFO]
> [INFO] --- maven-remote-resources-plugin:1.5:process
> (process-resource-bundles) @ juneau-core ---
> [INFO]
> [INFO] --- maven-resources-plugin:2.7:resources (default-resources) @
> juneau-core ---
> [INFO] Using 'UTF-8' encoding to copy filtered resources.
> [INFO] Copying 1 resource
> [INFO] Copying 3 resources
> [INFO]
> [INFO] --- maven-compiler-plugin:3.5.1:compile (default-compile) @
> juneau-core ---
> [INFO] Changes detected - recompiling the module!
> [INFO] Compiling 410 source files to <https://builds.apache.org/
> job/Juneau-Java-1.7/ws/juneau-core/target/classes>
> [INFO] <https://builds.apache.org/job/Juneau-Java-1.7/ws/juneau-
> core/src/main/java/org/apache/juneau/BeanContext.java>: <
> https://builds.apache.org/job/Juneau-Java-1.7/ws/juneau-
> core/src/main/java/org/apache/juneau/BeanContext.java> uses unchecked or
> unsafe operations.
> [INFO] <https://builds.apache.org/job/Juneau-Java-1.7/ws/juneau-
> core/src/main/java/org/apache/juneau/BeanContext.java>: Recompile with
> -Xlint:unchecked for details.
> [INFO] -------------------------------------------------------------
> [ERROR] COMPILATION ERROR :
> [INFO] -------------------------------------------------------------
> [ERROR] <https://builds.apache.org/job/Juneau-Java-1.7/ws/juneau-
> core/src/main/java/org/apache/juneau/internal/FileUtils.java>:[190,63]
> <anonymous org.apache.juneau.internal.FileUtils$1$1> is not abstract and
> does not override abstract method remove() in java.util.Iterator
> [INFO] 1 error
> [INFO] -------------------------------------------------------------
> [INFO] ------------------------------------------------------------
> ------------
> [INFO] Reactor Summary:
> [INFO]
> [INFO] Apache Juneau (incubating) ......................... SUCCESS [
> 15.186 s]
> [INFO] Apache Juneau Core ................................. FAILURE [
> 26.512 s]
> [INFO] Apache Juneau Client ............................... SKIPPED
> [INFO] Apache Juneau Server ............................... SKIPPED
> [INFO] Apache Juneau Microservice ......................... SKIPPED
> [INFO] Apache Juneau Samples .............................. SKIPPED
> [INFO] Apache Juneau Server Test .......................... SKIPPED
> [INFO] Apache Juneau UberJar .............................. SKIPPED
> [INFO] Apache Juneau Distribution ......................... SKIPPED
> [INFO] ------------------------------------------------------------
> ------------
> [INFO] BUILD FAILURE
> [INFO] ------------------------------------------------------------
> ------------
> [INFO] Total time: 44.273 s
> [INFO] Finished at: 2016-10-09T01:56:04+00:00
> [INFO] Final Memory: 29M/723M
> [INFO] ------------------------------------------------------------
> ------------
> [ERROR] Failed to execute goal org.apache.maven.plugins:
> maven-compiler-plugin:3.5.1:compile (default-compile) on project
> juneau-core: Compilation failure
> [ERROR] <https://builds.apache.org/job/Juneau-Java-1.7/ws/juneau-
> core/src/main/java/org/apache/juneau/internal/FileUtils.java>:[190,63]
> <anonymous org.apache.juneau.internal.FileUtils$1$1> is not abstract and
> does not override abstract method remove() in java.util.Iterator
> [ERROR] -> [Help 1]
> [ERROR]
> [ERROR] To see the full stack trace of the errors, re-run Maven with the
> -e switch.
> [ERROR] Re-run Maven using the -X switch to enable full debug logging.
> [ERROR]
> [ERROR] For more information about the errors and possible solutions,
> please read the following articles:
> [ERROR] [Help 1] http://cwiki.apache.org/confluence/display/MAVEN/
> MojoFailureException
> [ERROR]
> [ERROR] After correcting the problems, you can resume the build with the
> command
> [ERROR]   mvn <goals> -rf :juneau-core
> Build step 'Invoke top-level Maven targets' marked build as failure
>
>
>
>
>


-- 
James Bognar

Mime
  • Unnamed multipart/alternative (inline, None, 0 bytes)
View raw message