juneau-dev mailing list archives

Site index · List index
Message view « Date » · « Thread »
Top « Date » · « Thread »
From Apache Jenkins Server <jenk...@builds.apache.org>
Subject Build failed in Jenkins: Juneau-Java-1.7 #104
Date Thu, 27 Oct 2016 23:35:38 GMT
See <https://builds.apache.org/job/Juneau-Java-1.7/104/changes>

Changes:

[jamesbognar] [JUNEAU-17] - Resolve various small issues pointed out during release of

------------------------------------------
[...truncated 11435 lines...]
Tests run: 22, Failures: 0, Errors: 0, Skipped: 0, Time elapsed: 0.139 sec - in org.apache.juneau.a.rttests.RoundTripReadOnlyBeansTest
Running org.apache.juneau.a.rttests.RoundTripEnumTest
Tests run: 176, Failures: 0, Errors: 0, Skipped: 0, Time elapsed: 0.79 sec - in org.apache.juneau.a.rttests.RoundTripEnumTest
Running org.apache.juneau.a.rttests.RoundTripMapsTest
Tests run: 132, Failures: 0, Errors: 0, Skipped: 0, Time elapsed: 0.519 sec - in org.apache.juneau.a.rttests.RoundTripMapsTest
Running org.apache.juneau.a.rttests.RoundTripNumericConstructorsTest
Tests run: 22, Failures: 0, Errors: 0, Skipped: 0, Time elapsed: 0.035 sec - in org.apache.juneau.a.rttests.RoundTripNumericConstructorsTest
Running org.apache.juneau.a.rttests.RoundTripObjectsWithSpecialMethodsTest
Tests run: 44, Failures: 0, Errors: 0, Skipped: 0, Time elapsed: 0.122 sec - in org.apache.juneau.a.rttests.RoundTripObjectsWithSpecialMethodsTest
Running org.apache.juneau.a.rttests.RoundTripLargeObjectsTest
Tests run: 1, Failures: 0, Errors: 0, Skipped: 1, Time elapsed: 0 sec - in org.apache.juneau.a.rttests.RoundTripLargeObjectsTest
Running org.apache.juneau.a.rttests.RoundTripSimpleObjectsTest
Tests run: 1188, Failures: 0, Errors: 0, Skipped: 0, Time elapsed: 2.289 sec - in org.apache.juneau.a.rttests.RoundTripSimpleObjectsTest
Running org.apache.juneau.a.rttests.RoundTripPrimitiveObjectBeansTest
Tests run: 44, Failures: 0, Errors: 0, Skipped: 0, Time elapsed: 1.31 sec - in org.apache.juneau.a.rttests.RoundTripPrimitiveObjectBeansTest
Running org.apache.juneau.a.rttests.RoundTripBeanInheritanceTest
Tests run: 44, Failures: 0, Errors: 0, Skipped: 0, Time elapsed: 0.09 sec - in org.apache.juneau.a.rttests.RoundTripBeanInheritanceTest
Running org.apache.juneau.a.rttests.RoundTripDTOsTest
Tests run: 44, Failures: 0, Errors: 0, Skipped: 0, Time elapsed: 0.822 sec - in org.apache.juneau.a.rttests.RoundTripDTOsTest
Running org.apache.juneau.a.rttests.RoundTripPrimitivesBeansTest
Tests run: 44, Failures: 0, Errors: 0, Skipped: 0, Time elapsed: 0.922 sec - in org.apache.juneau.a.rttests.RoundTripPrimitivesBeansTest
Running org.apache.juneau.a.rttests.RoundTripAddClassAttrsTest
Tests run: 70, Failures: 0, Errors: 0, Skipped: 0, Time elapsed: 0.261 sec - in org.apache.juneau.a.rttests.RoundTripAddClassAttrsTest
Running org.apache.juneau.a.rttests.RoundTripTrimStringsTest
Tests run: 22, Failures: 0, Errors: 0, Skipped: 0, Time elapsed: 0.121 sec - in org.apache.juneau.a.rttests.RoundTripTrimStringsTest
Running org.apache.juneau.a.rttests.RoundTripToObjectMapsTest
Tests run: 22, Failures: 0, Errors: 0, Skipped: 0, Time elapsed: 0.089 sec - in org.apache.juneau.a.rttests.RoundTripToObjectMapsTest
Running org.apache.juneau.a.rttests.RoundTripTransformBeansTest
Tests run: 132, Failures: 0, Errors: 0, Skipped: 0, Time elapsed: 0.411 sec - in org.apache.juneau.a.rttests.RoundTripTransformBeansTest
Running org.apache.juneau.a.rttests.RoundTripObjectsAsStringsTest
Tests run: 66, Failures: 0, Errors: 0, Skipped: 0, Time elapsed: 0.102 sec - in org.apache.juneau.a.rttests.RoundTripObjectsAsStringsTest
Running org.apache.juneau.a.rttests.RoundTripBeanMapsTest
Tests run: 506, Failures: 0, Errors: 0, Skipped: 0, Time elapsed: 1.029 sec - in org.apache.juneau.a.rttests.RoundTripBeanMapsTest
Running org.apache.juneau.a.rttests.RoundTripClassesTest
Tests run: 22, Failures: 0, Errors: 0, Skipped: 0, Time elapsed: 0.04 sec - in org.apache.juneau.a.rttests.RoundTripClassesTest
Running org.apache.juneau.html.HtmlTest
Tests run: 5, Failures: 0, Errors: 0, Skipped: 0, Time elapsed: 0.017 sec - in org.apache.juneau.html.HtmlTest
Running org.apache.juneau.html.CommonTest
Tests run: 11, Failures: 0, Errors: 0, Skipped: 0, Time elapsed: 0.174 sec - in org.apache.juneau.html.CommonTest
Running org.apache.juneau.html.CommonParserTest
Tests run: 4, Failures: 0, Errors: 0, Skipped: 0, Time elapsed: 0.009 sec - in org.apache.juneau.html.CommonParserTest
Running org.apache.juneau.IgnoredClassesTest
Tests run: 2, Failures: 0, Errors: 0, Skipped: 1, Time elapsed: 0.009 sec - in org.apache.juneau.IgnoredClassesTest
Running org.apache.juneau.BeanFilterTest
Tests run: 3, Failures: 0, Errors: 0, Skipped: 0, Time elapsed: 0.007 sec - in org.apache.juneau.BeanFilterTest
Running org.apache.juneau.ParserReaderTest
Tests run: 5, Failures: 0, Errors: 0, Skipped: 0, Time elapsed: 0 sec - in org.apache.juneau.ParserReaderTest
Running org.apache.juneau.DataConversionTest
Tests run: 2, Failures: 0, Errors: 0, Skipped: 0, Time elapsed: 0.004 sec - in org.apache.juneau.DataConversionTest
Running org.apache.juneau.csv.CsvTest
Tests run: 1, Failures: 0, Errors: 0, Skipped: 0, Time elapsed: 0.001 sec - in org.apache.juneau.csv.CsvTest
Running org.apache.juneau.BeanConfigTest
Tests run: 12, Failures: 0, Errors: 0, Skipped: 0, Time elapsed: 0.104 sec - in org.apache.juneau.BeanConfigTest
Running org.apache.juneau.VisibilityTest
Tests run: 1, Failures: 0, Errors: 0, Skipped: 0, Time elapsed: 0.057 sec - in org.apache.juneau.VisibilityTest
Running org.apache.juneau.ini.ConfigMgrTest
---Usage---
java -cp juneau.jar org.apache.juneau.ini.ConfigFile createBatchEnvFile -configFile <configFile>
-envFile <envFile> [-verbose]
java -cp juneau.jar org.apache.juneau.ini.ConfigFile createShellEnvFile -configFile <configFile>
-envFile <envFile> [-verbose]
java -cp juneau.jar org.apache.juneau.ini.ConfigFile setVals -configFile <configFile>
-vals [var1 val1 [var2 val2...]] [-verbose]
Tests run: 4, Failures: 0, Errors: 0, Skipped: 0, Time elapsed: 0.043 sec - in org.apache.juneau.ini.ConfigMgrTest
Running org.apache.juneau.ini.ConfigFileTest
Tests run: 45, Failures: 0, Errors: 0, Skipped: 0, Time elapsed: 0.088 sec - in org.apache.juneau.ini.ConfigFileTest
Running org.apache.juneau.ClassMetaTest
Tests run: 7, Failures: 0, Errors: 0, Skipped: 0, Time elapsed: 0.009 sec - in org.apache.juneau.ClassMetaTest
Running org.apache.juneau.ContextFactoryTest
Tests run: 9, Failures: 0, Errors: 0, Skipped: 0, Time elapsed: 0.074 sec - in org.apache.juneau.ContextFactoryTest
Running org.apache.juneau.utils.MultiSetTest
Tests run: 1, Failures: 0, Errors: 0, Skipped: 0, Time elapsed: 0 sec - in org.apache.juneau.utils.MultiSetTest
Running org.apache.juneau.utils.PojoRestTest
Tests run: 10, Failures: 0, Errors: 0, Skipped: 0, Time elapsed: 0.028 sec - in org.apache.juneau.utils.PojoRestTest
Running org.apache.juneau.utils.ParserReaderTest
Tests run: 1, Failures: 0, Errors: 0, Skipped: 0, Time elapsed: 0 sec - in org.apache.juneau.utils.ParserReaderTest
Running org.apache.juneau.utils.StringBuilderWriterTest
Tests run: 1, Failures: 0, Errors: 0, Skipped: 0, Time elapsed: 0 sec - in org.apache.juneau.utils.StringBuilderWriterTest
Running org.apache.juneau.utils.PojoQueryTest
Tests run: 9, Failures: 0, Errors: 0, Skipped: 0, Time elapsed: 0.069 sec - in org.apache.juneau.utils.PojoQueryTest
Running org.apache.juneau.utils.ArgsTest
Tests run: 1, Failures: 0, Errors: 0, Skipped: 0, Time elapsed: 0 sec - in org.apache.juneau.utils.ArgsTest
Running org.apache.juneau.utils.CharSetTest
Tests run: 1, Failures: 0, Errors: 0, Skipped: 0, Time elapsed: 0 sec - in org.apache.juneau.utils.CharSetTest
Running org.apache.juneau.utils.ByteArrayCacheTest
Tests run: 1, Failures: 0, Errors: 0, Skipped: 0, Time elapsed: 0 sec - in org.apache.juneau.utils.ByteArrayCacheTest
Running org.apache.juneau.utils.IOPipeTest
Tests run: 5, Failures: 0, Errors: 0, Skipped: 0, Time elapsed: 0.007 sec - in org.apache.juneau.utils.IOPipeTest
Running org.apache.juneau.utils.FilteredMapTest
Tests run: 1, Failures: 0, Errors: 0, Skipped: 0, Time elapsed: 0 sec - in org.apache.juneau.utils.FilteredMapTest
Running org.apache.juneau.utils.IdentityListTest
Tests run: 1, Failures: 0, Errors: 0, Skipped: 0, Time elapsed: 0.001 sec - in org.apache.juneau.utils.IdentityListTest
Running org.apache.juneau.utils.ClassUtilsTest
Tests run: 3, Failures: 0, Errors: 0, Skipped: 0, Time elapsed: 0.001 sec - in org.apache.juneau.utils.ClassUtilsTest
Running org.apache.juneau.utils.StringVarResolverTest
Tests run: 7, Failures: 0, Errors: 0, Skipped: 0, Time elapsed: 0.01 sec - in org.apache.juneau.utils.StringVarResolverTest
Running org.apache.juneau.utils.ByteArrayInOutStreamTest
Tests run: 1, Failures: 0, Errors: 0, Skipped: 0, Time elapsed: 0 sec - in org.apache.juneau.utils.ByteArrayInOutStreamTest
Running org.apache.juneau.utils.KeywordStoreTest
Tests run: 1, Failures: 0, Errors: 0, Skipped: 0, Time elapsed: 0 sec - in org.apache.juneau.utils.KeywordStoreTest
Running org.apache.juneau.utils.MultiIterableTest
Tests run: 1, Failures: 0, Errors: 0, Skipped: 0, Time elapsed: 0.001 sec - in org.apache.juneau.utils.MultiIterableTest
Running org.apache.juneau.utils.StringUtilsTest
Tests run: 19, Failures: 0, Errors: 0, Skipped: 0, Time elapsed: 0.02 sec - in org.apache.juneau.utils.StringUtilsTest
Running org.apache.juneau.utils.CollectionUtilsTest
Tests run: 1, Failures: 0, Errors: 0, Skipped: 0, Time elapsed: 0 sec - in org.apache.juneau.utils.CollectionUtilsTest
Running org.apache.juneau.utils.SimpleMapTest
Tests run: 1, Failures: 0, Errors: 0, Skipped: 0, Time elapsed: 0.002 sec - in org.apache.juneau.utils.SimpleMapTest
Running org.apache.juneau.utils.IOUtilsTest
Tests run: 1, Failures: 0, Errors: 0, Skipped: 0, Time elapsed: 0 sec - in org.apache.juneau.utils.IOUtilsTest
Running org.apache.juneau.utils.ArrayUtilsTest
Tests run: 7, Failures: 0, Errors: 0, Skipped: 0, Time elapsed: 0.003 sec - in org.apache.juneau.utils.ArrayUtilsTest
Running org.apache.juneau.utils.PojoIntrospectorTest
Tests run: 1, Failures: 0, Errors: 0, Skipped: 0, Time elapsed: 0 sec - in org.apache.juneau.utils.PojoIntrospectorTest
Running org.apache.juneau.internal.VersionRangeTest
Tests run: 22, Failures: 0, Errors: 0, Skipped: 0, Time elapsed: 0.01 sec - in org.apache.juneau.internal.VersionRangeTest
Running org.apache.juneau.PojoSwapTest
Tests run: 1, Failures: 0, Errors: 0, Skipped: 0, Time elapsed: 0.001 sec - in org.apache.juneau.PojoSwapTest
Running org.apache.juneau.ObjectListTest
Tests run: 3, Failures: 0, Errors: 0, Skipped: 0, Time elapsed: 0.001 sec - in org.apache.juneau.ObjectListTest
Running org.apache.juneau.msgpack.MsgPackSerialzierTest
Tests run: 1, Failures: 0, Errors: 0, Skipped: 0, Time elapsed: 0.011 sec - in org.apache.juneau.msgpack.MsgPackSerialzierTest
Running org.apache.juneau.AnnotationsTest
Tests run: 2, Failures: 0, Errors: 0, Skipped: 0, Time elapsed: 0.002 sec - in org.apache.juneau.AnnotationsTest
Running org.apache.juneau.transforms.BeanFilterTest
Tests run: 6, Failures: 0, Errors: 0, Skipped: 0, Time elapsed: 0.016 sec - in org.apache.juneau.transforms.BeanFilterTest
Running org.apache.juneau.transforms.EnumerationSwapTest
Tests run: 1, Failures: 0, Errors: 0, Skipped: 0, Time elapsed: 0 sec - in org.apache.juneau.transforms.EnumerationSwapTest
Running org.apache.juneau.transforms.IteratorSwapTest
Tests run: 1, Failures: 0, Errors: 0, Skipped: 0, Time elapsed: 0 sec - in org.apache.juneau.transforms.IteratorSwapTest
Running org.apache.juneau.transforms.CalendarSwapTest
Tests run: 43, Failures: 0, Errors: 0, Skipped: 0, Time elapsed: 0.087 sec - in org.apache.juneau.transforms.CalendarSwapTest
Running org.apache.juneau.transforms.BeanMapTest
Tests run: 2, Failures: 0, Errors: 0, Skipped: 0, Time elapsed: 0.004 sec - in org.apache.juneau.transforms.BeanMapTest
Running org.apache.juneau.transforms.DateFilterTest
Tests run: 6, Failures: 0, Errors: 0, Skipped: 0, Time elapsed: 0.05 sec - in org.apache.juneau.transforms.DateFilterTest
Running org.apache.juneau.transforms.ByteArrayBase64SwapTest
Tests run: 44, Failures: 0, Errors: 0, Skipped: 0, Time elapsed: 0.226 sec - in org.apache.juneau.transforms.ByteArrayBase64SwapTest
Running org.apache.juneau.transforms.ReaderFilterTest
Tests run: 1, Failures: 0, Errors: 0, Skipped: 0, Time elapsed: 0.003 sec - in org.apache.juneau.transforms.ReaderFilterTest
Running org.apache.juneau.JacocoDummyTest
Tests run: 1, Failures: 0, Errors: 0, Skipped: 0, Time elapsed: 0 sec - in org.apache.juneau.JacocoDummyTest
Running org.apache.juneau.urlencoding.Common_UonTest
Tests run: 10, Failures: 0, Errors: 0, Skipped: 0, Time elapsed: 0.093 sec - in org.apache.juneau.urlencoding.Common_UonTest
Running org.apache.juneau.urlencoding.UrlEncodingSerializerTest
Tests run: 5, Failures: 0, Errors: 0, Skipped: 0, Time elapsed: 0.037 sec - in org.apache.juneau.urlencoding.UrlEncodingSerializerTest
Running org.apache.juneau.urlencoding.Common_UrlEncodingTest
Tests run: 10, Failures: 0, Errors: 0, Skipped: 0, Time elapsed: 0.075 sec - in org.apache.juneau.urlencoding.Common_UrlEncodingTest
Running org.apache.juneau.urlencoding.UonParserTest
Tests run: 3, Failures: 0, Errors: 0, Skipped: 0, Time elapsed: 0.009 sec - in org.apache.juneau.urlencoding.UonParserTest
Running org.apache.juneau.urlencoding.UrlEncodingParserTest
Tests run: 12, Failures: 0, Errors: 0, Skipped: 0, Time elapsed: 0.042 sec - in org.apache.juneau.urlencoding.UrlEncodingParserTest
Running org.apache.juneau.urlencoding.CommonParser_UrlEncodingTest
Tests run: 5, Failures: 0, Errors: 0, Skipped: 0, Time elapsed: 0.086 sec - in org.apache.juneau.urlencoding.CommonParser_UrlEncodingTest
Running org.apache.juneau.urlencoding.UonParserReaderTest
Tests run: 1, Failures: 0, Errors: 0, Skipped: 0, Time elapsed: 0 sec - in org.apache.juneau.urlencoding.UonParserReaderTest
Running org.apache.juneau.urlencoding.CommonParser_UonTest
Tests run: 4, Failures: 0, Errors: 0, Skipped: 0, Time elapsed: 0 sec - in org.apache.juneau.urlencoding.CommonParser_UonTest
Running org.apache.juneau.urlencoding.UonSerializerTest
Tests run: 2, Failures: 0, Errors: 0, Skipped: 0, Time elapsed: 0 sec - in org.apache.juneau.urlencoding.UonSerializerTest
Running org.apache.juneau.xml.XmlTest
Tests run: 27, Failures: 0, Errors: 0, Skipped: 0, Time elapsed: 0.318 sec - in org.apache.juneau.xml.XmlTest
Running org.apache.juneau.xml.CommonXmlTest
Tests run: 2, Failures: 0, Errors: 0, Skipped: 0, Time elapsed: 0.006 sec - in org.apache.juneau.xml.CommonXmlTest
Running org.apache.juneau.xml.CommonTest
Tests run: 10, Failures: 0, Errors: 0, Skipped: 0, Time elapsed: 0.097 sec - in org.apache.juneau.xml.CommonTest
Running org.apache.juneau.xml.CommonParserTest
Tests run: 4, Failures: 0, Errors: 0, Skipped: 0, Time elapsed: 0.015 sec - in org.apache.juneau.xml.CommonParserTest
Running org.apache.juneau.xml.XmlContentTest
Tests run: 3, Failures: 0, Errors: 0, Skipped: 0, Time elapsed: 0.02 sec - in org.apache.juneau.xml.XmlContentTest
Running org.apache.juneau.xml.XmlCollapsedTest
Tests run: 9, Failures: 0, Errors: 0, Skipped: 0, Time elapsed: 0.082 sec - in org.apache.juneau.xml.XmlCollapsedTest
Running org.apache.juneau.xml.XmlParserTest
Tests run: 3, Failures: 0, Errors: 0, Skipped: 0, Time elapsed: 0.007 sec - in org.apache.juneau.xml.XmlParserTest
Running org.apache.juneau.BeanMapTest
Tests run: 36, Failures: 0, Errors: 0, Skipped: 0, Time elapsed: 0.099 sec - in org.apache.juneau.BeanMapTest
Running org.apache.juneau.dto.atom.AtomTest
Tests run: 1, Failures: 1, Errors: 0, Skipped: 0, Time elapsed: 0.052 sec <<< FAILURE!
- in org.apache.juneau.dto.atom.AtomTest
testBasic(org.apache.juneau.dto.atom.AtomTest)  Time elapsed: 0.051 sec  <<< FAILURE!
org.junit.ComparisonFailure: 
expected:<...>
		Copyright (c) 20[03, Foobar Inc]
	</rights>
	<subtit...> but was:<...>
		Copyright (c) 20[16, Apache Foundation]
	</rights>
	<subtit...>
	at org.apache.juneau.dto.atom.AtomTest.testBasic(AtomTest.java:78)

Running org.apache.juneau.dto.cognos.CognosXmlTest
Tests run: 1, Failures: 0, Errors: 0, Skipped: 0, Time elapsed: 0.01 sec - in org.apache.juneau.dto.cognos.CognosXmlTest
Running org.apache.juneau.dto.jsonschema.JsonSchemaTest
Tests run: 2, Failures: 0, Errors: 0, Skipped: 0, Time elapsed: 0.006 sec - in org.apache.juneau.dto.jsonschema.JsonSchemaTest
Running org.apache.juneau.PropertyNamerDashedLcTest
Tests run: 1, Failures: 0, Errors: 0, Skipped: 0, Time elapsed: 0 sec - in org.apache.juneau.PropertyNamerDashedLcTest
Running org.apache.juneau.json.CommonTest
Tests run: 11, Failures: 0, Errors: 0, Skipped: 0, Time elapsed: 0.055 sec - in org.apache.juneau.json.CommonTest
Running org.apache.juneau.json.CommonParserTest
Tests run: 4, Failures: 0, Errors: 0, Skipped: 0, Time elapsed: 0.011 sec - in org.apache.juneau.json.CommonParserTest
Running org.apache.juneau.json.JsonParserTest
Tests run: 8, Failures: 0, Errors: 0, Skipped: 0, Time elapsed: 0.397 sec - in org.apache.juneau.json.JsonParserTest
Running org.apache.juneau.json.JsonTest
Tests run: 10, Failures: 0, Errors: 0, Skipped: 0, Time elapsed: 0.007 sec - in org.apache.juneau.json.JsonTest
Running org.apache.juneau.json.JsonSchemaTest
Tests run: 1, Failures: 0, Errors: 0, Skipped: 0, Time elapsed: 0.001 sec - in org.apache.juneau.json.JsonSchemaTest

Results :

Failed tests: 
  AtomTest.testBasic:78 expected:<...>
		Copyright (c) 20[03, Foobar Inc]
	</rights>
	<subtit...> but was:<...>
		Copyright (c) 20[16, Apache Foundation]
	</rights>
	<subtit...>

Tests run: 3156, Failures: 1, Errors: 0, Skipped: 2

[INFO] ------------------------------------------------------------------------
[INFO] Reactor Summary:
[INFO] 
[INFO] Apache Juneau (incubating) ......................... SUCCESS [  6.273 s]
[INFO] Apache Juneau Core ................................. FAILURE [ 28.753 s]
[INFO] Apache Juneau Client ............................... SKIPPED
[INFO] Apache Juneau Server ............................... SKIPPED
[INFO] Apache Juneau Microservice ......................... SKIPPED
[INFO] Apache Juneau Samples .............................. SKIPPED
[INFO] Apache Juneau Server Test .......................... SKIPPED
[INFO] Apache Juneau UberJar .............................. SKIPPED
[INFO] Apache Juneau Distribution ......................... SKIPPED
[INFO] ------------------------------------------------------------------------
[INFO] BUILD FAILURE
[INFO] ------------------------------------------------------------------------
[INFO] Total time: 39.343 s
[INFO] Finished at: 2016-10-27T23:35:43+00:00
[INFO] Final Memory: 33M/409M
[INFO] ------------------------------------------------------------------------
[ERROR] Failed to execute goal org.apache.maven.plugins:maven-surefire-plugin:2.19.1:test
(default-test) on project juneau-core: There are test failures.
[ERROR] 
[ERROR] Please refer to <https://builds.apache.org/job/Juneau-Java-1.7/ws/juneau-core/target/surefire-reports>
for the individual test results.
[ERROR] -> [Help 1]
[ERROR] 
[ERROR] To see the full stack trace of the errors, re-run Maven with the -e switch.
[ERROR] Re-run Maven using the -X switch to enable full debug logging.
[ERROR] 
[ERROR] For more information about the errors and possible solutions, please read the following
articles:
[ERROR] [Help 1] http://cwiki.apache.org/confluence/display/MAVEN/MojoFailureException
[ERROR] 
[ERROR] After correcting the problems, you can resume the build with the command
[ERROR]   mvn <goals> -rf :juneau-core
Build step 'Invoke top-level Maven targets' marked build as failure

Mime
View raw message