juneau-dev mailing list archives

Site index · List index
Message view « Date » · « Thread »
Top « Date » · « Thread »
From Apache Jenkins Server <jenk...@builds.apache.org>
Subject Build failed in Jenkins: Juneau-Java-1.7 #9
Date Tue, 09 Aug 2016 14:48:09 GMT
See <https://builds.apache.org/job/Juneau-Java-1.7/9/changes>

Changes:

[james] Fix classpath file issues.

------------------------------------------
[...truncated 131 lines...]
Tests run: 5, Failures: 0, Errors: 0, Skipped: 0, Time elapsed: 0.001 sec - in org.apache.juneau.CT_ParserReader
Running org.apache.juneau.CT_PropertyNamerDashedLC
Tests run: 1, Failures: 0, Errors: 0, Skipped: 0, Time elapsed: 0 sec - in org.apache.juneau.CT_PropertyNamerDashedLC
Running org.apache.juneau.CT_BeanTransform
Tests run: 3, Failures: 0, Errors: 0, Skipped: 0, Time elapsed: 0.013 sec - in org.apache.juneau.CT_BeanTransform
Running org.apache.juneau.CT_BeanConfig
Tests run: 12, Failures: 1, Errors: 0, Skipped: 0, Time elapsed: 0.263 sec <<< FAILURE!
- in org.apache.juneau.CT_BeanConfig
testReadOnlyProperties(org.apache.juneau.CT_BeanConfig)  Time elapsed: 0.011 sec  <<<
FAILURE!
org.junit.ComparisonFailure: expected:<{[name:'x',age:123]}> but was:<{[age:123,name:'x']}>
	at org.apache.juneau.CT_BeanConfig.testReadOnlyProperties(CT_BeanConfig.java:401)

Running org.apache.juneau.CT_ContextFactory
Tests run: 9, Failures: 3, Errors: 0, Skipped: 0, Time elapsed: 0.146 sec <<< FAILURE!
- in org.apache.juneau.CT_ContextFactory
testConversionsOnMapProperties(org.apache.juneau.CT_ContextFactory)  Time elapsed: 0.023 sec
 <<< FAILURE!
org.junit.ComparisonFailure: expected:<Cannot put value [{[name:'foo',uri:'bar]'}] (java.util.Array...>
but was:<Cannot put value [{[uri:'bar',name:'foo]'}] (java.util.Array...>
	at org.apache.juneau.CT_ContextFactory.testConversionsOnMapProperties(CT_ContextFactory.java:776)

testConversionsOnSetProperties(org.apache.juneau.CT_ContextFactory)  Time elapsed: 0.049 sec
 <<< FAILURE!
org.junit.ComparisonFailure: expected:<'[{[name:\'foo\',uri:\'bar]\'}]'> but was:<'[{[uri:\'bar\',name:\'foo]\'}]'>
	at org.apache.juneau.CT_ContextFactory.testConversionsOnSetProperties(CT_ContextFactory.java:652)

testConversionsOnSimpleProperties(org.apache.juneau.CT_ContextFactory)  Time elapsed: 0.053
sec  <<< FAILURE!
org.junit.ComparisonFailure: expected:<'{[name:\'foo\',uri:\'bar]\'}'> but was:<'{[uri:\'bar\',name:\'foo]\'}'>
	at org.apache.juneau.CT_ContextFactory.testConversionsOnSimpleProperties(CT_ContextFactory.java:436)

Running org.apache.juneau.internal.CT_VersionRange
Tests run: 21, Failures: 0, Errors: 0, Skipped: 0, Time elapsed: 0.006 sec - in org.apache.juneau.internal.CT_VersionRange
Running org.apache.juneau.CT_ClassMeta
Tests run: 7, Failures: 0, Errors: 0, Skipped: 0, Time elapsed: 0.024 sec - in org.apache.juneau.CT_ClassMeta
Running org.apache.juneau.CT_PojoTransform
Tests run: 1, Failures: 0, Errors: 0, Skipped: 0, Time elapsed: 0.002 sec - in org.apache.juneau.CT_PojoTransform
Running org.apache.juneau.urlencoding.CT_Common_Uon
Tests run: 10, Failures: 0, Errors: 0, Skipped: 0, Time elapsed: 0.136 sec - in org.apache.juneau.urlencoding.CT_Common_Uon
Running org.apache.juneau.urlencoding.CT_UrlEncodingSerializer
Tests run: 5, Failures: 0, Errors: 0, Skipped: 0, Time elapsed: 0.044 sec - in org.apache.juneau.urlencoding.CT_UrlEncodingSerializer
Running org.apache.juneau.urlencoding.CT_CommonParser_Uon
Tests run: 4, Failures: 0, Errors: 0, Skipped: 0, Time elapsed: 0.011 sec - in org.apache.juneau.urlencoding.CT_CommonParser_Uon
Running org.apache.juneau.urlencoding.CT_UonSerializer
Tests run: 2, Failures: 0, Errors: 0, Skipped: 0, Time elapsed: 0.015 sec - in org.apache.juneau.urlencoding.CT_UonSerializer
Running org.apache.juneau.urlencoding.CT_Common_UrlEncoding
Tests run: 10, Failures: 0, Errors: 0, Skipped: 0, Time elapsed: 0.132 sec - in org.apache.juneau.urlencoding.CT_Common_UrlEncoding
Running org.apache.juneau.urlencoding.CT_UrlEncodingParser
Tests run: 12, Failures: 0, Errors: 0, Skipped: 0, Time elapsed: 0.048 sec - in org.apache.juneau.urlencoding.CT_UrlEncodingParser
Running org.apache.juneau.urlencoding.CT_UonParser
Tests run: 3, Failures: 0, Errors: 0, Skipped: 0, Time elapsed: 0.009 sec - in org.apache.juneau.urlencoding.CT_UonParser
Running org.apache.juneau.urlencoding.CT_UonParserReader
Tests run: 1, Failures: 0, Errors: 0, Skipped: 0, Time elapsed: 0 sec - in org.apache.juneau.urlencoding.CT_UonParserReader
Running org.apache.juneau.urlencoding.CT_CommonParser_UrlEncoding
Tests run: 5, Failures: 0, Errors: 0, Skipped: 0, Time elapsed: 0.012 sec - in org.apache.juneau.urlencoding.CT_CommonParser_UrlEncoding
Running org.apache.juneau.CT_JacocoDummy
Tests run: 1, Failures: 0, Errors: 0, Skipped: 0, Time elapsed: 0.001 sec - in org.apache.juneau.CT_JacocoDummy
Running org.apache.juneau.CT_Visibility
Tests run: 1, Failures: 0, Errors: 0, Skipped: 0, Time elapsed: 0.118 sec - in org.apache.juneau.CT_Visibility
Running org.apache.juneau.CT_BeanMap
Tests run: 36, Failures: 0, Errors: 0, Skipped: 0, Time elapsed: 0.116 sec - in org.apache.juneau.CT_BeanMap
Running org.apache.juneau.xml.CT_Xml
Tests run: 31, Failures: 0, Errors: 0, Skipped: 0, Time elapsed: 0.565 sec - in org.apache.juneau.xml.CT_Xml
Running org.apache.juneau.xml.CT_Common
Tests run: 10, Failures: 0, Errors: 0, Skipped: 0, Time elapsed: 0.15 sec - in org.apache.juneau.xml.CT_Common
Running org.apache.juneau.xml.CT_CommonParser
Tests run: 4, Failures: 0, Errors: 0, Skipped: 0, Time elapsed: 0.026 sec - in org.apache.juneau.xml.CT_CommonParser
Running org.apache.juneau.xml.CT_XmlParser
Tests run: 3, Failures: 0, Errors: 0, Skipped: 0, Time elapsed: 0.016 sec - in org.apache.juneau.xml.CT_XmlParser
Running org.apache.juneau.xml.CT_XmlContent
Tests run: 3, Failures: 0, Errors: 0, Skipped: 0, Time elapsed: 0.033 sec - in org.apache.juneau.xml.CT_XmlContent
Running org.apache.juneau.xml.CT_CommonXml
Tests run: 2, Failures: 0, Errors: 0, Skipped: 0, Time elapsed: 0.01 sec - in org.apache.juneau.xml.CT_CommonXml
Running org.apache.juneau.xml.CT_XmlCollapsed
Tests run: 9, Failures: 0, Errors: 0, Skipped: 0, Time elapsed: 0.094 sec - in org.apache.juneau.xml.CT_XmlCollapsed
Running org.apache.juneau.msgpack.CT_MsgPackSerialzier
82 A4 6E 61 6D 65 AA 4A 6F 68 6E 20 53 6D 69 74 68 A3 61 67 65 15
Tests run: 1, Failures: 0, Errors: 0, Skipped: 0, Time elapsed: 0.02 sec - in org.apache.juneau.msgpack.CT_MsgPackSerialzier
Running org.apache.juneau.json.CT_Json
Tests run: 10, Failures: 0, Errors: 0, Skipped: 0, Time elapsed: 0.021 sec - in org.apache.juneau.json.CT_Json
Running org.apache.juneau.json.CT_JsonParser
Tests run: 8, Failures: 0, Errors: 0, Skipped: 0, Time elapsed: 0.234 sec - in org.apache.juneau.json.CT_JsonParser
Running org.apache.juneau.json.CT_JsonSchema
Tests run: 1, Failures: 0, Errors: 0, Skipped: 0, Time elapsed: 0.001 sec - in org.apache.juneau.json.CT_JsonSchema
Running org.apache.juneau.json.CT_Common
Tests run: 11, Failures: 0, Errors: 0, Skipped: 0, Time elapsed: 0.065 sec - in org.apache.juneau.json.CT_Common
Running org.apache.juneau.json.CT_CommonParser
Tests run: 4, Failures: 0, Errors: 0, Skipped: 0, Time elapsed: 0.006 sec - in org.apache.juneau.json.CT_CommonParser
Running org.apache.juneau.jena.CT_RdfParser
Tests run: 1, Failures: 0, Errors: 0, Skipped: 0, Time elapsed: 0.026 sec - in org.apache.juneau.jena.CT_RdfParser
Running org.apache.juneau.jena.CT_Common
Tests run: 10, Failures: 0, Errors: 0, Skipped: 0, Time elapsed: 0.211 sec - in org.apache.juneau.jena.CT_Common
Running org.apache.juneau.jena.CT_Rdf
Tests run: 4, Failures: 0, Errors: 0, Skipped: 0, Time elapsed: 0.166 sec - in org.apache.juneau.jena.CT_Rdf
Running org.apache.juneau.jena.CT_CommonParser
2016-08-09 14:48:03,645 ERROR [el.impl.RDFDefaultErrorHandler] -- unknown-source: {E213} null
-- [main]
2016-08-09 14:48:03,661 ERROR [el.impl.RDFDefaultErrorHandler] -- (line 1 column 154): {E202}
Expecting XML start or end element(s). String data "   //foo   " not allowed. Maybe a striping
error. -- [main]
Tests run: 4, Failures: 0, Errors: 0, Skipped: 0, Time elapsed: 0.048 sec - in org.apache.juneau.jena.CT_CommonParser
Running org.apache.juneau.jena.CT_CommonXml
Tests run: 2, Failures: 0, Errors: 0, Skipped: 0, Time elapsed: 0.007 sec - in org.apache.juneau.jena.CT_CommonXml
Running org.apache.juneau.CT_ParserGenerics
Tests run: 2, Failures: 0, Errors: 0, Skipped: 0, Time elapsed: 0.004 sec - in org.apache.juneau.CT_ParserGenerics
Running org.apache.juneau.a.rttests.CT_RoundTripBeanInheritance
Tests run: 42, Failures: 0, Errors: 0, Skipped: 0, Time elapsed: 0.139 sec - in org.apache.juneau.a.rttests.CT_RoundTripBeanInheritance
Running org.apache.juneau.a.rttests.CT_RoundTripMaps
Tests run: 126, Failures: 0, Errors: 0, Skipped: 0, Time elapsed: 0.399 sec - in org.apache.juneau.a.rttests.CT_RoundTripMaps
Running org.apache.juneau.a.rttests.CT_RoundTripPrimitivesBeans
Tests run: 42, Failures: 0, Errors: 0, Skipped: 0, Time elapsed: 1.46 sec - in org.apache.juneau.a.rttests.CT_RoundTripPrimitivesBeans
Running org.apache.juneau.a.rttests.CT_RoundTripDTOs
Tests run: 42, Failures: 0, Errors: 0, Skipped: 0, Time elapsed: 0.835 sec - in org.apache.juneau.a.rttests.CT_RoundTripDTOs
Running org.apache.juneau.a.rttests.CT_RoundTripTrimStrings
Tests run: 21, Failures: 0, Errors: 0, Skipped: 0, Time elapsed: 0.131 sec - in org.apache.juneau.a.rttests.CT_RoundTripTrimStrings
Running org.apache.juneau.a.rttests.CT_RoundTripObjectsAsStrings
Tests run: 63, Failures: 0, Errors: 0, Skipped: 0, Time elapsed: 0.106 sec - in org.apache.juneau.a.rttests.CT_RoundTripObjectsAsStrings
Running org.apache.juneau.a.rttests.CT_RoundTripObjectsWithSpecialMethods
Tests run: 42, Failures: 0, Errors: 0, Skipped: 0, Time elapsed: 0.12 sec - in org.apache.juneau.a.rttests.CT_RoundTripObjectsWithSpecialMethods
Running org.apache.juneau.a.rttests.CT_RoundTripReadOnlyBeans
Tests run: 21, Failures: 0, Errors: 0, Skipped: 0, Time elapsed: 0.037 sec - in org.apache.juneau.a.rttests.CT_RoundTripReadOnlyBeans
Running org.apache.juneau.a.rttests.CT_RoundTripLargeObjects
Tests run: 1, Failures: 0, Errors: 0, Skipped: 1, Time elapsed: 0.001 sec - in org.apache.juneau.a.rttests.CT_RoundTripLargeObjects
Running org.apache.juneau.a.rttests.CT_RoundTripToObjectMaps
Tests run: 21, Failures: 0, Errors: 0, Skipped: 0, Time elapsed: 0.091 sec - in org.apache.juneau.a.rttests.CT_RoundTripToObjectMaps
Running org.apache.juneau.a.rttests.CT_RoundTripEnum
Tests run: 168, Failures: 0, Errors: 0, Skipped: 0, Time elapsed: 0.311 sec - in org.apache.juneau.a.rttests.CT_RoundTripEnum
Running org.apache.juneau.a.rttests.CT_RoundTripClasses
Tests run: 21, Failures: 0, Errors: 0, Skipped: 0, Time elapsed: 0.051 sec - in org.apache.juneau.a.rttests.CT_RoundTripClasses
Running org.apache.juneau.a.rttests.CT_RoundTripSimpleObjects
Tests run: 1134, Failures: 0, Errors: 0, Skipped: 0, Time elapsed: 1.45 sec - in org.apache.juneau.a.rttests.CT_RoundTripSimpleObjects
Running org.apache.juneau.a.rttests.CT_RoundTripBeanMaps
Tests run: 483, Failures: 0, Errors: 0, Skipped: 0, Time elapsed: 1.016 sec - in org.apache.juneau.a.rttests.CT_RoundTripBeanMaps
Running org.apache.juneau.a.rttests.CT_RoundTripAddClassAttrs
Tests run: 70, Failures: 0, Errors: 0, Skipped: 0, Time elapsed: 0.265 sec - in org.apache.juneau.a.rttests.CT_RoundTripAddClassAttrs
Running org.apache.juneau.a.rttests.CT_RoundTripNumericConstructors
Tests run: 21, Failures: 0, Errors: 0, Skipped: 0, Time elapsed: 0.017 sec - in org.apache.juneau.a.rttests.CT_RoundTripNumericConstructors
Running org.apache.juneau.a.rttests.CT_RoundTripGenerics
Tests run: 21, Failures: 0, Errors: 0, Skipped: 0, Time elapsed: 0.043 sec - in org.apache.juneau.a.rttests.CT_RoundTripGenerics
Running org.apache.juneau.a.rttests.CT_RoundTripTransformBeans
Tests run: 126, Failures: 0, Errors: 0, Skipped: 0, Time elapsed: 0.358 sec - in org.apache.juneau.a.rttests.CT_RoundTripTransformBeans
Running org.apache.juneau.a.rttests.CT_RoundTripPrimitiveObjectBeans
Tests run: 42, Failures: 0, Errors: 0, Skipped: 0, Time elapsed: 0.773 sec - in org.apache.juneau.a.rttests.CT_RoundTripPrimitiveObjectBeans
Running org.apache.juneau.ini.CT_ConfigMgr
---Usage---
java -cp juneau.jar org.apache.juneau.ini.ConfigFile createBatchEnvFile -configFile <configFile>
-envFile <envFile> [-verbose]
java -cp juneau.jar org.apache.juneau.ini.ConfigFile createShellEnvFile -configFile <configFile>
-envFile <envFile> [-verbose]
java -cp juneau.jar org.apache.juneau.ini.ConfigFile setVals -configFile <configFile>
-vals [var1 val1 [var2 val2...]] [-verbose]
Tests run: 4, Failures: 0, Errors: 0, Skipped: 0, Time elapsed: 0.047 sec - in org.apache.juneau.ini.CT_ConfigMgr
Running org.apache.juneau.ini.CT_ConfigFile
Tests run: 45, Failures: 0, Errors: 0, Skipped: 0, Time elapsed: 0.098 sec - in org.apache.juneau.ini.CT_ConfigFile
Running org.apache.juneau.CT_ObjectMap
Tests run: 5, Failures: 0, Errors: 0, Skipped: 0, Time elapsed: 0.007 sec - in org.apache.juneau.CT_ObjectMap
Running org.apache.juneau.dto.atom.CT_Atom
Tests run: 1, Failures: 0, Errors: 0, Skipped: 0, Time elapsed: 0.075 sec - in org.apache.juneau.dto.atom.CT_Atom
Running org.apache.juneau.dto.cognos.CT_CognosXml
Tests run: 1, Failures: 0, Errors: 0, Skipped: 0, Time elapsed: 0.008 sec - in org.apache.juneau.dto.cognos.CT_CognosXml
Running org.apache.juneau.dto.jsonschema.CT_JsonSchema
Tests run: 2, Failures: 0, Errors: 0, Skipped: 0, Time elapsed: 0.004 sec - in org.apache.juneau.dto.jsonschema.CT_JsonSchema
Running org.apache.juneau.CT_ObjectList
Tests run: 3, Failures: 0, Errors: 0, Skipped: 0, Time elapsed: 0.001 sec - in org.apache.juneau.CT_ObjectList
Running org.apache.juneau.utils.CT_ParserReader
Tests run: 1, Failures: 0, Errors: 0, Skipped: 0, Time elapsed: 0 sec - in org.apache.juneau.utils.CT_ParserReader
Running org.apache.juneau.utils.CT_IOPipe
Tests run: 5, Failures: 0, Errors: 0, Skipped: 0, Time elapsed: 0.007 sec - in org.apache.juneau.utils.CT_IOPipe
Running org.apache.juneau.utils.CT_PojoQuery
Tests run: 9, Failures: 0, Errors: 0, Skipped: 0, Time elapsed: 0.059 sec - in org.apache.juneau.utils.CT_PojoQuery
Running org.apache.juneau.utils.CT_ByteArrayCache
Tests run: 1, Failures: 0, Errors: 0, Skipped: 0, Time elapsed: 0.001 sec - in org.apache.juneau.utils.CT_ByteArrayCache
Running org.apache.juneau.utils.CT_FilteredMap
Tests run: 1, Failures: 0, Errors: 0, Skipped: 0, Time elapsed: 0 sec - in org.apache.juneau.utils.CT_FilteredMap
Running org.apache.juneau.utils.CT_MultiSet
Tests run: 1, Failures: 0, Errors: 0, Skipped: 0, Time elapsed: 0.001 sec - in org.apache.juneau.utils.CT_MultiSet
Running org.apache.juneau.utils.CT_StringBuilderWriter
Tests run: 1, Failures: 0, Errors: 0, Skipped: 0, Time elapsed: 0 sec - in org.apache.juneau.utils.CT_StringBuilderWriter
Running org.apache.juneau.utils.CT_IdentityList
Tests run: 1, Failures: 0, Errors: 0, Skipped: 0, Time elapsed: 0.001 sec - in org.apache.juneau.utils.CT_IdentityList
Running org.apache.juneau.utils.CT_ArrayUtils
Tests run: 7, Failures: 0, Errors: 0, Skipped: 0, Time elapsed: 0.004 sec - in org.apache.juneau.utils.CT_ArrayUtils
Running org.apache.juneau.utils.CT_MultiIterable
Tests run: 1, Failures: 0, Errors: 0, Skipped: 0, Time elapsed: 0 sec - in org.apache.juneau.utils.CT_MultiIterable
Running org.apache.juneau.utils.CT_ClassUtils
Tests run: 3, Failures: 0, Errors: 0, Skipped: 0, Time elapsed: 0.001 sec - in org.apache.juneau.utils.CT_ClassUtils
Running org.apache.juneau.utils.CT_KeywordStore
Tests run: 1, Failures: 0, Errors: 0, Skipped: 0, Time elapsed: 0 sec - in org.apache.juneau.utils.CT_KeywordStore
Running org.apache.juneau.utils.CT_StringVarResolver
Tests run: 7, Failures: 0, Errors: 0, Skipped: 0, Time elapsed: 0.007 sec - in org.apache.juneau.utils.CT_StringVarResolver
Running org.apache.juneau.utils.CT_IOUtils
Tests run: 1, Failures: 0, Errors: 0, Skipped: 0, Time elapsed: 0 sec - in org.apache.juneau.utils.CT_IOUtils
Running org.apache.juneau.utils.CT_SimpleMap
Tests run: 1, Failures: 0, Errors: 0, Skipped: 0, Time elapsed: 0.001 sec - in org.apache.juneau.utils.CT_SimpleMap
Running org.apache.juneau.utils.CT_CharSet
Tests run: 1, Failures: 0, Errors: 0, Skipped: 0, Time elapsed: 0 sec - in org.apache.juneau.utils.CT_CharSet
Running org.apache.juneau.utils.CT_CollectionUtils
Tests run: 1, Failures: 0, Errors: 0, Skipped: 0, Time elapsed: 0 sec - in org.apache.juneau.utils.CT_CollectionUtils
Running org.apache.juneau.utils.CT_PojoRest
Tests run: 10, Failures: 0, Errors: 0, Skipped: 0, Time elapsed: 0.028 sec - in org.apache.juneau.utils.CT_PojoRest
Running org.apache.juneau.utils.CT_ByteArrayInOutStream
Tests run: 1, Failures: 0, Errors: 0, Skipped: 0, Time elapsed: 0 sec - in org.apache.juneau.utils.CT_ByteArrayInOutStream
Running org.apache.juneau.utils.CT_PojoIntrospector
Tests run: 1, Failures: 0, Errors: 0, Skipped: 0, Time elapsed: 0 sec - in org.apache.juneau.utils.CT_PojoIntrospector
Running org.apache.juneau.utils.CT_Args
Tests run: 1, Failures: 0, Errors: 0, Skipped: 0, Time elapsed: 0 sec - in org.apache.juneau.utils.CT_Args
Running org.apache.juneau.utils.CT_StringUtils
Tests run: 19, Failures: 0, Errors: 0, Skipped: 0, Time elapsed: 0.015 sec - in org.apache.juneau.utils.CT_StringUtils
Running org.apache.juneau.CT_DataConversionTest
Tests run: 2, Failures: 0, Errors: 0, Skipped: 0, Time elapsed: 0.002 sec - in org.apache.juneau.CT_DataConversionTest
Running org.apache.juneau.html.CT_Common
Tests run: 11, Failures: 0, Errors: 0, Skipped: 0, Time elapsed: 0.217 sec - in org.apache.juneau.html.CT_Common
Running org.apache.juneau.html.CT_Html
Tests run: 5, Failures: 0, Errors: 0, Skipped: 0, Time elapsed: 0.023 sec - in org.apache.juneau.html.CT_Html
Running org.apache.juneau.html.CT_CommonParser
Tests run: 4, Failures: 0, Errors: 0, Skipped: 0, Time elapsed: 0.01 sec - in org.apache.juneau.html.CT_CommonParser
Running org.apache.juneau.CT_Annotations
Tests run: 2, Failures: 0, Errors: 0, Skipped: 0, Time elapsed: 0.001 sec - in org.apache.juneau.CT_Annotations

Results :

Failed tests: 
  CT_BeanConfig.testReadOnlyProperties:401 expected:<{[name:'x',age:123]}> but was:<{[age:123,name:'x']}>
  CT_ContextFactory.testConversionsOnMapProperties:776 expected:<Cannot put value [{[name:'foo',uri:'bar]'}]
(java.util.Array...> but was:<Cannot put value [{[uri:'bar',name:'foo]'}] (java.util.Array...>
  CT_ContextFactory.testConversionsOnSetProperties:652 expected:<'[{[name:\'foo\',uri:\'bar]\'}]'>
but was:<'[{[uri:\'bar\',name:\'foo]\'}]'>
  CT_ContextFactory.testConversionsOnSimpleProperties:436 expected:<'{[name:\'foo\',uri:\'bar]\'}'>
but was:<'{[uri:\'bar\',name:\'foo]\'}'>

Tests run: 3041, Failures: 4, Errors: 0, Skipped: 2

[INFO] ------------------------------------------------------------------------
[INFO] Reactor Summary:
[INFO] 
[INFO] Apache Juneau (incubating) ........................ SUCCESS [6.819s]
[INFO] Apache Juneau Core ................................ FAILURE [24.918s]
[INFO] Apache Juneau Client .............................. SKIPPED
[INFO] Apache Juneau Server .............................. SKIPPED
[INFO] Apache Juneau Microservice ........................ SKIPPED
[INFO] Apache Juneau Samples ............................. SKIPPED
[INFO] Apache Juneau Server Test ......................... SKIPPED
[INFO] Apache Juneau Distribution ........................ SKIPPED
[INFO] ------------------------------------------------------------------------
[INFO] BUILD FAILURE
[INFO] ------------------------------------------------------------------------
[INFO] Total time: 32.083s
[INFO] Finished at: Tue Aug 09 14:48:12 UTC 2016
[INFO] Final Memory: 22M/701M
[INFO] ------------------------------------------------------------------------
[ERROR] Failed to execute goal org.apache.maven.plugins:maven-surefire-plugin:2.19.1:test
(default-test) on project juneau-core: There are test failures.
[ERROR] 
[ERROR] Please refer to <https://builds.apache.org/job/Juneau-Java-1.7/ws/org.apache.juneau/target/surefire-reports>
for the individual test results.
[ERROR] -> [Help 1]
[ERROR] 
[ERROR] To see the full stack trace of the errors, re-run Maven with the -e switch.
[ERROR] Re-run Maven using the -X switch to enable full debug logging.
[ERROR] 
[ERROR] For more information about the errors and possible solutions, please read the following
articles:
[ERROR] [Help 1] http://cwiki.apache.org/confluence/display/MAVEN/MojoFailureException
[ERROR] 
[ERROR] After correcting the problems, you can resume the build with the command
[ERROR]   mvn <goals> -rf :juneau-core
Build step 'Invoke top-level Maven targets' marked build as failure

Mime
View raw message