juneau-dev mailing list archives

Site index · List index
Message view « Date » · « Thread »
Top « Date » · « Thread »
From Apache Jenkins Server <jenk...@builds.apache.org>
Subject Build failed in Jenkins: Juneau-Java-1.7 #16
Date Tue, 09 Aug 2016 20:27:37 GMT
See <https://builds.apache.org/job/Juneau-Java-1.7/16/changes>

Changes:

[jamesbognar] Fix compilation warnings in testcases.

------------------------------------------
Started by an SCM change
[EnvInject] - Loading node environment variables.
Building remotely on ubuntu-1 (docker Ubuntu ubuntu yahoo-not-h2 ubuntu1) in workspace <https://builds.apache.org/job/Juneau-Java-1.7/ws/>
 > git rev-parse --is-inside-work-tree # timeout=10
Fetching changes from the remote Git repository
 > git config remote.origin.url https://git-wip-us.apache.org/repos/asf/incubator-juneau.git
# timeout=10
Fetching upstream changes from https://git-wip-us.apache.org/repos/asf/incubator-juneau.git
 > git --version # timeout=10
 > git -c core.askpass=true fetch --tags --progress https://git-wip-us.apache.org/repos/asf/incubator-juneau.git
+refs/heads/*:refs/remotes/origin/*
 > git rev-parse refs/remotes/origin/master^{commit} # timeout=10
 > git rev-parse refs/remotes/origin/origin/master^{commit} # timeout=10
Checking out Revision f9a34d3d5599f3239ec49f983ea9b90a1f7f113c (refs/remotes/origin/master)
 > git config core.sparsecheckout # timeout=10
 > git checkout -f f9a34d3d5599f3239ec49f983ea9b90a1f7f113c
 > git rev-list e6bf97a8b8fc7815c9cbeda25b1b91cdbf6e2185 # timeout=10
[Juneau-Java-1.7] $ /home/jenkins/jenkins-slave/tools/hudson.tasks.Maven_MavenInstallation/Maven_3.0.5/bin/mvn
clean install deploy
[INFO] Scanning for projects...
[ERROR] The build could not read 1 project -> [Help 1]
[ERROR]   
[ERROR]   The project org.apache.juneau:juneau:6.0.0-incubating-SNAPSHOT (<https://builds.apache.org/job/Juneau-Java-1.7/ws/pom.xml)>
has 7 errors
[ERROR]     Child module <https://builds.apache.org/job/Juneau-Java-1.7/ws/org.apache.juneau/pom.xml>
of <https://builds.apache.org/job/Juneau-Java-1.7/ws/pom.xml> does not exist
[ERROR]     Child module <https://builds.apache.org/job/Juneau-Java-1.7/ws/org.apache.juneau.client/pom.xml>
of <https://builds.apache.org/job/Juneau-Java-1.7/ws/pom.xml> does not exist
[ERROR]     Child module <https://builds.apache.org/job/Juneau-Java-1.7/ws/org.apache.juneau.server/pom.xml>
of <https://builds.apache.org/job/Juneau-Java-1.7/ws/pom.xml> does not exist
[ERROR]     Child module <https://builds.apache.org/job/Juneau-Java-1.7/ws/org.apache.juneau.microservice/pom.xml>
of <https://builds.apache.org/job/Juneau-Java-1.7/ws/pom.xml> does not exist
[ERROR]     Child module <https://builds.apache.org/job/Juneau-Java-1.7/ws/org.apache.juneau.samples/pom.xml>
of <https://builds.apache.org/job/Juneau-Java-1.7/ws/pom.xml> does not exist
[ERROR]     Child module <https://builds.apache.org/job/Juneau-Java-1.7/ws/org.apache.juneau.server.test/pom.xml>
of <https://builds.apache.org/job/Juneau-Java-1.7/ws/pom.xml> does not exist
[ERROR]     Child module <https://builds.apache.org/job/Juneau-Java-1.7/ws/org.apache.juneau.distrib/pom.xml>
of <https://builds.apache.org/job/Juneau-Java-1.7/ws/pom.xml> does not exist
[ERROR] 
[ERROR] To see the full stack trace of the errors, re-run Maven with the -e switch.
[ERROR] Re-run Maven using the -X switch to enable full debug logging.
[ERROR] 
[ERROR] For more information about the errors and possible solutions, please read the following
articles:
[ERROR] [Help 1] http://cwiki.apache.org/confluence/display/MAVEN/ProjectBuildingException
Build step 'Invoke top-level Maven targets' marked build as failure

Mime
View raw message