juneau-dev mailing list archives

Site index · List index
Message view « Date » · « Thread »
Top « Date » · « Thread »
From Apache Jenkins Server <jenk...@builds.apache.org>
Subject Build failed in Jenkins: Juneau-Java-1.7 #26
Date Thu, 25 Aug 2016 16:33:36 GMT
See <https://builds.apache.org/job/Juneau-Java-1.7/26/changes>

Changes:

[jamesbognar] Eliminate references to language-specific metadata in the core metadata

[jamesbognar] Eliminate references to language-specific metadata in the core metadata

------------------------------------------
[...truncated 592 lines...]
  location: variable gType of type org.apache.juneau.ClassMeta<?>
[ERROR] <https://builds.apache.org/job/Juneau-Java-1.7/ws/juneau-core/src/main/java/org/apache/juneau/xml/XmlSerializer.java>:[380,44]
cannot find symbol
  symbol:   method getExtendedMeta(java.lang.Class<org.apache.juneau.xml.XmlClassMeta>)
  location: variable aType of type org.apache.juneau.ClassMeta<?>
[ERROR] <https://builds.apache.org/job/Juneau-Java-1.7/ws/juneau-core/src/main/java/org/apache/juneau/xml/XmlSerializer.java>:[391,57]
cannot find symbol
  symbol:   method getExtendedMeta(java.lang.Class<org.apache.juneau.xml.XmlClassMeta>)
  location: variable gType of type org.apache.juneau.ClassMeta<?>
[ERROR] <https://builds.apache.org/job/Juneau-Java-1.7/ws/juneau-core/src/main/java/org/apache/juneau/xml/XmlSerializer.java>:[393,57]
cannot find symbol
  symbol:   method getExtendedMeta(java.lang.Class<org.apache.juneau.xml.XmlClassMeta>)
  location: variable aType of type org.apache.juneau.ClassMeta<?>
[ERROR] <https://builds.apache.org/job/Juneau-Java-1.7/ws/juneau-core/src/main/java/org/apache/juneau/xml/XmlSerializer.java>:[615,37]
cannot find symbol
  symbol:   method getExtendedMeta(java.lang.Class<org.apache.juneau.xml.XmlClassMeta>)
  location: variable type of type org.apache.juneau.ClassMeta<?>
[ERROR] <https://builds.apache.org/job/Juneau-Java-1.7/ws/juneau-core/src/main/java/org/apache/juneau/xml/XmlSerializer.java>:[616,35]
cannot find symbol
  symbol:   method getExtendedMeta(java.lang.Class<org.apache.juneau.xml.XmlClassMeta>)
  location: variable type of type org.apache.juneau.ClassMeta<?>
[ERROR] <https://builds.apache.org/job/Juneau-Java-1.7/ws/juneau-core/src/main/java/org/apache/juneau/xml/XmlSerializer.java>:[620,44]
cannot find symbol
  symbol:   method getExtendedMeta(java.lang.Class<org.apache.juneau.xml.XmlClassMeta>)
  location: variable elementType of type org.apache.juneau.ClassMeta<?>
[ERROR] <https://builds.apache.org/job/Juneau-Java-1.7/ws/juneau-core/src/main/java/org/apache/juneau/xml/XmlSerializer.java>:[621,42]
cannot find symbol
  symbol:   method getExtendedMeta(java.lang.Class<org.apache.juneau.xml.XmlClassMeta>)
  location: variable elementType of type org.apache.juneau.ClassMeta<?>
[ERROR] <https://builds.apache.org/job/Juneau-Java-1.7/ws/juneau-core/src/main/java/org/apache/juneau/html/HtmlSerializer.java>:[235,51]
cannot find symbol
  symbol:   method getExtendedMeta(java.lang.Class<org.apache.juneau.html.HtmlClassMeta>)
  location: variable gType of type org.apache.juneau.ClassMeta<?>
[ERROR] <https://builds.apache.org/job/Juneau-Java-1.7/ws/juneau-core/src/main/java/org/apache/juneau/html/HtmlSerializer.java>:[292,29]
cannot find symbol
  symbol:   method getExtendedMeta(java.lang.Class<org.apache.juneau.html.HtmlClassMeta>)
  location: variable aType of type org.apache.juneau.ClassMeta<?>
[ERROR] <https://builds.apache.org/job/Juneau-Java-1.7/ws/juneau-core/src/main/java/org/apache/juneau/html/HtmlSerializer.java>:[340,40]
cannot find symbol
  symbol:   method getExtendedMeta(java.lang.Class<org.apache.juneau.html.HtmlClassMeta>)
  location: class org.apache.juneau.ClassMeta<capture#1 of ?>
[ERROR] <https://builds.apache.org/job/Juneau-Java-1.7/ws/juneau-core/src/main/java/org/apache/juneau/html/HtmlSerializer.java>:[499,37]
cannot find symbol
  symbol:   method getExtendedMeta(java.lang.Class<org.apache.juneau.html.HtmlClassMeta>)
  location: variable cm of type org.apache.juneau.ClassMeta<?>
[ERROR] <https://builds.apache.org/job/Juneau-Java-1.7/ws/juneau-core/src/main/java/org/apache/juneau/xml/XmlParser.java>:[152,67]
cannot find symbol
  symbol:   method getXmlMeta()
  location: class org.apache.juneau.BeanMeta
[ERROR] <https://builds.apache.org/job/Juneau-Java-1.7/ws/juneau-core/src/main/java/org/apache/juneau/xml/XmlParser.java>:[278,44]
cannot find symbol
  symbol:   method getXmlMeta()
  location: variable bMeta of type org.apache.juneau.BeanMeta
[ERROR] <https://builds.apache.org/job/Juneau-Java-1.7/ws/juneau-core/src/main/java/org/apache/juneau/xml/XmlParser.java>:[327,61]
cannot find symbol
  symbol:   method getXmlMeta()
  location: variable pMeta of type org.apache.juneau.BeanPropertyMeta
[ERROR] <https://builds.apache.org/job/Juneau-Java-1.7/ws/juneau-core/src/main/java/org/apache/juneau/urlencoding/UrlEncodingSerializerSession.java>:[64,63]
cannot find symbol
  symbol:   method getExtendedMeta(java.lang.Class<org.apache.juneau.urlencoding.UrlEncodingClassMeta>)
  location: class org.apache.juneau.ClassMeta<capture#2 of ?>
[ERROR] <https://builds.apache.org/job/Juneau-Java-1.7/ws/juneau-core/src/main/java/org/apache/juneau/json/JsonSerializer.java>:[201,43]
cannot find symbol
  symbol:   method getExtendedMeta(java.lang.Class<org.apache.juneau.json.JsonClassMeta>)
  location: variable gType of type org.apache.juneau.ClassMeta<?>
[ERROR] <https://builds.apache.org/job/Juneau-Java-1.7/ws/juneau-core/src/main/java/org/apache/juneau/jena/RdfSerializer.java>:[247,47]
cannot find symbol
  symbol:   method getRdfMeta()
  location: variable bpm of type org.apache.juneau.BeanPropertyMeta
[ERROR] <https://builds.apache.org/job/Juneau-Java-1.7/ws/juneau-core/src/main/java/org/apache/juneau/jena/RdfSerializer.java>:[248,40]
cannot find symbol
  symbol:   method getRdfMeta()
  location: variable bpm of type org.apache.juneau.BeanPropertyMeta
[ERROR] <https://builds.apache.org/job/Juneau-Java-1.7/ws/juneau-core/src/main/java/org/apache/juneau/jena/RdfSerializer.java>:[338,43]
cannot find symbol
  symbol:   method getRdfMeta()
  location: variable bpm of type org.apache.juneau.BeanPropertyMeta
[ERROR] <https://builds.apache.org/job/Juneau-Java-1.7/ws/juneau-core/src/main/java/org/apache/juneau/jena/RdfSerializer.java>:[340,41]
cannot find symbol
  symbol:   method getXmlMeta()
  location: variable bpm of type org.apache.juneau.BeanPropertyMeta
[ERROR] <https://builds.apache.org/job/Juneau-Java-1.7/ws/juneau-core/src/main/java/org/apache/juneau/jena/RdfSerializer.java>:[378,41]
cannot find symbol
  symbol:   method getRdfMeta()
  location: variable bpm of type org.apache.juneau.BeanPropertyMeta
[ERROR] <https://builds.apache.org/job/Juneau-Java-1.7/ws/juneau-core/src/main/java/org/apache/juneau/jena/RdfSerializer.java>:[380,49]
cannot find symbol
  symbol:   method getXmlMeta()
  location: variable bpm of type org.apache.juneau.BeanPropertyMeta
[ERROR] <https://builds.apache.org/job/Juneau-Java-1.7/ws/juneau-core/src/main/java/org/apache/juneau/xml/XmlSchemaSerializer.java>:[199,58]
cannot find symbol
  symbol:   method getExtendedMeta(java.lang.Class<org.apache.juneau.xml.XmlClassMeta>)
  location: variable cm of type org.apache.juneau.ClassMeta<?>
[ERROR] <https://builds.apache.org/job/Juneau-Java-1.7/ws/juneau-core/src/main/java/org/apache/juneau/xml/XmlSchemaSerializer.java>:[299,48]
cannot find symbol
  symbol:   method getExtendedMeta(java.lang.Class<org.apache.juneau.xml.XmlClassMeta>)
  location: variable ft of type org.apache.juneau.ClassMeta<?>
[ERROR] <https://builds.apache.org/job/Juneau-Java-1.7/ws/juneau-core/src/main/java/org/apache/juneau/xml/XmlSchemaSerializer.java>:[401,114]
cannot find symbol
  symbol:   method getExtendedMeta(java.lang.Class<org.apache.juneau.xml.XmlClassMeta>)
  location: variable ct2 of type org.apache.juneau.ClassMeta<?>
[ERROR] <https://builds.apache.org/job/Juneau-Java-1.7/ws/juneau-core/src/main/java/org/apache/juneau/xml/XmlSchemaSerializer.java>:[401,169]
cannot find symbol
  symbol:   method getExtendedMeta(java.lang.Class<org.apache.juneau.xml.XmlClassMeta>)
  location: variable cm of type org.apache.juneau.ClassMeta<?>
[ERROR] <https://builds.apache.org/job/Juneau-Java-1.7/ws/juneau-core/src/main/java/org/apache/juneau/xml/XmlSchemaSerializer.java>:[472,82]
cannot find symbol
  symbol:   method getExtendedMeta(java.lang.Class<org.apache.juneau.xml.XmlClassMeta>)
  location: variable elementType of type org.apache.juneau.ClassMeta<?>
[ERROR] <https://builds.apache.org/job/Juneau-Java-1.7/ws/juneau-core/src/main/java/org/apache/juneau/xml/XmlSchemaSerializer.java>:[472,137]
cannot find symbol
  symbol:   method getExtendedMeta(java.lang.Class<org.apache.juneau.xml.XmlClassMeta>)
  location: variable cm of type org.apache.juneau.ClassMeta<?>
[ERROR] <https://builds.apache.org/job/Juneau-Java-1.7/ws/juneau-core/src/main/java/org/apache/juneau/xml/XmlSchemaSerializer.java>:[524,41]
cannot find symbol
  symbol:   method getExtendedMeta(java.lang.Class<org.apache.juneau.xml.XmlClassMeta>)
  location: variable cm of type org.apache.juneau.ClassMeta<?>
[ERROR] <https://builds.apache.org/job/Juneau-Java-1.7/ws/juneau-core/src/main/java/org/apache/juneau/xml/XmlBeanPropertyMeta.java>:[48,69]
cannot find symbol
  symbol:   method getExtendedMeta(java.lang.Class<org.apache.juneau.xml.XmlClassMeta>)
  location: class org.apache.juneau.ClassMeta<capture#3 of ?>
[ERROR] <https://builds.apache.org/job/Juneau-Java-1.7/ws/juneau-core/src/main/java/org/apache/juneau/xml/XmlBeanPropertyMeta.java>:[130,57]
cannot find symbol
  symbol:   method getExtendedMeta(java.lang.Class<org.apache.juneau.xml.XmlClassMeta>)
  location: variable cmProperty of type org.apache.juneau.ClassMeta<?>
[ERROR] <https://builds.apache.org/job/Juneau-Java-1.7/ws/juneau-core/src/main/java/org/apache/juneau/xml/XmlBeanPropertyMeta.java>:[132,74]
cannot find symbol
  symbol:   method getExtendedMeta(java.lang.Class<org.apache.juneau.xml.XmlClassMeta>)
  location: class org.apache.juneau.ClassMeta<capture#4 of ?>
[ERROR] <https://builds.apache.org/job/Juneau-Java-1.7/ws/juneau-core/src/main/java/org/apache/juneau/xml/XmlBeanPropertyMeta.java>:[139,49]
cannot find symbol
  symbol:   method getExtendedMeta(java.lang.Class<org.apache.juneau.xml.XmlClassMeta>)
  location: variable cmProperty of type org.apache.juneau.ClassMeta<?>
[ERROR] <https://builds.apache.org/job/Juneau-Java-1.7/ws/juneau-core/src/main/java/org/apache/juneau/urlencoding/UrlEncodingParserSession.java>:[72,63]
cannot find symbol
  symbol:   method getExtendedMeta(java.lang.Class<org.apache.juneau.urlencoding.UrlEncodingClassMeta>)
  location: class org.apache.juneau.ClassMeta<capture#5 of ?>
[INFO] 38 errors 
[INFO] -------------------------------------------------------------
[INFO] ------------------------------------------------------------------------
[INFO] Reactor Summary:
[INFO] 
[INFO] Apache Juneau (incubating) ........................ SUCCESS [14.380s]
[INFO] Apache Juneau Core ................................ FAILURE [10.999s]
[INFO] Apache Juneau Client .............................. SKIPPED
[INFO] Apache Juneau Server .............................. SKIPPED
[INFO] Apache Juneau Microservice ........................ SKIPPED
[INFO] Apache Juneau Samples ............................. SKIPPED
[INFO] Apache Juneau Server Test ......................... SKIPPED
[INFO] Apache Juneau Distribution ........................ SKIPPED
[INFO] ------------------------------------------------------------------------
[INFO] BUILD FAILURE
[INFO] ------------------------------------------------------------------------
[INFO] Total time: 25.794s
[INFO] Finished at: Thu Aug 25 16:33:05 UTC 2016
[INFO] Final Memory: 21M/723M
[INFO] ------------------------------------------------------------------------
[ERROR] Failed to execute goal org.apache.maven.plugins:maven-compiler-plugin:3.3:compile
(default-compile) on project juneau-core: Compilation failure: Compilation failure:
[ERROR] <https://builds.apache.org/job/Juneau-Java-1.7/ws/juneau-core/src/main/java/org/apache/juneau/xml/XmlSerializer.java>:[212,45]
cannot find symbol
[ERROR] symbol:   method getExtendedMeta(java.lang.Class<org.apache.juneau.xml.XmlClassMeta>)
[ERROR] location: variable aType of type org.apache.juneau.ClassMeta<?>
[ERROR] <https://builds.apache.org/job/Juneau-Java-1.7/ws/juneau-core/src/main/java/org/apache/juneau/xml/XmlSerializer.java>:[231,57]
cannot find symbol
[ERROR] symbol:   method getExtendedMeta(java.lang.Class<org.apache.juneau.xml.XmlClassMeta>)
[ERROR] location: variable innerType of type org.apache.juneau.ClassMeta<?>
[ERROR] <https://builds.apache.org/job/Juneau-Java-1.7/ws/juneau-core/src/main/java/org/apache/juneau/xml/XmlSerializer.java>:[365,44]
cannot find symbol
[ERROR] symbol:   method getExtendedMeta(java.lang.Class<org.apache.juneau.xml.XmlClassMeta>)
[ERROR] location: variable gType of type org.apache.juneau.ClassMeta<?>
[ERROR] <https://builds.apache.org/job/Juneau-Java-1.7/ws/juneau-core/src/main/java/org/apache/juneau/xml/XmlSerializer.java>:[378,44]
cannot find symbol
[ERROR] symbol:   method getExtendedMeta(java.lang.Class<org.apache.juneau.xml.XmlClassMeta>)
[ERROR] location: variable gType of type org.apache.juneau.ClassMeta<?>
[ERROR] <https://builds.apache.org/job/Juneau-Java-1.7/ws/juneau-core/src/main/java/org/apache/juneau/xml/XmlSerializer.java>:[380,44]
cannot find symbol
[ERROR] symbol:   method getExtendedMeta(java.lang.Class<org.apache.juneau.xml.XmlClassMeta>)
[ERROR] location: variable aType of type org.apache.juneau.ClassMeta<?>
[ERROR] <https://builds.apache.org/job/Juneau-Java-1.7/ws/juneau-core/src/main/java/org/apache/juneau/xml/XmlSerializer.java>:[391,57]
cannot find symbol
[ERROR] symbol:   method getExtendedMeta(java.lang.Class<org.apache.juneau.xml.XmlClassMeta>)
[ERROR] location: variable gType of type org.apache.juneau.ClassMeta<?>
[ERROR] <https://builds.apache.org/job/Juneau-Java-1.7/ws/juneau-core/src/main/java/org/apache/juneau/xml/XmlSerializer.java>:[393,57]
cannot find symbol
[ERROR] symbol:   method getExtendedMeta(java.lang.Class<org.apache.juneau.xml.XmlClassMeta>)
[ERROR] location: variable aType of type org.apache.juneau.ClassMeta<?>
[ERROR] <https://builds.apache.org/job/Juneau-Java-1.7/ws/juneau-core/src/main/java/org/apache/juneau/xml/XmlSerializer.java>:[615,37]
cannot find symbol
[ERROR] symbol:   method getExtendedMeta(java.lang.Class<org.apache.juneau.xml.XmlClassMeta>)
[ERROR] location: variable type of type org.apache.juneau.ClassMeta<?>
[ERROR] <https://builds.apache.org/job/Juneau-Java-1.7/ws/juneau-core/src/main/java/org/apache/juneau/xml/XmlSerializer.java>:[616,35]
cannot find symbol
[ERROR] symbol:   method getExtendedMeta(java.lang.Class<org.apache.juneau.xml.XmlClassMeta>)
[ERROR] location: variable type of type org.apache.juneau.ClassMeta<?>
[ERROR] <https://builds.apache.org/job/Juneau-Java-1.7/ws/juneau-core/src/main/java/org/apache/juneau/xml/XmlSerializer.java>:[620,44]
cannot find symbol
[ERROR] symbol:   method getExtendedMeta(java.lang.Class<org.apache.juneau.xml.XmlClassMeta>)
[ERROR] location: variable elementType of type org.apache.juneau.ClassMeta<?>
[ERROR] <https://builds.apache.org/job/Juneau-Java-1.7/ws/juneau-core/src/main/java/org/apache/juneau/xml/XmlSerializer.java>:[621,42]
cannot find symbol
[ERROR] symbol:   method getExtendedMeta(java.lang.Class<org.apache.juneau.xml.XmlClassMeta>)
[ERROR] location: variable elementType of type org.apache.juneau.ClassMeta<?>
[ERROR] <https://builds.apache.org/job/Juneau-Java-1.7/ws/juneau-core/src/main/java/org/apache/juneau/html/HtmlSerializer.java>:[235,51]
cannot find symbol
[ERROR] symbol:   method getExtendedMeta(java.lang.Class<org.apache.juneau.html.HtmlClassMeta>)
[ERROR] location: variable gType of type org.apache.juneau.ClassMeta<?>
[ERROR] <https://builds.apache.org/job/Juneau-Java-1.7/ws/juneau-core/src/main/java/org/apache/juneau/html/HtmlSerializer.java>:[292,29]
cannot find symbol
[ERROR] symbol:   method getExtendedMeta(java.lang.Class<org.apache.juneau.html.HtmlClassMeta>)
[ERROR] location: variable aType of type org.apache.juneau.ClassMeta<?>
[ERROR] <https://builds.apache.org/job/Juneau-Java-1.7/ws/juneau-core/src/main/java/org/apache/juneau/html/HtmlSerializer.java>:[340,40]
cannot find symbol
[ERROR] symbol:   method getExtendedMeta(java.lang.Class<org.apache.juneau.html.HtmlClassMeta>)
[ERROR] location: class org.apache.juneau.ClassMeta<capture#1 of ?>
[ERROR] <https://builds.apache.org/job/Juneau-Java-1.7/ws/juneau-core/src/main/java/org/apache/juneau/html/HtmlSerializer.java>:[499,37]
cannot find symbol
[ERROR] symbol:   method getExtendedMeta(java.lang.Class<org.apache.juneau.html.HtmlClassMeta>)
[ERROR] location: variable cm of type org.apache.juneau.ClassMeta<?>
[ERROR] <https://builds.apache.org/job/Juneau-Java-1.7/ws/juneau-core/src/main/java/org/apache/juneau/xml/XmlParser.java>:[152,67]
cannot find symbol
[ERROR] symbol:   method getXmlMeta()
[ERROR] location: class org.apache.juneau.BeanMeta
[ERROR] <https://builds.apache.org/job/Juneau-Java-1.7/ws/juneau-core/src/main/java/org/apache/juneau/xml/XmlParser.java>:[278,44]
cannot find symbol
[ERROR] symbol:   method getXmlMeta()
[ERROR] location: variable bMeta of type org.apache.juneau.BeanMeta
[ERROR] <https://builds.apache.org/job/Juneau-Java-1.7/ws/juneau-core/src/main/java/org/apache/juneau/xml/XmlParser.java>:[327,61]
cannot find symbol
[ERROR] symbol:   method getXmlMeta()
[ERROR] location: variable pMeta of type org.apache.juneau.BeanPropertyMeta
[ERROR] <https://builds.apache.org/job/Juneau-Java-1.7/ws/juneau-core/src/main/java/org/apache/juneau/urlencoding/UrlEncodingSerializerSession.java>:[64,63]
cannot find symbol
[ERROR] symbol:   method getExtendedMeta(java.lang.Class<org.apache.juneau.urlencoding.UrlEncodingClassMeta>)
[ERROR] location: class org.apache.juneau.ClassMeta<capture#2 of ?>
[ERROR] <https://builds.apache.org/job/Juneau-Java-1.7/ws/juneau-core/src/main/java/org/apache/juneau/json/JsonSerializer.java>:[201,43]
cannot find symbol
[ERROR] symbol:   method getExtendedMeta(java.lang.Class<org.apache.juneau.json.JsonClassMeta>)
[ERROR] location: variable gType of type org.apache.juneau.ClassMeta<?>
[ERROR] <https://builds.apache.org/job/Juneau-Java-1.7/ws/juneau-core/src/main/java/org/apache/juneau/jena/RdfSerializer.java>:[247,47]
cannot find symbol
[ERROR] symbol:   method getRdfMeta()
[ERROR] location: variable bpm of type org.apache.juneau.BeanPropertyMeta
[ERROR] <https://builds.apache.org/job/Juneau-Java-1.7/ws/juneau-core/src/main/java/org/apache/juneau/jena/RdfSerializer.java>:[248,40]
cannot find symbol
[ERROR] symbol:   method getRdfMeta()
[ERROR] location: variable bpm of type org.apache.juneau.BeanPropertyMeta
[ERROR] <https://builds.apache.org/job/Juneau-Java-1.7/ws/juneau-core/src/main/java/org/apache/juneau/jena/RdfSerializer.java>:[338,43]
cannot find symbol
[ERROR] symbol:   method getRdfMeta()
[ERROR] location: variable bpm of type org.apache.juneau.BeanPropertyMeta
[ERROR] <https://builds.apache.org/job/Juneau-Java-1.7/ws/juneau-core/src/main/java/org/apache/juneau/jena/RdfSerializer.java>:[340,41]
cannot find symbol
[ERROR] symbol:   method getXmlMeta()
[ERROR] location: variable bpm of type org.apache.juneau.BeanPropertyMeta
[ERROR] <https://builds.apache.org/job/Juneau-Java-1.7/ws/juneau-core/src/main/java/org/apache/juneau/jena/RdfSerializer.java>:[378,41]
cannot find symbol
[ERROR] symbol:   method getRdfMeta()
[ERROR] location: variable bpm of type org.apache.juneau.BeanPropertyMeta
[ERROR] <https://builds.apache.org/job/Juneau-Java-1.7/ws/juneau-core/src/main/java/org/apache/juneau/jena/RdfSerializer.java>:[380,49]
cannot find symbol
[ERROR] symbol:   method getXmlMeta()
[ERROR] location: variable bpm of type org.apache.juneau.BeanPropertyMeta
[ERROR] <https://builds.apache.org/job/Juneau-Java-1.7/ws/juneau-core/src/main/java/org/apache/juneau/xml/XmlSchemaSerializer.java>:[199,58]
cannot find symbol
[ERROR] symbol:   method getExtendedMeta(java.lang.Class<org.apache.juneau.xml.XmlClassMeta>)
[ERROR] location: variable cm of type org.apache.juneau.ClassMeta<?>
[ERROR] <https://builds.apache.org/job/Juneau-Java-1.7/ws/juneau-core/src/main/java/org/apache/juneau/xml/XmlSchemaSerializer.java>:[299,48]
cannot find symbol
[ERROR] symbol:   method getExtendedMeta(java.lang.Class<org.apache.juneau.xml.XmlClassMeta>)
[ERROR] location: variable ft of type org.apache.juneau.ClassMeta<?>
[ERROR] <https://builds.apache.org/job/Juneau-Java-1.7/ws/juneau-core/src/main/java/org/apache/juneau/xml/XmlSchemaSerializer.java>:[401,114]
cannot find symbol
[ERROR] symbol:   method getExtendedMeta(java.lang.Class<org.apache.juneau.xml.XmlClassMeta>)
[ERROR] location: variable ct2 of type org.apache.juneau.ClassMeta<?>
[ERROR] <https://builds.apache.org/job/Juneau-Java-1.7/ws/juneau-core/src/main/java/org/apache/juneau/xml/XmlSchemaSerializer.java>:[401,169]
cannot find symbol
[ERROR] symbol:   method getExtendedMeta(java.lang.Class<org.apache.juneau.xml.XmlClassMeta>)
[ERROR] location: variable cm of type org.apache.juneau.ClassMeta<?>
[ERROR] <https://builds.apache.org/job/Juneau-Java-1.7/ws/juneau-core/src/main/java/org/apache/juneau/xml/XmlSchemaSerializer.java>:[472,82]
cannot find symbol
[ERROR] symbol:   method getExtendedMeta(java.lang.Class<org.apache.juneau.xml.XmlClassMeta>)
[ERROR] location: variable elementType of type org.apache.juneau.ClassMeta<?>
[ERROR] <https://builds.apache.org/job/Juneau-Java-1.7/ws/juneau-core/src/main/java/org/apache/juneau/xml/XmlSchemaSerializer.java>:[472,137]
cannot find symbol
[ERROR] symbol:   method getExtendedMeta(java.lang.Class<org.apache.juneau.xml.XmlClassMeta>)
[ERROR] location: variable cm of type org.apache.juneau.ClassMeta<?>
[ERROR] <https://builds.apache.org/job/Juneau-Java-1.7/ws/juneau-core/src/main/java/org/apache/juneau/xml/XmlSchemaSerializer.java>:[524,41]
cannot find symbol
[ERROR] symbol:   method getExtendedMeta(java.lang.Class<org.apache.juneau.xml.XmlClassMeta>)
[ERROR] location: variable cm of type org.apache.juneau.ClassMeta<?>
[ERROR] <https://builds.apache.org/job/Juneau-Java-1.7/ws/juneau-core/src/main/java/org/apache/juneau/xml/XmlBeanPropertyMeta.java>:[48,69]
cannot find symbol
[ERROR] symbol:   method getExtendedMeta(java.lang.Class<org.apache.juneau.xml.XmlClassMeta>)
[ERROR] location: class org.apache.juneau.ClassMeta<capture#3 of ?>
[ERROR] <https://builds.apache.org/job/Juneau-Java-1.7/ws/juneau-core/src/main/java/org/apache/juneau/xml/XmlBeanPropertyMeta.java>:[130,57]
cannot find symbol
[ERROR] symbol:   method getExtendedMeta(java.lang.Class<org.apache.juneau.xml.XmlClassMeta>)
[ERROR] location: variable cmProperty of type org.apache.juneau.ClassMeta<?>
[ERROR] <https://builds.apache.org/job/Juneau-Java-1.7/ws/juneau-core/src/main/java/org/apache/juneau/xml/XmlBeanPropertyMeta.java>:[132,74]
cannot find symbol
[ERROR] symbol:   method getExtendedMeta(java.lang.Class<org.apache.juneau.xml.XmlClassMeta>)
[ERROR] location: class org.apache.juneau.ClassMeta<capture#4 of ?>
[ERROR] <https://builds.apache.org/job/Juneau-Java-1.7/ws/juneau-core/src/main/java/org/apache/juneau/xml/XmlBeanPropertyMeta.java>:[139,49]
cannot find symbol
[ERROR] symbol:   method getExtendedMeta(java.lang.Class<org.apache.juneau.xml.XmlClassMeta>)
[ERROR] location: variable cmProperty of type org.apache.juneau.ClassMeta<?>
[ERROR] <https://builds.apache.org/job/Juneau-Java-1.7/ws/juneau-core/src/main/java/org/apache/juneau/urlencoding/UrlEncodingParserSession.java>:[72,63]
cannot find symbol
[ERROR] symbol:   method getExtendedMeta(java.lang.Class<org.apache.juneau.urlencoding.UrlEncodingClassMeta>)
[ERROR] location: class org.apache.juneau.ClassMeta<capture#5 of ?>
[ERROR] -> [Help 1]
[ERROR] 
[ERROR] To see the full stack trace of the errors, re-run Maven with the -e switch.
[ERROR] Re-run Maven using the -X switch to enable full debug logging.
[ERROR] 
[ERROR] For more information about the errors and possible solutions, please read the following
articles:
[ERROR] [Help 1] http://cwiki.apache.org/confluence/display/MAVEN/MojoFailureException
[ERROR] 
[ERROR] After correcting the problems, you can resume the build with the command
[ERROR]   mvn <goals> -rf :juneau-core
Build step 'Invoke top-level Maven targets' marked build as failure

Mime
View raw message