juneau-dev mailing list archives

Site index · List index
Message view « Date » · « Thread »
Top « Date » · « Thread »
From Apache Jenkins Server <jenk...@builds.apache.org>
Subject Build failed in Jenkins: Juneau-Java-1.7 #23
Date Wed, 24 Aug 2016 16:44:16 GMT
See <https://builds.apache.org/job/Juneau-Java-1.7/23/changes>

Changes:

[jamesbognar] Clean up code preferences.

------------------------------------------
[...truncated 645 lines...]
Running org.apache.juneau.transforms.ByteArrayBase64TransformTest
Tests run: 42, Failures: 0, Errors: 0, Skipped: 0, Time elapsed: 1.467 sec - in org.apache.juneau.transforms.ByteArrayBase64TransformTest
Running org.apache.juneau.transforms.ReaderFilterTest
Tests run: 1, Failures: 0, Errors: 0, Skipped: 0, Time elapsed: 0.005 sec - in org.apache.juneau.transforms.ReaderFilterTest
Running org.apache.juneau.transforms.CalendarTransformTest
Tests run: 43, Failures: 0, Errors: 0, Skipped: 0, Time elapsed: 0.158 sec - in org.apache.juneau.transforms.CalendarTransformTest
Running org.apache.juneau.transforms.EnumerationTransformTest
Tests run: 1, Failures: 0, Errors: 0, Skipped: 0, Time elapsed: 0 sec - in org.apache.juneau.transforms.EnumerationTransformTest
Running org.apache.juneau.transforms.BeanTransformTest
Tests run: 6, Failures: 0, Errors: 0, Skipped: 0, Time elapsed: 0.016 sec - in org.apache.juneau.transforms.BeanTransformTest
Running org.apache.juneau.transforms.DateFilterTest
Tests run: 6, Failures: 0, Errors: 0, Skipped: 0, Time elapsed: 0.079 sec - in org.apache.juneau.transforms.DateFilterTest
Running org.apache.juneau.BeanMapTest
Tests run: 36, Failures: 0, Errors: 0, Skipped: 0, Time elapsed: 0.133 sec - in org.apache.juneau.BeanMapTest
Running org.apache.juneau.html.HtmlTest
Tests run: 5, Failures: 0, Errors: 0, Skipped: 0, Time elapsed: 0.043 sec - in org.apache.juneau.html.HtmlTest
Running org.apache.juneau.html.CommonTest
Tests run: 11, Failures: 0, Errors: 0, Skipped: 0, Time elapsed: 0.221 sec - in org.apache.juneau.html.CommonTest
Running org.apache.juneau.html.CommonParserTest
Tests run: 4, Failures: 0, Errors: 0, Skipped: 0, Time elapsed: 0.019 sec - in org.apache.juneau.html.CommonParserTest
Running org.apache.juneau.msgpack.MsgPackSerialzierTest
82 A4 6E 61 6D 65 AA 4A 6F 68 6E 20 53 6D 69 74 68 A3 61 67 65 15
Tests run: 1, Failures: 0, Errors: 0, Skipped: 0, Time elapsed: 0.013 sec - in org.apache.juneau.msgpack.MsgPackSerialzierTest
Running org.apache.juneau.DataConversionTest
Tests run: 2, Failures: 0, Errors: 0, Skipped: 0, Time elapsed: 0.003 sec - in org.apache.juneau.DataConversionTest
Running org.apache.juneau.ParserGenericsTest
Tests run: 2, Failures: 0, Errors: 0, Skipped: 0, Time elapsed: 0.003 sec - in org.apache.juneau.ParserGenericsTest
Running org.apache.juneau.xml.XmlTest
Tests run: 31, Failures: 0, Errors: 0, Skipped: 0, Time elapsed: 0.349 sec - in org.apache.juneau.xml.XmlTest
Running org.apache.juneau.xml.XmlParserTest
Tests run: 3, Failures: 0, Errors: 0, Skipped: 0, Time elapsed: 0.006 sec - in org.apache.juneau.xml.XmlParserTest
Running org.apache.juneau.xml.XmlContentTest
Tests run: 3, Failures: 0, Errors: 0, Skipped: 0, Time elapsed: 0.018 sec - in org.apache.juneau.xml.XmlContentTest
Running org.apache.juneau.xml.CommonTest
Tests run: 10, Failures: 0, Errors: 0, Skipped: 0, Time elapsed: 0.095 sec - in org.apache.juneau.xml.CommonTest
Running org.apache.juneau.xml.CommonParserTest
Tests run: 4, Failures: 0, Errors: 0, Skipped: 0, Time elapsed: 0.011 sec - in org.apache.juneau.xml.CommonParserTest
Running org.apache.juneau.xml.XmlCollapsedTest
Tests run: 9, Failures: 0, Errors: 0, Skipped: 0, Time elapsed: 0.062 sec - in org.apache.juneau.xml.XmlCollapsedTest
Running org.apache.juneau.xml.CommonXmlTest
Tests run: 2, Failures: 0, Errors: 0, Skipped: 0, Time elapsed: 0.005 sec - in org.apache.juneau.xml.CommonXmlTest
Running org.apache.juneau.BeanConfigTest
Tests run: 12, Failures: 0, Errors: 0, Skipped: 0, Time elapsed: 0.207 sec - in org.apache.juneau.BeanConfigTest
Running org.apache.juneau.ObjectMapTest
Tests run: 5, Failures: 0, Errors: 0, Skipped: 0, Time elapsed: 0.012 sec - in org.apache.juneau.ObjectMapTest
Running org.apache.juneau.ClassMetaTest
Tests run: 7, Failures: 0, Errors: 0, Skipped: 0, Time elapsed: 0.018 sec - in org.apache.juneau.ClassMetaTest
Running org.apache.juneau.csv.CsvTest
Tests run: 1, Failures: 0, Errors: 0, Skipped: 0, Time elapsed: 0.002 sec - in org.apache.juneau.csv.CsvTest
Running org.apache.juneau.ObjectListTest
Tests run: 3, Failures: 0, Errors: 0, Skipped: 0, Time elapsed: 0.003 sec - in org.apache.juneau.ObjectListTest
Running org.apache.juneau.a.rttests.RoundTripReadOnlyBeansTest
Tests run: 21, Failures: 0, Errors: 0, Skipped: 0, Time elapsed: 0.081 sec - in org.apache.juneau.a.rttests.RoundTripReadOnlyBeansTest
Running org.apache.juneau.a.rttests.RoundTripGenericsTest
Tests run: 21, Failures: 0, Errors: 0, Skipped: 0, Time elapsed: 0.073 sec - in org.apache.juneau.a.rttests.RoundTripGenericsTest
Running org.apache.juneau.a.rttests.RoundTripObjectsAsStringsTest
Tests run: 63, Failures: 0, Errors: 0, Skipped: 0, Time elapsed: 0.134 sec - in org.apache.juneau.a.rttests.RoundTripObjectsAsStringsTest
Running org.apache.juneau.a.rttests.RoundTripToObjectMapsTest
Tests run: 21, Failures: 0, Errors: 0, Skipped: 0, Time elapsed: 0.133 sec - in org.apache.juneau.a.rttests.RoundTripToObjectMapsTest
Running org.apache.juneau.a.rttests.RoundTripBeanInheritanceTest
Tests run: 42, Failures: 0, Errors: 0, Skipped: 0, Time elapsed: 0.094 sec - in org.apache.juneau.a.rttests.RoundTripBeanInheritanceTest
Running org.apache.juneau.a.rttests.RoundTripTrimStringsTest
Tests run: 21, Failures: 0, Errors: 0, Skipped: 0, Time elapsed: 0.155 sec - in org.apache.juneau.a.rttests.RoundTripTrimStringsTest
Running org.apache.juneau.a.rttests.RoundTripDTOsTest
Tests run: 42, Failures: 0, Errors: 0, Skipped: 0, Time elapsed: 1.203 sec - in org.apache.juneau.a.rttests.RoundTripDTOsTest
Running org.apache.juneau.a.rttests.RoundTripLargeObjectsTest
Tests run: 1, Failures: 0, Errors: 0, Skipped: 1, Time elapsed: 0 sec - in org.apache.juneau.a.rttests.RoundTripLargeObjectsTest
Running org.apache.juneau.a.rttests.RoundTripClassesTest
Tests run: 21, Failures: 0, Errors: 0, Skipped: 0, Time elapsed: 0.057 sec - in org.apache.juneau.a.rttests.RoundTripClassesTest
Running org.apache.juneau.a.rttests.RoundTripSimpleObjectsTest
Tests run: 1134, Failures: 0, Errors: 0, Skipped: 0, Time elapsed: 1.404 sec - in org.apache.juneau.a.rttests.RoundTripSimpleObjectsTest
Running org.apache.juneau.a.rttests.RoundTripTransformBeansTest
Tests run: 126, Failures: 0, Errors: 0, Skipped: 0, Time elapsed: 0.356 sec - in org.apache.juneau.a.rttests.RoundTripTransformBeansTest
Running org.apache.juneau.a.rttests.RoundTripPrimitivesBeansTest
Tests run: 42, Failures: 0, Errors: 0, Skipped: 0, Time elapsed: 0.877 sec - in org.apache.juneau.a.rttests.RoundTripPrimitivesBeansTest
Running org.apache.juneau.a.rttests.RoundTripPrimitiveObjectBeansTest
Tests run: 42, Failures: 0, Errors: 0, Skipped: 0, Time elapsed: 0.903 sec - in org.apache.juneau.a.rttests.RoundTripPrimitiveObjectBeansTest
Running org.apache.juneau.a.rttests.RoundTripObjectsWithSpecialMethodsTest
Tests run: 42, Failures: 0, Errors: 0, Skipped: 0, Time elapsed: 0.043 sec - in org.apache.juneau.a.rttests.RoundTripObjectsWithSpecialMethodsTest
Running org.apache.juneau.a.rttests.RoundTripNumericConstructorsTest
Tests run: 21, Failures: 0, Errors: 0, Skipped: 0, Time elapsed: 0.014 sec - in org.apache.juneau.a.rttests.RoundTripNumericConstructorsTest
Running org.apache.juneau.a.rttests.RoundTripBeanMapsTest
Tests run: 483, Failures: 0, Errors: 0, Skipped: 0, Time elapsed: 0.691 sec - in org.apache.juneau.a.rttests.RoundTripBeanMapsTest
Running org.apache.juneau.a.rttests.RoundTripAddClassAttrsTest
Tests run: 70, Failures: 0, Errors: 0, Skipped: 0, Time elapsed: 0.241 sec - in org.apache.juneau.a.rttests.RoundTripAddClassAttrsTest
Running org.apache.juneau.a.rttests.RoundTripEnumTest
Tests run: 168, Failures: 0, Errors: 0, Skipped: 0, Time elapsed: 0.206 sec - in org.apache.juneau.a.rttests.RoundTripEnumTest
Running org.apache.juneau.a.rttests.RoundTripMapsTest
Tests run: 126, Failures: 0, Errors: 0, Skipped: 0, Time elapsed: 0.183 sec - in org.apache.juneau.a.rttests.RoundTripMapsTest
Running org.apache.juneau.jena.RdfParserTest
Tests run: 1, Failures: 0, Errors: 0, Skipped: 0, Time elapsed: 0.084 sec - in org.apache.juneau.jena.RdfParserTest
Running org.apache.juneau.jena.RdfTest
Tests run: 4, Failures: 0, Errors: 0, Skipped: 0, Time elapsed: 0.074 sec - in org.apache.juneau.jena.RdfTest
Running org.apache.juneau.jena.CommonTest
Tests run: 10, Failures: 0, Errors: 0, Skipped: 0, Time elapsed: 0.081 sec - in org.apache.juneau.jena.CommonTest
Running org.apache.juneau.jena.CommonParserTest
2016-08-24 16:44:19,120 ERROR [el.impl.RDFDefaultErrorHandler] -- unknown-source: {E213} null
-- [main]
2016-08-24 16:44:19,123 ERROR [el.impl.RDFDefaultErrorHandler] -- (line 1 column 154): {E202}
Expecting XML start or end element(s). String data "   //foo   " not allowed. Maybe a striping
error. -- [main]
Tests run: 4, Failures: 0, Errors: 0, Skipped: 0, Time elapsed: 0.017 sec - in org.apache.juneau.jena.CommonParserTest
Running org.apache.juneau.jena.CommonXmlTest
Tests run: 2, Failures: 0, Errors: 0, Skipped: 0, Time elapsed: 0.003 sec - in org.apache.juneau.jena.CommonXmlTest
Running org.apache.juneau.ContextFactoryTest
Tests run: 9, Failures: 0, Errors: 0, Skipped: 0, Time elapsed: 0.054 sec - in org.apache.juneau.ContextFactoryTest
Running org.apache.juneau.IgnoredClassesTest
Tests run: 2, Failures: 0, Errors: 0, Skipped: 1, Time elapsed: 0.006 sec - in org.apache.juneau.IgnoredClassesTest
Running org.apache.juneau.internal.VersionRangeTest
Tests run: 21, Failures: 0, Errors: 0, Skipped: 0, Time elapsed: 0.005 sec - in org.apache.juneau.internal.VersionRangeTest
Running org.apache.juneau.JacocoDummyTest
Tests run: 1, Failures: 0, Errors: 0, Skipped: 0, Time elapsed: 0 sec - in org.apache.juneau.JacocoDummyTest
Running org.apache.juneau.VisibilityTest
Tests run: 1, Failures: 0, Errors: 0, Skipped: 0, Time elapsed: 0.056 sec - in org.apache.juneau.VisibilityTest
Running org.apache.juneau.AnnotationsTest
Tests run: 2, Failures: 0, Errors: 0, Skipped: 0, Time elapsed: 0 sec - in org.apache.juneau.AnnotationsTest
Running org.apache.juneau.PropertyNamerDashedLcTest
Tests run: 1, Failures: 0, Errors: 0, Skipped: 0, Time elapsed: 0 sec - in org.apache.juneau.PropertyNamerDashedLcTest
Running org.apache.juneau.ParserReaderTest
Tests run: 5, Failures: 0, Errors: 0, Skipped: 0, Time elapsed: 0 sec - in org.apache.juneau.ParserReaderTest
Running org.apache.juneau.urlencoding.Common_UrlEncodingTest
Tests run: 10, Failures: 0, Errors: 0, Skipped: 0, Time elapsed: 0.061 sec - in org.apache.juneau.urlencoding.Common_UrlEncodingTest
Running org.apache.juneau.urlencoding.UonParserReaderTest
Tests run: 1, Failures: 0, Errors: 0, Skipped: 0, Time elapsed: 0 sec - in org.apache.juneau.urlencoding.UonParserReaderTest
Running org.apache.juneau.urlencoding.UrlEncodingSerializerTest
Tests run: 5, Failures: 0, Errors: 0, Skipped: 0, Time elapsed: 0.028 sec - in org.apache.juneau.urlencoding.UrlEncodingSerializerTest
Running org.apache.juneau.urlencoding.UonParserTest
Tests run: 3, Failures: 0, Errors: 0, Skipped: 0, Time elapsed: 0.006 sec - in org.apache.juneau.urlencoding.UonParserTest
Running org.apache.juneau.urlencoding.UonSerializerTest
Tests run: 2, Failures: 0, Errors: 0, Skipped: 0, Time elapsed: 0.007 sec - in org.apache.juneau.urlencoding.UonSerializerTest
Running org.apache.juneau.urlencoding.CommonParser_UrlEncodingTest
Tests run: 5, Failures: 0, Errors: 0, Skipped: 0, Time elapsed: 0.007 sec - in org.apache.juneau.urlencoding.CommonParser_UrlEncodingTest
Running org.apache.juneau.urlencoding.UrlEncodingParserTest
Tests run: 12, Failures: 0, Errors: 0, Skipped: 0, Time elapsed: 0.023 sec - in org.apache.juneau.urlencoding.UrlEncodingParserTest
Running org.apache.juneau.urlencoding.CommonParser_UonTest
Tests run: 4, Failures: 0, Errors: 0, Skipped: 0, Time elapsed: 0.005 sec - in org.apache.juneau.urlencoding.CommonParser_UonTest
Running org.apache.juneau.urlencoding.Common_UonTest
Tests run: 10, Failures: 0, Errors: 0, Skipped: 0, Time elapsed: 0.071 sec - in org.apache.juneau.urlencoding.Common_UonTest
Running org.apache.juneau.ini.ConfigMgrTest
Tests run: 1, Failures: 0, Errors: 1, Skipped: 0, Time elapsed: 0.004 sec <<< FAILURE!
- in org.apache.juneau.ini.ConfigMgrTest
org.apache.juneau.ini.ConfigMgrTest  Time elapsed: 0.004 sec  <<< ERROR!
java.lang.RuntimeException: Could not create directory '/tmp/tzcv8zr5ihdp'
	at org.apache.juneau.ini.ConfigMgrTest.setup(ConfigMgrTest.java:34)

Running org.apache.juneau.ini.ConfigFileTest
Tests run: 45, Failures: 9, Errors: 0, Skipped: 0, Time elapsed: 0.086 sec <<< FAILURE!
- in org.apache.juneau.ini.ConfigFileTest
testEncodedValues(org.apache.juneau.ini.ConfigFileTest)  Time elapsed: 0.003 sec  <<<
FAILURE!
org.junit.ComparisonFailure: expected:<[[s1]||foo* = {AwwJVhwUQFZEMg==}|]> but was:<[]>
	at org.apache.juneau.ini.ConfigFileTest.testEncodedValues(ConfigFileTest.java:443)

testMultilineValues(org.apache.juneau.ini.ConfigFileTest)  Time elapsed: 0.002 sec  <<<
FAILURE!
org.junit.ComparisonFailure: expected:<[a = a,|	b,|	c|[A]|a = a,|	b,|	c|]> but was:<[]>
	at org.apache.juneau.ini.ConfigFileTest.testMultilineValues(ConfigFileTest.java:2125)

testEnum(org.apache.juneau.ini.ConfigFileTest)  Time elapsed: 0 sec  <<< FAILURE!
java.lang.AssertionError: expected:<MINUTES> but was:<null>
	at org.apache.juneau.ini.ConfigFileTest.testEnum(ConfigFileTest.java:374)

testHeaderComments(org.apache.juneau.ini.ConfigFileTest)  Time elapsed: 0.001 sec  <<<
FAILURE!
org.junit.ComparisonFailure: expected:<[x|[s1]|#c3|#c4|]> but was:<[]>
	at org.apache.juneau.ini.ConfigFileTest.testHeaderComments(ConfigFileTest.java:169)

testExampleInConfigFile(org.apache.juneau.ini.ConfigFileTest)  Time elapsed: 0.003 sec  <<<
FAILURE!
java.lang.AssertionError: expected:<1> but was:<0>
	at org.apache.juneau.ini.ConfigFileTest.testExampleInConfigFile(ConfigFileTest.java:306)

testBasics(org.apache.juneau.ini.ConfigFileTest)  Time elapsed: 0.002 sec  <<< FAILURE!
java.lang.AssertionError: expected:<1> but was:<0>
	at org.apache.juneau.ini.ConfigFileTest.testBasics(ConfigFileTest.java:87)

testRemoveEntries(org.apache.juneau.ini.ConfigFileTest)  Time elapsed: 0.002 sec  <<<
FAILURE!
org.junit.ComparisonFailure: expected:<[[s1]|x2 = 2|]> but was:<[]>
	at org.apache.juneau.ini.ConfigFileTest.testRemoveEntries(ConfigFileTest.java:201)

testCommentsOnly(org.apache.juneau.ini.ConfigFileTest)  Time elapsed: 0.001 sec  <<<
FAILURE!
org.junit.ComparisonFailure: expected:<[# c1|	# c2| c3 |]> but was:<[]>
	at org.apache.juneau.ini.ConfigFileTest.testCommentsOnly(ConfigFileTest.java:62)

testSpecialCharacterEncoding(org.apache.juneau.ini.ConfigFileTest)  Time elapsed: 0.001 sec
 <<< FAILURE!
org.junit.ComparisonFailure: expected:<[a = a,\u0023b,\u003Dc|[A]|a = a,\u0023b,\u003Dc|]>
but was:<[]>
	at org.apache.juneau.ini.ConfigFileTest.testSpecialCharacterEncoding(ConfigFileTest.java:2148)

Running org.apache.juneau.BeanTransformTest
Tests run: 3, Failures: 0, Errors: 0, Skipped: 0, Time elapsed: 0.007 sec - in org.apache.juneau.BeanTransformTest
Running org.apache.juneau.dto.cognos.CognosXmlTest
Tests run: 1, Failures: 0, Errors: 0, Skipped: 0, Time elapsed: 0.007 sec - in org.apache.juneau.dto.cognos.CognosXmlTest
Running org.apache.juneau.dto.atom.AtomTest
Tests run: 1, Failures: 0, Errors: 0, Skipped: 0, Time elapsed: 0.05 sec - in org.apache.juneau.dto.atom.AtomTest
Running org.apache.juneau.dto.jsonschema.JsonSchemaTest
Tests run: 2, Failures: 0, Errors: 0, Skipped: 0, Time elapsed: 0.004 sec - in org.apache.juneau.dto.jsonschema.JsonSchemaTest
Running org.apache.juneau.PojoTransformTest
Tests run: 1, Failures: 0, Errors: 0, Skipped: 0, Time elapsed: 0.003 sec - in org.apache.juneau.PojoTransformTest
Running org.apache.juneau.json.JsonSchemaTest
Tests run: 1, Failures: 0, Errors: 0, Skipped: 0, Time elapsed: 0.001 sec - in org.apache.juneau.json.JsonSchemaTest
Running org.apache.juneau.json.JsonTest
Tests run: 10, Failures: 0, Errors: 0, Skipped: 0, Time elapsed: 0.01 sec - in org.apache.juneau.json.JsonTest
Running org.apache.juneau.json.CommonTest
Tests run: 11, Failures: 0, Errors: 0, Skipped: 0, Time elapsed: 0.075 sec - in org.apache.juneau.json.CommonTest
Running org.apache.juneau.json.CommonParserTest
Tests run: 4, Failures: 0, Errors: 0, Skipped: 0, Time elapsed: 0.007 sec - in org.apache.juneau.json.CommonParserTest
Running org.apache.juneau.json.JsonParserTest
Tests run: 8, Failures: 0, Errors: 0, Skipped: 0, Time elapsed: 0.098 sec - in org.apache.juneau.json.JsonParserTest

Results :

Failed tests: 
  ConfigFileTest.testBasics:87 expected:<1> but was:<0>
  ConfigFileTest.testCommentsOnly:62 expected:<[# c1|	# c2| c3 |]> but was:<[]>
  ConfigFileTest.testEncodedValues:443 expected:<[[s1]||foo* = {AwwJVhwUQFZEMg==}|]>
but was:<[]>
  ConfigFileTest.testEnum:374 expected:<MINUTES> but was:<null>
  ConfigFileTest.testExampleInConfigFile:306 expected:<1> but was:<0>
  ConfigFileTest.testHeaderComments:169 expected:<[x|[s1]|#c3|#c4|]> but was:<[]>
  ConfigFileTest.testMultilineValues:2125 expected:<[a = a,|	b,|	c|[A]|a = a,|	b,|	c|]>
but was:<[]>
  ConfigFileTest.testRemoveEntries:201 expected:<[[s1]|x2 = 2|]> but was:<[]>
  ConfigFileTest.testSpecialCharacterEncoding:2148 expected:<[a = a,\u0023b,\u003Dc|[A]|a
= a,\u0023b,\u003Dc|]> but was:<[]>
Tests in error: 
  ConfigMgrTest.setup:34 ยป Runtime Could not create directory '/tmp/tzcv8zr5ihdp...

Tests run: 3038, Failures: 9, Errors: 1, Skipped: 2

[INFO] ------------------------------------------------------------------------
[INFO] Reactor Summary:
[INFO] 
[INFO] Apache Juneau (incubating) ........................ SUCCESS [3.965s]
[INFO] Apache Juneau Core ................................ FAILURE [21.042s]
[INFO] Apache Juneau Client .............................. SKIPPED
[INFO] Apache Juneau Server .............................. SKIPPED
[INFO] Apache Juneau Microservice ........................ SKIPPED
[INFO] Apache Juneau Samples ............................. SKIPPED
[INFO] Apache Juneau Server Test ......................... SKIPPED
[INFO] Apache Juneau Distribution ........................ SKIPPED
[INFO] ------------------------------------------------------------------------
[INFO] BUILD FAILURE
[INFO] ------------------------------------------------------------------------
[INFO] Total time: 25.294s
[INFO] Finished at: Wed Aug 24 16:44:20 UTC 2016
[INFO] Final Memory: 28M/684M
[INFO] ------------------------------------------------------------------------
[ERROR] Failed to execute goal org.apache.maven.plugins:maven-surefire-plugin:2.19.1:test
(default-test) on project juneau-core: There are test failures.
[ERROR] 
[ERROR] Please refer to <https://builds.apache.org/job/Juneau-Java-1.7/ws/juneau-core/target/surefire-reports>
for the individual test results.
[ERROR] -> [Help 1]
[ERROR] 
[ERROR] To see the full stack trace of the errors, re-run Maven with the -e switch.
[ERROR] Re-run Maven using the -X switch to enable full debug logging.
[ERROR] 
[ERROR] For more information about the errors and possible solutions, please read the following
articles:
[ERROR] [Help 1] http://cwiki.apache.org/confluence/display/MAVEN/MojoFailureException
[ERROR] 
[ERROR] After correcting the problems, you can resume the build with the command
[ERROR]   mvn <goals> -rf :juneau-core
Build step 'Invoke top-level Maven targets' marked build as failure

Mime
View raw message