ant-dev mailing list archives

Site index · List index
Message view « Date » · « Thread »
Top « Date » · « Thread »
From Dominique Devienne <>
Subject Re: [GUMP@vmgump]: Project test-ant-1.8.x (in module ant-1.8.x) failed
Date Wed, 10 Oct 2012 11:22:52 GMT
On Wed, Oct 10, 2012 at 1:01 PM, Gump Integration Build
<> wrote:
> To whom it may engage...
> This is an automated request, but not an unsolicited one. For
> more information please visit,
> and/or contact the folk at
> Project test-ant-1.8.x has an issue affecting its community integration.
> This issue affects 1 projects,
>  and has been outstanding for 128 runs.

FYI: JarTest and hostinfo-test failures:

    [junit] Testsuite:
    [junit] Tests run: 30, Failures: 1, Errors: 0, Time elapsed: 51.047 sec
    [junit] Testcase:
testRecreateWithUpdateNewerFile(	FAILED
    [junit] jar has been recreated in testRecreateWithUpdateNewerFile
    [junit] junit.framework.AssertionFailedError: jar has been
recreated in testRecreateWithUpdateNewerFile
    [junit] 	at
    [junit] 	at junit.framework.Assert.assertTrue(
    [junit] 	at junit.framework.TestCase.assertTrue(
    [junit] 	at
    [junit] 	at
    [junit] 	at sun.reflect.NativeMethodAccessorImpl.invoke0(Native Method)
    [junit] 	at
    [junit] 	at
    [junit] 	at java.lang.reflect.Method.invoke(
    [junit] 	at junit.framework.TestCase.runTest(
    [junit] 	at junit.framework.TestCase.runBare(
    [junit] 	at junit.framework.TestResult$1.protect(
    [junit] 	at junit.framework.TestResult.runProtected(
    [junit] 	at
    [junit] 	at
    [junit] 	at junit.framework.TestSuite.runTest(
    [junit] 	at
    [junit] 	at
    [junit] 	at
    [junit] 	at
    [junit] TEST FAILED

[au:antunit] Build File:
[au:antunit] Tests run: 5, Failures: 2, Errors: 0, Time elapsed: 2.931 sec
[au:antunit] Target: testUndef took 1.39 sec
[au:antunit] Target: testApacheNoPrefix  FAILED
[au:antunit] 	at line 70, column 22
[au:antunit] 	Message: Assertion failed
[au:antunit] 	took 0.387 sec
[au:antunit] Target: testReverse took 0.927 sec
[au:antunit] Target: testApache  FAILED
[au:antunit] 	at line 53, column 22
[au:antunit] 	Message: Assertion failed
[au:antunit] 	took 0.002 sec
[au:antunit] Target: testLocal took 0.002 sec

To unsubscribe, e-mail:
For additional commands, e-mail:

View raw message