ant-dev mailing list archives

Site index · List index
Message view « Date » · « Thread »
Top « Date » · « Thread »
From "Gilles Scokart" <>
Subject Ivy Broken unit test
Date Tue, 05 Aug 2008 13:56:37 GMT
I have some unit test failing :

Test org.apache.ivy.ant.IvyAntSettingsTest FAILED
Test org.apache.ivy.ant.IvyConfigureTest FAILED
Test org.apache.ivy.ant.IvyTaskTest FAILED
Test org.apache.ivy.plugins.resolver.ChainResolverTest FAILED
Test org.apache.ivy.core.NormalRelativeUrlResolverTest FAILED

Gump seems OK :

Am I the only one (I'm using ibm jvm 1.5 on cygwin, but up to now I
didn't had any problem with this set up).

I will try with older source base to see where it failed.

Gilles Scokart

To unsubscribe, e-mail:
For additional commands, e-mail:

View raw message