portals-jetspeed-dev mailing list archives

Site index · List index
Message view « Date » · « Thread »
Top « Date » · « Thread »
From David Sean Taylor <da...@bluesunrise.com>
Subject Re: [j2] Registry test fail
Date Fri, 21 May 2004 16:05:02 GMT

On May 21, 2004, at 7:30 AM, Roger Ruttimann wrote:

> During the build J2 the unit tests for the registry fail. I'm using  
> MySQL as db.
>    [junit] [ERROR] TEST  
> org.apache.jetspeed.components.portletentity.TestPortletEntityAccessCom 
> ponent FAILED
>    [junit] Running  
> org.apache.jetspeed.components.portletregistry.TestRegistryDirect
>    [junit] Tests run: 2, Failures: 0, Errors: 1, Time elapsed: 1.949  
> sec
>    [junit] [ERROR] TEST  
> org.apache.jetspeed.components.portletregistry.TestRegistryDirect  
> FAILED
>    [junit] Running  
> org.apache.jetspeed.components.portletregistry.TestRegistryDirectPart2
>    [junit] Tests run: 2, Failures: 0, Errors: 1, Time elapsed: 1.949  
> sec
>    [junit] [ERROR] TEST  
> org.apache.jetspeed.components.portletregistry.TestRegistryDirectPart2  
> FAILED
>
> Any ideas?
>

I had the exact same problem here, but only if I run a single test, or  
a complete sub project test

Do a cvs update now, it should be fixed


---------------------------------------------------------------------
To unsubscribe, e-mail: jetspeed-dev-unsubscribe@jakarta.apache.org
For additional commands, e-mail: jetspeed-dev-help@jakarta.apache.org


Mime
View raw message