portals-jetspeed-dev mailing list archives

Site index · List index
Message view « Date » · « Thread »
Top « Date » · « Thread »
From David Sean Taylor <da...@bluesunrise.com>
Subject Re: [J2] Borken Build
Date Wed, 19 May 2004 13:57:16 GMT
This is from a fresh checkout
As an aside, I think we need to look into getting better error messages  
for script failures
Its pretty difficult to figure out where the error is in the script

The error is occurring when the RequestContext goes to load its  
dependency on the new UserInfoManager component

I've got to leave for the day, so I won't be responding to emails  
unless I can find some time at lunch break


     [junit] Running org.apache.jetspeed.aggregator.TestAggregator
     [junit] Tests run: 1, Failures: 0, Errors: 0, Time elapsed: 3.455  
sec
     [junit] Running org.apache.jetspeed.aggregator.TestRenderer
     [junit] Tests run: 1, Failures: 0, Errors: 0, Time elapsed: 3.415  
sec
     [junit] Running org.apache.jetspeed.cache.file.TestFileCache
     [junit] Tests run: 2, Failures: 0, Errors: 0, Time elapsed: 12.699  
sec
     [junit] Running org.apache.jetspeed.capability.TestCapability
     [junit] Tests run: 1, Failures: 0, Errors: 0, Time elapsed: 3.925  
sec
     [junit] Running  
org.apache.jetspeed.container.session.TestNavigationalState
     [junit] Tests run: 1, Failures: 0, Errors: 0, Time elapsed: 1.833  
sec
     [junit] Running org.apache.jetspeed.container.TestPortletContainer
     [junit] Tests run: 1, Failures: 0, Errors: 0, Time elapsed: 1.652  
sec
     [junit] Running org.apache.jetspeed.deployment.TestSimpleDeployment
     [junit] log4j:WARN No appenders could be found for logger  
(org.apache.jetspeed.Jetspeed).
     [junit] log4j:WARN Please initialize the log4j system properly.
     [junit] cn=org.nanocontainer.script.groovy.GroovyContainerBuilder
     [junit] cn=org.nanocontainer.script.groovy.GroovyContainerBuilder
     [junit] cn=org.nanocontainer.script.groovy.GroovyContainerBuilder
     [junit] cn=org.nanocontainer.script.groovy.GroovyContainerBuilder
     [junit] cn=org.nanocontainer.script.groovy.GroovyContainerBuilder
     [junit] cn=org.nanocontainer.script.groovy.GroovyContainerBuilder
     [junit] cn=org.nanocontainer.script.groovy.GroovyContainerBuilder
     [junit] groovy.lang.GroovyRuntimeException: Could not find which  
method to invoke from this list: [public org.picoco
ntainer.defaults.ComponentParameter(java.lang.Class), public  
org.picocontainer.defaults.ComponentParameter(java.lang.Obj
ect)] for arguments: []
     [junit]     at  
groovy.lang.MetaClass.chooseMethod(MetaClass.java:1104)
     [junit]     at  
groovy.lang.MetaClass.invokeConstructor(MetaClass.java:323)
     [junit]     at  
org.codehaus.groovy.runtime.Invoker.invokeConstructorOf(Invoker.java: 
148)
     [junit]     at  
org.codehaus.groovy.runtime.InvokerHelper.invokeConstructorOf(InvokerHel 
per.java:120)
     [junit]     at nanocontainer.run(nanocontainer.groovy:202)
     [junit]     at  
org.nanocontainer.script.groovy.GroovyContainerBuilder.createContainer(G 
roovyContainerBuilder.java:57
)
     [junit]     at  
org.nanocontainer.integrationkit.LifecycleContainerBuilder.buildContaine 
r(LifecycleContainerBuilder.j
ava:25)
     [junit]     at  
org.nanocontainer.NanoContainer.<init>(NanoContainer.java:88)
     [junit]     at  
org.nanocontainer.NanoContainer.<init>(NanoContainer.java:59)
     [junit]     at  
org.apache.jetspeed.components.ComponentManager.<init>(ComponentManager. 
java:77)
     [junit]     at  
org.apache.jetspeed.engine.JetspeedEngine.initComponents(JetspeedEngine. 
java:288)
     [junit]     at  
org.apache.jetspeed.engine.JetspeedEngine.init(JetspeedEngine.java:116)
     [junit]     at  
org.apache.jetspeed.Jetspeed.createEngine(Jetspeed.java:60)
     [junit]     at  
org.apache.jetspeed.test.JetspeedTestSuite.startEngine(JetspeedTestSuite 
.java:104)
     [junit]     at  
org.apache.jetspeed.test.JetspeedTestSuite.<init>(JetspeedTestSuite.java 
:76)
     [junit]     at  
org.apache.jetspeed.deployment.TestSimpleDeployment.suite(TestSimpleDepl 
oyment.java:78)
     [junit]     at sun.reflect.NativeMethodAccessorImpl.invoke0(Native  
Method)
     [junit]     at  
sun.reflect.NativeMethodAccessorImpl.invoke(NativeMethodAccessorImpl.jav 
a:39)
     [junit]     at  
sun.reflect.DelegatingMethodAccessorImpl.invoke(DelegatingMethodAccessor 
Impl.java:25)
     [junit]     at java.lang.reflect.Method.invoke(Method.java:324)
     [junit]     at  
org.apache.tools.ant.taskdefs.optional.junit.JUnitTestRunner.<init>(JUni 
tTestRunner.java:257)
     [junit]     at  
org.apache.tools.ant.taskdefs.optional.junit.JUnitTestRunner.<init>(JUni 
tTestRunner.java:210)
     [junit]     at  
org.apache.tools.ant.taskdefs.optional.junit.JUnitTestRunner.main(JUnitT 
estRunner.java:532)
     [junit] org.apache.jetspeed.exception.JetspeedException: Jetspeed  
Initialization exception!
     [junit]     at  
org.apache.jetspeed.engine.JetspeedEngine.init(JetspeedEngine.java:138)
     [junit]     at  
org.apache.jetspeed.Jetspeed.createEngine(Jetspeed.java:60)
     [junit]     at  
org.apache.jetspeed.test.JetspeedTestSuite.startEngine(JetspeedTestSuite 
.java:104)
     [junit]     at  
org.apache.jetspeed.test.JetspeedTestSuite.<init>(JetspeedTestSuite.java 
:76)
     [junit]     at  
org.apache.jetspeed.deployment.TestSimpleDeployment.suite(TestSimpleDepl 
oyment.java:78)
     [junit]     at sun.reflect.NativeMethodAccessorImpl.invoke0(Native  
Method)
     [junit]     at  
sun.reflect.NativeMethodAccessorImpl.invoke(NativeMethodAccessorImpl.jav 
a:39)
     [junit]     at  
sun.reflect.DelegatingMethodAccessorImpl.invoke(DelegatingMethodAccessor 
Impl.java:25)
     [junit]     at java.lang.reflect.Method.invoke(Method.java:324)
     [junit]     at  
org.apache.tools.ant.taskdefs.optional.junit.JUnitTestRunner.<init>(JUni 
tTestRunner.java:257)
     [junit]     at  
org.apache.tools.ant.taskdefs.optional.junit.JUnitTestRunner.<init>(JUni 
tTestRunner.java:210)
     [junit]     at  
org.apache.tools.ant.taskdefs.optional.junit.JUnitTestRunner.main(JUnitT 
estRunner.java:532)
     [junit] Caused by: groovy.lang.GroovyRuntimeException: Could not  
find which method to invoke from this list: [public
  org.picocontainer.defaults.ComponentParameter(java.lang.Class), public  
org.picocontainer.defaults.ComponentParameter(ja
va.lang.Object)] for arguments: []
     [junit]     at  
groovy.lang.MetaClass.chooseMethod(MetaClass.java:1104)
     [junit]     at  
groovy.lang.MetaClass.invokeConstructor(MetaClass.java:323)
     [junit]     at  
org.codehaus.groovy.runtime.Invoker.invokeConstructorOf(Invoker.java: 
148)
     [junit]     at  
org.codehaus.groovy.runtime.InvokerHelper.invokeConstructorOf(InvokerHel 
per.java:120)
     [junit]     at nanocontainer.run(nanocontainer.groovy:202)
     [junit]     at  
org.nanocontainer.script.groovy.GroovyContainerBuilder.createContainer(G 
roovyContainerBuilder.java:57
)
     [junit]     at  
org.nanocontainer.integrationkit.LifecycleContainerBuilder.buildContaine 
r(LifecycleContainerBuilder.j
ava:25)
     [junit]     at  
org.nanocontainer.NanoContainer.<init>(NanoContainer.java:88)
     [junit]     at  
org.nanocontainer.NanoContainer.<init>(NanoContainer.java:59)
     [junit]     at  
org.apache.jetspeed.components.ComponentManager.<init>(ComponentManager. 
java:77)
     [junit]     at  
org.apache.jetspeed.engine.JetspeedEngine.initComponents(JetspeedEngine. 
java:288)
     [junit]     at  
org.apache.jetspeed.engine.JetspeedEngine.init(JetspeedEngine.java:116)
     [junit]     ... 11 more
     [junit] org.apache.jetspeed.exception.JetspeedException: Unable to  
create Engine
     [junit]     at  
org.apache.jetspeed.Jetspeed.createEngine(Jetspeed.java:70)
     [junit]     at  
org.apache.jetspeed.test.JetspeedTestSuite.startEngine(JetspeedTestSuite 
.java:104)
     [junit]     at  
org.apache.jetspeed.test.JetspeedTestSuite.<init>(JetspeedTestSuite.java 
:76)
     [junit]     at  
org.apache.jetspeed.deployment.TestSimpleDeployment.suite(TestSimpleDepl 
oyment.java:78)
     [junit]     at sun.reflect.NativeMethodAccessorImpl.invoke0(Native  
Method)
     [junit]     at  
sun.reflect.NativeMethodAccessorImpl.invoke(NativeMethodAccessorImpl.jav 
a:39)
     [junit]     at  
sun.reflect.DelegatingMethodAccessorImpl.invoke(DelegatingMethodAccessor 
Impl.java:25)
     [junit]     at java.lang.reflect.Method.invoke(Method.java:324)
     [junit]     at  
org.apache.tools.ant.taskdefs.optional.junit.JUnitTestRunner.<init>(JUni 
tTestRunner.java:257)
     [junit]     at  
org.apache.tools.ant.taskdefs.optional.junit.JUnitTestRunner.<init>(JUni 
tTestRunner.java:210)
     [junit]     at  
org.apache.tools.ant.taskdefs.optional.junit.JUnitTestRunner.main(JUnitT 
estRunner.java:532)
     [junit] Caused by: org.apache.jetspeed.exception.JetspeedException:  
Jetspeed Initialization exception!
     [junit]     at  
org.apache.jetspeed.engine.JetspeedEngine.init(JetspeedEngine.java:138)
     [junit]     at  
org.apache.jetspeed.Jetspeed.createEngine(Jetspeed.java:60)
     [junit]     ... 10 more
     [junit] Caused by: groovy.lang.GroovyRuntimeException: Could not  
find which method to invoke from this list: [public
  org.picocontainer.defaults.ComponentParameter(java.lang.Class), public  
org.picocontainer.defaults.ComponentParameter(ja
va.lang.Object)] for arguments: []
     [junit]     at  
groovy.lang.MetaClass.chooseMethod(MetaClass.java:1104)
     [junit]     at  
groovy.lang.MetaClass.invokeConstructor(MetaClass.java:323)
     [junit]     at  
org.codehaus.groovy.runtime.Invoker.invokeConstructorOf(Invoker.java: 
148)
     [junit]     at  
org.codehaus.groovy.runtime.InvokerHelper.invokeConstructorOf(InvokerHel 
per.java:120)
     [junit]     at nanocontainer.run(nanocontainer.groovy:202)
     [junit]     at  
org.nanocontainer.script.groovy.GroovyContainerBuilder.createContainer(G 
roovyContainerBuilder.java:57
)
     [junit]     at  
org.nanocontainer.integrationkit.LifecycleContainerBuilder.buildContaine 
r(LifecycleContainerBuilder.j
ava:25)
     [junit]     at  
org.nanocontainer.NanoContainer.<init>(NanoContainer.java:88)
     [junit]     at  
org.nanocontainer.NanoContainer.<init>(NanoContainer.java:59)
     [junit]     at  
org.apache.jetspeed.components.ComponentManager.<init>(ComponentManager. 
java:77)
     [junit]     at  
org.apache.jetspeed.engine.JetspeedEngine.initComponents(JetspeedEngine. 
java:288)
     [junit]     at  
org.apache.jetspeed.engine.JetspeedEngine.init(JetspeedEngine.java:116)
     [junit]     ... 11 more
     [junit] Tests run: 1, Failures: 1, Errors: 0, Time elapsed: 0.451  
sec
     [junit] [ERROR] TEST  
org.apache.jetspeed.deployment.TestSimpleDeployment FAILED
     [junit] Running org.apache.jetspeed.om.page.TestPageObjectModel
     [junit] log4j:WARN No appenders could be found for logger  
(org.apache.jetspeed.Jetspeed).
     [junit] log4j:WARN Please initialize the log4j system properly.
     [junit] cn=org.nanocontainer.script.groovy.GroovyContainerBuilder
     [junit] cn=org.nanocontainer.script.groovy.GroovyContainerBuilder
     [junit] cn=org.nanocontainer.script.groovy.GroovyContainerBuilder
     [junit] cn=org.nanocontainer.script.groovy.GroovyContainerBuilder
     [junit] cn=org.nanocontainer.script.groovy.GroovyContainerBuilder
     [junit] cn=org.nanocontainer.script.groovy.GroovyContainerBuilder
     [junit] cn=org.nanocontainer.script.groovy.GroovyContainerBuilder
     [junit] groovy.lang.GroovyRuntimeException: Could not find which  
method to invoke from this list: [public org.picoco
ntainer.defaults.ComponentParameter(java.lang.Class), public  
org.picocontainer.defaults.ComponentParameter(java.lang.Obj
ect)] for arguments: []
     [junit]     at  
groovy.lang.MetaClass.chooseMethod(MetaClass.java:1104)
     [junit]     at  
groovy.lang.MetaClass.invokeConstructor(MetaClass.java:323)
     [junit]     at  
org.codehaus.groovy.runtime.Invoker.invokeConstructorOf(Invoker.java: 
148)
     [junit]     at  
org.codehaus.groovy.runtime.InvokerHelper.invokeConstructorOf(InvokerHel 
per.java:120)
     [junit]     at nanocontainer.run(nanocontainer.groovy:202)
     [junit]     at  
org.nanocontainer.script.groovy.GroovyContainerBuilder.createContainer(G 
roovyContainerBuilder.java:57
)
     [junit]     at  
org.nanocontainer.integrationkit.LifecycleContainerBuilder.buildContaine 
r(LifecycleContainerBuilder.j
ava:25)
     [junit]     at  
org.nanocontainer.NanoContainer.<init>(NanoContainer.java:88)
     [junit]     at  
org.nanocontainer.NanoContainer.<init>(NanoContainer.java:59)
     [junit]     at  
org.apache.jetspeed.components.ComponentManager.<init>(ComponentManager. 
java:77)
     [junit]     at  
org.apache.jetspeed.engine.JetspeedEngine.initComponents(JetspeedEngine. 
java:288)
     [junit]     at  
org.apache.jetspeed.engine.JetspeedEngine.init(JetspeedEngine.java:116)
     [junit]     at  
org.apache.jetspeed.Jetspeed.createEngine(Jetspeed.java:60)
     [junit]     at  
org.apache.jetspeed.test.JetspeedTestSuite.startEngine(JetspeedTestSuite 
.java:104)
     [junit]     at  
org.apache.jetspeed.test.JetspeedTestSuite.<init>(JetspeedTestSuite.java 
:76)
     [junit]     at  
org.apache.jetspeed.om.page.TestPageObjectModel.suite(TestPageObjectMode 
l.java:71)
     [junit]     at sun.reflect.NativeMethodAccessorImpl.invoke0(Native  
Method)
     [junit]     at  
sun.reflect.NativeMethodAccessorImpl.invoke(NativeMethodAccessorImpl.jav 
a:39)
     [junit]     at  
sun.reflect.DelegatingMethodAccessorImpl.invoke(DelegatingMethodAccessor 
Impl.java:25)
     [junit]     at java.lang.reflect.Method.invoke(Method.java:324)
     [junit]     at  
org.apache.tools.ant.taskdefs.optional.junit.JUnitTestRunner.<init>(JUni 
tTestRunner.java:257)
     [junit]     at  
org.apache.tools.ant.taskdefs.optional.junit.JUnitTestRunner.<init>(JUni 
tTestRunner.java:210)
     [junit]     at  
org.apache.tools.ant.taskdefs.optional.junit.JUnitTestRunner.main(JUnitT 
estRunner.java:532)
     [junit] org.apache.jetspeed.exception.JetspeedException: Jetspeed  
Initialization exception!
     [junit]     at  
org.apache.jetspeed.engine.JetspeedEngine.init(JetspeedEngine.java:138)
     [junit]     at  
org.apache.jetspeed.Jetspeed.createEngine(Jetspeed.java:60)
     [junit]     at  
org.apache.jetspeed.test.JetspeedTestSuite.startEngine(JetspeedTestSuite 
.java:104)
     [junit]     at  
org.apache.jetspeed.test.JetspeedTestSuite.<init>(JetspeedTestSuite.java 
:76)
     [junit]     at  
org.apache.jetspeed.om.page.TestPageObjectModel.suite(TestPageObjectMode 
l.java:71)
     [junit]     at sun.reflect.NativeMethodAccessorImpl.invoke0(Native  
Method)
     [junit]     at  
sun.reflect.NativeMethodAccessorImpl.invoke(NativeMethodAccessorImpl.jav 
a:39)
     [junit]     at  
sun.reflect.DelegatingMethodAccessorImpl.invoke(DelegatingMethodAccessor 
Impl.java:25)
     [junit]     at java.lang.reflect.Method.invoke(Method.java:324)
     [junit]     at  
org.apache.tools.ant.taskdefs.optional.junit.JUnitTestRunner.<init>(JUni 
tTestRunner.java:257)
     [junit]     at  
org.apache.tools.ant.taskdefs.optional.junit.JUnitTestRunner.<init>(JUni 
tTestRunner.java:210)
     [junit]     at  
org.apache.tools.ant.taskdefs.optional.junit.JUnitTestRunner.main(JUnitT 
estRunner.java:532)
     [junit] Caused by: groovy.lang.GroovyRuntimeException: Could not  
find which method to invoke from this list: [public
  org.picocontainer.defaults.ComponentParameter(java.lang.Class), public  
org.picocontainer.defaults.ComponentParameter(ja
va.lang.Object)] for arguments: []
     [junit]     at  
groovy.lang.MetaClass.chooseMethod(MetaClass.java:1104)
     [junit]     at  
groovy.lang.MetaClass.invokeConstructor(MetaClass.java:323)
     [junit]     at  
org.codehaus.groovy.runtime.Invoker.invokeConstructorOf(Invoker.java: 
148)
     [junit]     at  
org.codehaus.groovy.runtime.InvokerHelper.invokeConstructorOf(InvokerHel 
per.java:120)
     [junit]     at nanocontainer.run(nanocontainer.groovy:202)
     [junit]     at  
org.nanocontainer.script.groovy.GroovyContainerBuilder.createContainer(G 
roovyContainerBuilder.java:57
)
     [junit]     at  
org.nanocontainer.integrationkit.LifecycleContainerBuilder.buildContaine 
r(LifecycleContainerBuilder.j
ava:25)
     [junit]     at  
org.nanocontainer.NanoContainer.<init>(NanoContainer.java:88)
     [junit]     at  
org.nanocontainer.NanoContainer.<init>(NanoContainer.java:59)
     [junit]     at  
org.apache.jetspeed.components.ComponentManager.<init>(ComponentManager. 
java:77)
     [junit]     at  
org.apache.jetspeed.engine.JetspeedEngine.initComponents(JetspeedEngine. 
java:288)
     [junit]     at  
org.apache.jetspeed.engine.JetspeedEngine.init(JetspeedEngine.java:116)
     [junit]     ... 11 more
     [junit] org.apache.jetspeed.exception.JetspeedException: Unable to  
create Engine
     [junit]     at  
org.apache.jetspeed.Jetspeed.createEngine(Jetspeed.java:70)
     [junit]     at  
org.apache.jetspeed.test.JetspeedTestSuite.startEngine(JetspeedTestSuite 
.java:104)
     [junit]     at  
org.apache.jetspeed.test.JetspeedTestSuite.<init>(JetspeedTestSuite.java 
:76)
     [junit]     at  
org.apache.jetspeed.om.page.TestPageObjectModel.suite(TestPageObjectMode 
l.java:71)
     [junit]     at sun.reflect.NativeMethodAccessorImpl.invoke0(Native  
Method)
     [junit]     at  
sun.reflect.NativeMethodAccessorImpl.invoke(NativeMethodAccessorImpl.jav 
a:39)
     [junit]     at  
sun.reflect.DelegatingMethodAccessorImpl.invoke(DelegatingMethodAccessor 
Impl.java:25)
     [junit]     at java.lang.reflect.Method.invoke(Method.java:324)
     [junit]     at  
org.apache.tools.ant.taskdefs.optional.junit.JUnitTestRunner.<init>(JUni 
tTestRunner.java:257)
     [junit]     at  
org.apache.tools.ant.taskdefs.optional.junit.JUnitTestRunner.<init>(JUni 
tTestRunner.java:210)
     [junit]     at  
org.apache.tools.ant.taskdefs.optional.junit.JUnitTestRunner.main(JUnitT 
estRunner.java:532)
     [junit] Caused by: org.apache.jetspeed.exception.JetspeedException:  
Jetspeed Initialization exception!
     [junit]     at  
org.apache.jetspeed.engine.JetspeedEngine.init(JetspeedEngine.java:138)
     [junit]     at  
org.apache.jetspeed.Jetspeed.createEngine(Jetspeed.java:60)
     [junit]     ... 10 more
     [junit] Caused by: groovy.lang.GroovyRuntimeException: Could not  
find which method to invoke from this list: [public
  org.picocontainer.defaults.ComponentParameter(java.lang.Class), public  
org.picocontainer.defaults.ComponentParameter(ja
va.lang.Object)] for arguments: []
     [junit]     at  
groovy.lang.MetaClass.chooseMethod(MetaClass.java:1104)
     [junit]     at  
groovy.lang.MetaClass.invokeConstructor(MetaClass.java:323)
     [junit]     at  
org.codehaus.groovy.runtime.Invoker.invokeConstructorOf(Invoker.java: 
148)
     [junit]     at  
org.codehaus.groovy.runtime.InvokerHelper.invokeConstructorOf(InvokerHel 
per.java:120)
     [junit]     at nanocontainer.run(nanocontainer.groovy:202)
     [junit]     at  
org.nanocontainer.script.groovy.GroovyContainerBuilder.createContainer(G 
roovyContainerBuilder.java:57
)
     [junit]     at  
org.nanocontainer.integrationkit.LifecycleContainerBuilder.buildContaine 
r(LifecycleContainerBuilder.j
ava:25)
     [junit]     at  
org.nanocontainer.NanoContainer.<init>(NanoContainer.java:88)
     [junit]     at  
org.nanocontainer.NanoContainer.<init>(NanoContainer.java:59)
     [junit]     at  
org.apache.jetspeed.components.ComponentManager.<init>(ComponentManager. 
java:77)
     [junit]     at  
org.apache.jetspeed.engine.JetspeedEngine.initComponents(JetspeedEngine. 
java:288)
     [junit]     at  
org.apache.jetspeed.engine.JetspeedEngine.init(JetspeedEngine.java:116)
     [junit]     ... 11 more
     [junit] Tests run: 2, Failures: 0, Errors: 0, Time elapsed: 0.441  
sec
     [junit] Running org.apache.jetspeed.page.TestCastorXmlPageManager
     [junit] Tests run: 8, Failures: 0, Errors: 0, Time elapsed: 4.207  
sec
     [junit] Running org.apache.jetspeed.page.TestDatabasePageManager
     [junit] Tests run: 1, Failures: 0, Errors: 0, Time elapsed: 1.633  
sec
     [junit] Running org.apache.jetspeed.pipeline.TestPipeline
     [junit] log4j:WARN No appenders could be found for logger  
(org.apache.jetspeed.Jetspeed).
     [junit] log4j:WARN Please initialize the log4j system properly.
     [junit] cn=org.nanocontainer.script.groovy.GroovyContainerBuilder
     [junit] cn=org.nanocontainer.script.groovy.GroovyContainerBuilder
     [junit] cn=org.nanocontainer.script.groovy.GroovyContainerBuilder
     [junit] cn=org.nanocontainer.script.groovy.GroovyContainerBuilder
     [junit] cn=org.nanocontainer.script.groovy.GroovyContainerBuilder
     [junit] cn=org.nanocontainer.script.groovy.GroovyContainerBuilder
     [junit] cn=org.nanocontainer.script.groovy.GroovyContainerBuilder
     [junit] groovy.lang.GroovyRuntimeException: Could not find which  
method to invoke from this list: [public org.picoco
ntainer.defaults.ComponentParameter(java.lang.Class), public  
org.picocontainer.defaults.ComponentParameter(java.lang.Obj
ect)] for arguments: []
     [junit]     at  
groovy.lang.MetaClass.chooseMethod(MetaClass.java:1104)
     [junit]     at  
groovy.lang.MetaClass.invokeConstructor(MetaClass.java:323)
     [junit]     at  
org.codehaus.groovy.runtime.Invoker.invokeConstructorOf(Invoker.java: 
148)
     [junit]     at  
org.codehaus.groovy.runtime.InvokerHelper.invokeConstructorOf(InvokerHel 
per.java:120)
     [junit]     at nanocontainer.run(nanocontainer.groovy:202)
     [junit]     at  
org.nanocontainer.script.groovy.GroovyContainerBuilder.createContainer(G 
roovyContainerBuilder.java:57
)
     [junit]     at  
org.nanocontainer.integrationkit.LifecycleContainerBuilder.buildContaine 
r(LifecycleContainerBuilder.j
ava:25)
     [junit]     at  
org.nanocontainer.NanoContainer.<init>(NanoContainer.java:88)
     [junit]     at  
org.nanocontainer.NanoContainer.<init>(NanoContainer.java:59)
     [junit]     at  
org.apache.jetspeed.components.ComponentManager.<init>(ComponentManager. 
java:77)
     [junit]     at  
org.apache.jetspeed.engine.JetspeedEngine.initComponents(JetspeedEngine. 
java:288)
     [junit]     at  
org.apache.jetspeed.engine.JetspeedEngine.init(JetspeedEngine.java:116)
     [junit]     at  
org.apache.jetspeed.Jetspeed.createEngine(Jetspeed.java:60)
     [junit]     at  
org.apache.jetspeed.test.JetspeedTestSuite.startEngine(JetspeedTestSuite 
.java:104)
     [junit]     at  
org.apache.jetspeed.test.JetspeedTestSuite.<init>(JetspeedTestSuite.java 
:76)
     [junit]     at  
org.apache.jetspeed.pipeline.TestPipeline.suite(TestPipeline.java:66)
     [junit]     at sun.reflect.NativeMethodAccessorImpl.invoke0(Native  
Method)
     [junit]     at  
sun.reflect.NativeMethodAccessorImpl.invoke(NativeMethodAccessorImpl.jav 
a:39)
     [junit]     at  
sun.reflect.DelegatingMethodAccessorImpl.invoke(DelegatingMethodAccessor 
Impl.java:25)
     [junit]     at java.lang.reflect.Method.invoke(Method.java:324)
     [junit]     at  
org.apache.tools.ant.taskdefs.optional.junit.JUnitTestRunner.<init>(JUni 
tTestRunner.java:257)
     [junit]     at  
org.apache.tools.ant.taskdefs.optional.junit.JUnitTestRunner.<init>(JUni 
tTestRunner.java:210)
     [junit]     at  
org.apache.tools.ant.taskdefs.optional.junit.JUnitTestRunner.main(JUnitT 
estRunner.java:532)
     [junit] org.apache.jetspeed.exception.JetspeedException: Jetspeed  
Initialization exception!
     [junit]     at  
org.apache.jetspeed.engine.JetspeedEngine.init(JetspeedEngine.java:138)
     [junit]     at  
org.apache.jetspeed.Jetspeed.createEngine(Jetspeed.java:60)
     [junit]     at  
org.apache.jetspeed.test.JetspeedTestSuite.startEngine(JetspeedTestSuite 
.java:104)
     [junit]     at  
org.apache.jetspeed.test.JetspeedTestSuite.<init>(JetspeedTestSuite.java 
:76)
     [junit]     at  
org.apache.jetspeed.pipeline.TestPipeline.suite(TestPipeline.java:66)
     [junit]     at sun.reflect.NativeMethodAccessorImpl.invoke0(Native  
Method)
     [junit]     at  
sun.reflect.NativeMethodAccessorImpl.invoke(NativeMethodAccessorImpl.jav 
a:39)
     [junit]     at  
sun.reflect.DelegatingMethodAccessorImpl.invoke(DelegatingMethodAccessor 
Impl.java:25)
     [junit]     at java.lang.reflect.Method.invoke(Method.java:324)
     [junit]     at  
org.apache.tools.ant.taskdefs.optional.junit.JUnitTestRunner.<init>(JUni 
tTestRunner.java:257)
     [junit]     at  
org.apache.tools.ant.taskdefs.optional.junit.JUnitTestRunner.<init>(JUni 
tTestRunner.java:210)
     [junit]     at  
org.apache.tools.ant.taskdefs.optional.junit.JUnitTestRunner.main(JUnitT 
estRunner.java:532)
     [junit] Caused by: groovy.lang.GroovyRuntimeException: Could not  
find which method to invoke from this list: [public
  org.picocontainer.defaults.ComponentParameter(java.lang.Class), public  
org.picocontainer.defaults.ComponentParameter(ja
va.lang.Object)] for arguments: []
     [junit]     at  
groovy.lang.MetaClass.chooseMethod(MetaClass.java:1104)
     [junit]     at  
groovy.lang.MetaClass.invokeConstructor(MetaClass.java:323)
     [junit]     at  
org.codehaus.groovy.runtime.Invoker.invokeConstructorOf(Invoker.java: 
148)
     [junit]     at  
org.codehaus.groovy.runtime.InvokerHelper.invokeConstructorOf(InvokerHel 
per.java:120)
     [junit]     at nanocontainer.run(nanocontainer.groovy:202)
     [junit]     at  
org.nanocontainer.script.groovy.GroovyContainerBuilder.createContainer(G 
roovyContainerBuilder.java:57
)
     [junit]     at  
org.nanocontainer.integrationkit.LifecycleContainerBuilder.buildContaine 
r(LifecycleContainerBuilder.j
ava:25)
     [junit]     at  
org.nanocontainer.NanoContainer.<init>(NanoContainer.java:88)
     [junit]     at  
org.nanocontainer.NanoContainer.<init>(NanoContainer.java:59)
     [junit]     at  
org.apache.jetspeed.components.ComponentManager.<init>(ComponentManager. 
java:77)
     [junit]     at  
org.apache.jetspeed.engine.JetspeedEngine.initComponents(JetspeedEngine. 
java:288)
     [junit]     at  
org.apache.jetspeed.engine.JetspeedEngine.init(JetspeedEngine.java:116)
     [junit]     ... 11 more
     [junit] org.apache.jetspeed.exception.JetspeedException: Unable to  
create Engine
     [junit]     at  
org.apache.jetspeed.Jetspeed.createEngine(Jetspeed.java:70)
     [junit]     at  
org.apache.jetspeed.test.JetspeedTestSuite.startEngine(JetspeedTestSuite 
.java:104)
     [junit]     at  
org.apache.jetspeed.test.JetspeedTestSuite.<init>(JetspeedTestSuite.java 
:76)
     [junit]     at  
org.apache.jetspeed.pipeline.TestPipeline.suite(TestPipeline.java:66)
     [junit]     at sun.reflect.NativeMethodAccessorImpl.invoke0(Native  
Method)
     [junit]     at  
sun.reflect.NativeMethodAccessorImpl.invoke(NativeMethodAccessorImpl.jav 
a:39)
     [junit]     at  
sun.reflect.DelegatingMethodAccessorImpl.invoke(DelegatingMethodAccessor 
Impl.java:25)
     [junit]     at java.lang.reflect.Method.invoke(Method.java:324)
     [junit]     at  
org.apache.tools.ant.taskdefs.optional.junit.JUnitTestRunner.<init>(JUni 
tTestRunner.java:257)
     [junit]     at  
org.apache.tools.ant.taskdefs.optional.junit.JUnitTestRunner.<init>(JUni 
tTestRunner.java:210)
     [junit]     at  
org.apache.tools.ant.taskdefs.optional.junit.JUnitTestRunner.main(JUnitT 
estRunner.java:532)
     [junit] Caused by: org.apache.jetspeed.exception.JetspeedException:  
Jetspeed Initialization exception!
     [junit]     at  
org.apache.jetspeed.engine.JetspeedEngine.init(JetspeedEngine.java:138)
     [junit]     at  
org.apache.jetspeed.Jetspeed.createEngine(Jetspeed.java:60)
     [junit]     ... 10 more
     [junit] Caused by: groovy.lang.GroovyRuntimeException: Could not  
find which method to invoke from this list: [public
  org.picocontainer.defaults.ComponentParameter(java.lang.Class), public  
org.picocontainer.defaults.ComponentParameter(ja
va.lang.Object)] for arguments: []
     [junit]     at  
groovy.lang.MetaClass.chooseMethod(MetaClass.java:1104)
     [junit]     at  
groovy.lang.MetaClass.invokeConstructor(MetaClass.java:323)
     [junit]     at  
org.codehaus.groovy.runtime.Invoker.invokeConstructorOf(Invoker.java: 
148)
     [junit]     at  
org.codehaus.groovy.runtime.InvokerHelper.invokeConstructorOf(InvokerHel 
per.java:120)
     [junit]     at nanocontainer.run(nanocontainer.groovy:202)
     [junit]     at  
org.nanocontainer.script.groovy.GroovyContainerBuilder.createContainer(G 
roovyContainerBuilder.java:57
)
     [junit]     at  
org.nanocontainer.integrationkit.LifecycleContainerBuilder.buildContaine 
r(LifecycleContainerBuilder.j
ava:25)
     [junit]     at  
org.nanocontainer.NanoContainer.<init>(NanoContainer.java:88)
     [junit]     at  
org.nanocontainer.NanoContainer.<init>(NanoContainer.java:59)
     [junit]     at  
org.apache.jetspeed.components.ComponentManager.<init>(ComponentManager. 
java:77)
     [junit]     at  
org.apache.jetspeed.engine.JetspeedEngine.initComponents(JetspeedEngine. 
java:288)
     [junit]     at  
org.apache.jetspeed.engine.JetspeedEngine.init(JetspeedEngine.java:116)
     [junit]     ... 11 more
     [junit] Tests run: 1, Failures: 1, Errors: 0, Time elapsed: 0.441  
sec
     [junit] [ERROR] TEST org.apache.jetspeed.pipeline.TestPipeline  
FAILED
     [junit] Running org.apache.jetspeed.profiler.TestProfiler
     [junit] Tests run: 4, Failures: 0, Errors: 0, Time elapsed: 4.646  
sec
     [junit] Running org.apache.jetspeed.services.jmx.TestJMX
     [junit] log4j:WARN No appenders could be found for logger  
(org.apache.jetspeed.Jetspeed).
     [junit] log4j:WARN Please initialize the log4j system properly.
     [junit] cn=org.nanocontainer.script.groovy.GroovyContainerBuilder
     [junit] cn=org.nanocontainer.script.groovy.GroovyContainerBuilder
     [junit] cn=org.nanocontainer.script.groovy.GroovyContainerBuilder
     [junit] cn=org.nanocontainer.script.groovy.GroovyContainerBuilder
     [junit] cn=org.nanocontainer.script.groovy.GroovyContainerBuilder
     [junit] cn=org.nanocontainer.script.groovy.GroovyContainerBuilder
     [junit] cn=org.nanocontainer.script.groovy.GroovyContainerBuilder
     [junit] groovy.lang.GroovyRuntimeException: Could not find which  
method to invoke from this list: [public org.picoco
ntainer.defaults.ComponentParameter(java.lang.Class), public  
org.picocontainer.defaults.ComponentParameter(java.lang.Obj
ect)] for arguments: []
     [junit]     at  
groovy.lang.MetaClass.chooseMethod(MetaClass.java:1104)
     [junit]     at  
groovy.lang.MetaClass.invokeConstructor(MetaClass.java:323)
     [junit]     at  
org.codehaus.groovy.runtime.Invoker.invokeConstructorOf(Invoker.java: 
148)
     [junit]     at  
org.codehaus.groovy.runtime.InvokerHelper.invokeConstructorOf(InvokerHel 
per.java:120)
     [junit]     at nanocontainer.run(nanocontainer.groovy:202)
     [junit]     at  
org.nanocontainer.script.groovy.GroovyContainerBuilder.createContainer(G 
roovyContainerBuilder.java:57
)
     [junit]     at  
org.nanocontainer.integrationkit.LifecycleContainerBuilder.buildContaine 
r(LifecycleContainerBuilder.j
ava:25)
     [junit]     at  
org.nanocontainer.NanoContainer.<init>(NanoContainer.java:88)
     [junit]     at  
org.nanocontainer.NanoContainer.<init>(NanoContainer.java:59)
     [junit]     at  
org.apache.jetspeed.components.ComponentManager.<init>(ComponentManager. 
java:77)
     [junit]     at  
org.apache.jetspeed.engine.JetspeedEngine.initComponents(JetspeedEngine. 
java:288)
     [junit]     at  
org.apache.jetspeed.engine.JetspeedEngine.init(JetspeedEngine.java:116)
     [junit]     at  
org.apache.jetspeed.Jetspeed.createEngine(Jetspeed.java:60)
     [junit]     at  
org.apache.jetspeed.test.JetspeedTestSuite.startEngine(JetspeedTestSuite 
.java:104)
     [junit]     at  
org.apache.jetspeed.test.JetspeedTestSuite.<init>(JetspeedTestSuite.java 
:76)
     [junit]     at  
org.apache.jetspeed.services.jmx.TestJMX.suite(TestJMX.java:75)
     [junit]     at sun.reflect.NativeMethodAccessorImpl.invoke0(Native  
Method)
     [junit]     at  
sun.reflect.NativeMethodAccessorImpl.invoke(NativeMethodAccessorImpl.jav 
a:39)
     [junit]     at  
sun.reflect.DelegatingMethodAccessorImpl.invoke(DelegatingMethodAccessor 
Impl.java:25)
     [junit]     at java.lang.reflect.Method.invoke(Method.java:324)
     [junit]     at  
org.apache.tools.ant.taskdefs.optional.junit.JUnitTestRunner.<init>(JUni 
tTestRunner.java:257)
     [junit]     at  
org.apache.tools.ant.taskdefs.optional.junit.JUnitTestRunner.<init>(JUni 
tTestRunner.java:210)
     [junit]     at  
org.apache.tools.ant.taskdefs.optional.junit.JUnitTestRunner.main(JUnitT 
estRunner.java:532)
     [junit] org.apache.jetspeed.exception.JetspeedException: Jetspeed  
Initialization exception!
     [junit]     at  
org.apache.jetspeed.engine.JetspeedEngine.init(JetspeedEngine.java:138)
     [junit]     at  
org.apache.jetspeed.Jetspeed.createEngine(Jetspeed.java:60)
     [junit]     at  
org.apache.jetspeed.test.JetspeedTestSuite.startEngine(JetspeedTestSuite 
.java:104)
     [junit]     at  
org.apache.jetspeed.test.JetspeedTestSuite.<init>(JetspeedTestSuite.java 
:76)
     [junit]     at  
org.apache.jetspeed.services.jmx.TestJMX.suite(TestJMX.java:75)
     [junit]     at sun.reflect.NativeMethodAccessorImpl.invoke0(Native  
Method)
     [junit]     at  
sun.reflect.NativeMethodAccessorImpl.invoke(NativeMethodAccessorImpl.jav 
a:39)
     [junit]     at  
sun.reflect.DelegatingMethodAccessorImpl.invoke(DelegatingMethodAccessor 
Impl.java:25)
     [junit]     at java.lang.reflect.Method.invoke(Method.java:324)
     [junit]     at  
org.apache.tools.ant.taskdefs.optional.junit.JUnitTestRunner.<init>(JUni 
tTestRunner.java:257)
     [junit]     at  
org.apache.tools.ant.taskdefs.optional.junit.JUnitTestRunner.<init>(JUni 
tTestRunner.java:210)
     [junit]     at  
org.apache.tools.ant.taskdefs.optional.junit.JUnitTestRunner.main(JUnitT 
estRunner.java:532)
     [junit] Caused by: groovy.lang.GroovyRuntimeException: Could not  
find which method to invoke from this list: [public
  org.picocontainer.defaults.ComponentParameter(java.lang.Class), public  
org.picocontainer.defaults.ComponentParameter(ja
va.lang.Object)] for arguments: []
     [junit]     at  
groovy.lang.MetaClass.chooseMethod(MetaClass.java:1104)
     [junit]     at  
groovy.lang.MetaClass.invokeConstructor(MetaClass.java:323)
     [junit]     at  
org.codehaus.groovy.runtime.Invoker.invokeConstructorOf(Invoker.java: 
148)
     [junit]     at  
org.codehaus.groovy.runtime.InvokerHelper.invokeConstructorOf(InvokerHel 
per.java:120)
     [junit]     at nanocontainer.run(nanocontainer.groovy:202)
     [junit]     at  
org.nanocontainer.script.groovy.GroovyContainerBuilder.createContainer(G 
roovyContainerBuilder.java:57
)
     [junit]     at  
org.nanocontainer.integrationkit.LifecycleContainerBuilder.buildContaine 
r(LifecycleContainerBuilder.j
ava:25)
     [junit]     at  
org.nanocontainer.NanoContainer.<init>(NanoContainer.java:88)
     [junit]     at  
org.nanocontainer.NanoContainer.<init>(NanoContainer.java:59)
     [junit]     at  
org.apache.jetspeed.components.ComponentManager.<init>(ComponentManager. 
java:77)
     [junit]     at  
org.apache.jetspeed.engine.JetspeedEngine.initComponents(JetspeedEngine. 
java:288)
     [junit]     at  
org.apache.jetspeed.engine.JetspeedEngine.init(JetspeedEngine.java:116)
     [junit]     ... 11 more
     [junit] org.apache.jetspeed.exception.JetspeedException: Unable to  
create Engine
     [junit]     at  
org.apache.jetspeed.Jetspeed.createEngine(Jetspeed.java:70)
     [junit]     at  
org.apache.jetspeed.test.JetspeedTestSuite.startEngine(JetspeedTestSuite 
.java:104)
     [junit]     at  
org.apache.jetspeed.test.JetspeedTestSuite.<init>(JetspeedTestSuite.java 
:76)
     [junit]     at  
org.apache.jetspeed.services.jmx.TestJMX.suite(TestJMX.java:75)
     [junit]     at sun.reflect.NativeMethodAccessorImpl.invoke0(Native  
Method)
     [junit]     at  
sun.reflect.NativeMethodAccessorImpl.invoke(NativeMethodAccessorImpl.jav 
a:39)
     [junit]     at  
sun.reflect.DelegatingMethodAccessorImpl.invoke(DelegatingMethodAccessor 
Impl.java:25)
     [junit]     at java.lang.reflect.Method.invoke(Method.java:324)
     [junit]     at  
org.apache.tools.ant.taskdefs.optional.junit.JUnitTestRunner.<init>(JUni 
tTestRunner.java:257)
     [junit]     at  
org.apache.tools.ant.taskdefs.optional.junit.JUnitTestRunner.<init>(JUni 
tTestRunner.java:210)
     [junit]     at  
org.apache.tools.ant.taskdefs.optional.junit.JUnitTestRunner.main(JUnitT 
estRunner.java:532)
     [junit] Caused by: org.apache.jetspeed.exception.JetspeedException:  
Jetspeed Initialization exception!
     [junit]     at  
org.apache.jetspeed.engine.JetspeedEngine.init(JetspeedEngine.java:138)
     [junit]     at  
org.apache.jetspeed.Jetspeed.createEngine(Jetspeed.java:60)
     [junit]     ... 10 more
     [junit] Caused by: groovy.lang.GroovyRuntimeException: Could not  
find which method to invoke from this list: [public
  org.picocontainer.defaults.ComponentParameter(java.lang.Class), public  
org.picocontainer.defaults.ComponentParameter(ja
va.lang.Object)] for arguments: []
     [junit]     at  
groovy.lang.MetaClass.chooseMethod(MetaClass.java:1104)
     [junit]     at  
groovy.lang.MetaClass.invokeConstructor(MetaClass.java:323)
     [junit]     at  
org.codehaus.groovy.runtime.Invoker.invokeConstructorOf(Invoker.java: 
148)
     [junit]     at  
org.codehaus.groovy.runtime.InvokerHelper.invokeConstructorOf(InvokerHel 
per.java:120)
     [junit]     at nanocontainer.run(nanocontainer.groovy:202)
     [junit]     at  
org.nanocontainer.script.groovy.GroovyContainerBuilder.createContainer(G 
roovyContainerBuilder.java:57
)
     [junit]     at  
org.nanocontainer.integrationkit.LifecycleContainerBuilder.buildContaine 
r(LifecycleContainerBuilder.j
ava:25)
     [junit]     at  
org.nanocontainer.NanoContainer.<init>(NanoContainer.java:88)
     [junit]     at  
org.nanocontainer.NanoContainer.<init>(NanoContainer.java:59)
     [junit]     at  
org.apache.jetspeed.components.ComponentManager.<init>(ComponentManager. 
java:77)
     [junit]     at  
org.apache.jetspeed.engine.JetspeedEngine.initComponents(JetspeedEngine. 
java:288)
     [junit]     at  
org.apache.jetspeed.engine.JetspeedEngine.init(JetspeedEngine.java:116)
     [junit]     ... 11 more
     [junit] Tests run: 2, Failures: 0, Errors: 0, Time elapsed: 0.431  
sec
     [junit] Running  
org.apache.jetspeed.tools.pamanager.TestJetspeedPortletDescriptor
     [junit] Tests run: 1, Failures: 0, Errors: 0, Time elapsed: 2.914  
sec
     [junit] Running  
org.apache.jetspeed.tools.pamanager.TestPortletDescriptor
     [junit] Tests run: 2, Failures: 0, Errors: 0, Time elapsed: 4.967  
sec
     [junit] Running  
org.apache.jetspeed.tools.pamanager.TestPortletDescriptorSecurityRoles
     [junit] Tests run: 1, Failures: 0, Errors: 0, Time elapsed: 4.517  
sec
     [junit] Running org.apache.jetspeed.tools.TestWebXML
     [junit] log4j:WARN No appenders could be found for logger  
(org.apache.jetspeed.Jetspeed).
     [junit] log4j:WARN Please initialize the log4j system properly.
     [junit] cn=org.nanocontainer.script.groovy.GroovyContainerBuilder
     [junit] cn=org.nanocontainer.script.groovy.GroovyContainerBuilder
     [junit] cn=org.nanocontainer.script.groovy.GroovyContainerBuilder
     [junit] cn=org.nanocontainer.script.groovy.GroovyContainerBuilder
     [junit] cn=org.nanocontainer.script.groovy.GroovyContainerBuilder
     [junit] cn=org.nanocontainer.script.groovy.GroovyContainerBuilder
     [junit] cn=org.nanocontainer.script.groovy.GroovyContainerBuilder
     [junit] groovy.lang.GroovyRuntimeException: Could not find which  
method to invoke from this list: [public org.picoco
ntainer.defaults.ComponentParameter(java.lang.Class), public  
org.picocontainer.defaults.ComponentParameter(java.lang.Obj
ect)] for arguments: []
     [junit]     at  
groovy.lang.MetaClass.chooseMethod(MetaClass.java:1104)
     [junit]     at  
groovy.lang.MetaClass.invokeConstructor(MetaClass.java:323)
     [junit]     at  
org.codehaus.groovy.runtime.Invoker.invokeConstructorOf(Invoker.java: 
148)
     [junit]     at  
org.codehaus.groovy.runtime.InvokerHelper.invokeConstructorOf(InvokerHel 
per.java:120)
     [junit]     at nanocontainer.run(nanocontainer.groovy:202)
     [junit]     at  
org.nanocontainer.script.groovy.GroovyContainerBuilder.createContainer(G 
roovyContainerBuilder.java:57
)
     [junit]     at  
org.nanocontainer.integrationkit.LifecycleContainerBuilder.buildContaine 
r(LifecycleContainerBuilder.j
ava:25)
     [junit]     at  
org.nanocontainer.NanoContainer.<init>(NanoContainer.java:88)
     [junit]     at  
org.nanocontainer.NanoContainer.<init>(NanoContainer.java:59)
     [junit]     at  
org.apache.jetspeed.components.ComponentManager.<init>(ComponentManager. 
java:77)
     [junit]     at  
org.apache.jetspeed.engine.JetspeedEngine.initComponents(JetspeedEngine. 
java:288)
     [junit]     at  
org.apache.jetspeed.engine.JetspeedEngine.init(JetspeedEngine.java:116)
     [junit]     at  
org.apache.jetspeed.Jetspeed.createEngine(Jetspeed.java:60)
     [junit]     at  
org.apache.jetspeed.test.JetspeedTestSuite.startEngine(JetspeedTestSuite 
.java:104)
     [junit]     at  
org.apache.jetspeed.test.JetspeedTestSuite.<init>(JetspeedTestSuite.java 
:76)
     [junit]     at  
org.apache.jetspeed.tools.TestWebXML.suite(TestWebXML.java:47)
     [junit]     at sun.reflect.NativeMethodAccessorImpl.invoke0(Native  
Method)
     [junit]     at  
sun.reflect.NativeMethodAccessorImpl.invoke(NativeMethodAccessorImpl.jav 
a:39)
     [junit]     at  
sun.reflect.DelegatingMethodAccessorImpl.invoke(DelegatingMethodAccessor 
Impl.java:25)
     [junit]     at java.lang.reflect.Method.invoke(Method.java:324)
     [junit]     at  
org.apache.tools.ant.taskdefs.optional.junit.JUnitTestRunner.<init>(JUni 
tTestRunner.java:257)
     [junit]     at  
org.apache.tools.ant.taskdefs.optional.junit.JUnitTestRunner.<init>(JUni 
tTestRunner.java:210)
     [junit]     at  
org.apache.tools.ant.taskdefs.optional.junit.JUnitTestRunner.main(JUnitT 
estRunner.java:532)
     [junit] org.apache.jetspeed.exception.JetspeedException: Jetspeed  
Initialization exception!
     [junit]     at  
org.apache.jetspeed.engine.JetspeedEngine.init(JetspeedEngine.java:138)
     [junit]     at  
org.apache.jetspeed.Jetspeed.createEngine(Jetspeed.java:60)
     [junit]     at  
org.apache.jetspeed.test.JetspeedTestSuite.startEngine(JetspeedTestSuite 
.java:104)
     [junit]     at  
org.apache.jetspeed.test.JetspeedTestSuite.<init>(JetspeedTestSuite.java 
:76)
     [junit]     at  
org.apache.jetspeed.tools.TestWebXML.suite(TestWebXML.java:47)
     [junit]     at sun.reflect.NativeMethodAccessorImpl.invoke0(Native  
Method)
     [junit]     at  
sun.reflect.NativeMethodAccessorImpl.invoke(NativeMethodAccessorImpl.jav 
a:39)
     [junit]     at  
sun.reflect.DelegatingMethodAccessorImpl.invoke(DelegatingMethodAccessor 
Impl.java:25)
     [junit]     at java.lang.reflect.Method.invoke(Method.java:324)
     [junit]     at  
org.apache.tools.ant.taskdefs.optional.junit.JUnitTestRunner.<init>(JUni 
tTestRunner.java:257)
     [junit]     at  
org.apache.tools.ant.taskdefs.optional.junit.JUnitTestRunner.<init>(JUni 
tTestRunner.java:210)
     [junit]     at  
org.apache.tools.ant.taskdefs.optional.junit.JUnitTestRunner.main(JUnitT 
estRunner.java:532)
     [junit] Caused by: groovy.lang.GroovyRuntimeException: Could not  
find which method to invoke from this list: [public
  org.picocontainer.defaults.ComponentParameter(java.lang.Class), public  
org.picocontainer.defaults.ComponentParameter(ja
va.lang.Object)] for arguments: []
     [junit]     at  
groovy.lang.MetaClass.chooseMethod(MetaClass.java:1104)
     [junit]     at  
groovy.lang.MetaClass.invokeConstructor(MetaClass.java:323)
     [junit]     at  
org.codehaus.groovy.runtime.Invoker.invokeConstructorOf(Invoker.java: 
148)
     [junit]     at  
org.codehaus.groovy.runtime.InvokerHelper.invokeConstructorOf(InvokerHel 
per.java:120)
     [junit]     at nanocontainer.run(nanocontainer.groovy:202)
     [junit]     at  
org.nanocontainer.script.groovy.GroovyContainerBuilder.createContainer(G 
roovyContainerBuilder.java:57
)
     [junit]     at  
org.nanocontainer.integrationkit.LifecycleContainerBuilder.buildContaine 
r(LifecycleContainerBuilder.j
ava:25)
     [junit]     at  
org.nanocontainer.NanoContainer.<init>(NanoContainer.java:88)
     [junit]     at  
org.nanocontainer.NanoContainer.<init>(NanoContainer.java:59)
     [junit]     at  
org.apache.jetspeed.components.ComponentManager.<init>(ComponentManager. 
java:77)
     [junit]     at  
org.apache.jetspeed.engine.JetspeedEngine.initComponents(JetspeedEngine. 
java:288)
     [junit]     at  
org.apache.jetspeed.engine.JetspeedEngine.init(JetspeedEngine.java:116)
     [junit]     ... 11 more
     [junit] org.apache.jetspeed.exception.JetspeedException: Unable to  
create Engine
     [junit]     at  
org.apache.jetspeed.Jetspeed.createEngine(Jetspeed.java:70)
     [junit]     at  
org.apache.jetspeed.test.JetspeedTestSuite.startEngine(JetspeedTestSuite 
.java:104)
     [junit]     at  
org.apache.jetspeed.test.JetspeedTestSuite.<init>(JetspeedTestSuite.java 
:76)
     [junit]     at  
org.apache.jetspeed.tools.TestWebXML.suite(TestWebXML.java:47)
     [junit]     at sun.reflect.NativeMethodAccessorImpl.invoke0(Native  
Method)
     [junit]     at  
sun.reflect.NativeMethodAccessorImpl.invoke(NativeMethodAccessorImpl.jav 
a:39)
     [junit]     at  
sun.reflect.DelegatingMethodAccessorImpl.invoke(DelegatingMethodAccessor 
Impl.java:25)
     [junit]     at java.lang.reflect.Method.invoke(Method.java:324)
     [junit]     at  
org.apache.tools.ant.taskdefs.optional.junit.JUnitTestRunner.<init>(JUni 
tTestRunner.java:257)
     [junit]     at  
org.apache.tools.ant.taskdefs.optional.junit.JUnitTestRunner.<init>(JUni 
tTestRunner.java:210)
     [junit]     at  
org.apache.tools.ant.taskdefs.optional.junit.JUnitTestRunner.main(JUnitT 
estRunner.java:532)
     [junit] Caused by: org.apache.jetspeed.exception.JetspeedException:  
Jetspeed Initialization exception!
     [junit]     at  
org.apache.jetspeed.engine.JetspeedEngine.init(JetspeedEngine.java:138)
     [junit]     at  
org.apache.jetspeed.Jetspeed.createEngine(Jetspeed.java:60)
     [junit]     ... 10 more
     [junit] Caused by: groovy.lang.GroovyRuntimeException: Could not  
find which method to invoke from this list: [public
  org.picocontainer.defaults.ComponentParameter(java.lang.Class), public  
org.picocontainer.defaults.ComponentParameter(ja
va.lang.Object)] for arguments: []
     [junit]     at  
groovy.lang.MetaClass.chooseMethod(MetaClass.java:1104)
     [junit]     at  
groovy.lang.MetaClass.invokeConstructor(MetaClass.java:323)
     [junit]     at  
org.codehaus.groovy.runtime.Invoker.invokeConstructorOf(Invoker.java: 
148)
     [junit]     at  
org.codehaus.groovy.runtime.InvokerHelper.invokeConstructorOf(InvokerHel 
per.java:120)
     [junit]     at nanocontainer.run(nanocontainer.groovy:202)
     [junit]     at  
org.nanocontainer.script.groovy.GroovyContainerBuilder.createContainer(G 
roovyContainerBuilder.java:57
)
     [junit]     at  
org.nanocontainer.integrationkit.LifecycleContainerBuilder.buildContaine 
r(LifecycleContainerBuilder.j
ava:25)
     [junit]     at  
org.nanocontainer.NanoContainer.<init>(NanoContainer.java:88)
     [junit]     at  
org.nanocontainer.NanoContainer.<init>(NanoContainer.java:59)
     [junit]     at  
org.apache.jetspeed.components.ComponentManager.<init>(ComponentManager. 
java:77)
     [junit]     at  
org.apache.jetspeed.engine.JetspeedEngine.initComponents(JetspeedEngine. 
java:288)
     [junit]     at  
org.apache.jetspeed.engine.JetspeedEngine.init(JetspeedEngine.java:116)
     [junit]     ... 11 more
     [junit] Tests run: 1, Failures: 0, Errors: 0, Time elapsed: 0.501  
sec
     [junit] Running org.apache.jetspeed.userinfo.TestUserInfoManager
     [junit] Tests run: 2, Failures: 0, Errors: 0, Time elapsed: 6.239  
sec

BUILD FAILED
File...... file:/C:/temp/jakarta-jetspeed-2/maven.xml
Element... maven:reactor
Line...... 151
Column.... 40


---------------------------------------------------------------------
To unsubscribe, e-mail: jetspeed-dev-unsubscribe@jakarta.apache.org
For additional commands, e-mail: jetspeed-dev-help@jakarta.apache.org


Mime
View raw message