phoenix-user mailing list archives

Site index · List index
Message view « Date » · « Thread »
Top « Date » · « Thread »
From Divya Gehlot <divya.htco...@gmail.com>
Subject Re: spark 1.6.1 build failure of : scala-maven-plugin
Date Wed, 04 May 2016 03:25:46 GMT
Hi ,
Even I am getting the similar error
Failed to execute goal net.alchim31.maven:scala-maven-plugin:3.2.2:compile
When I tried to build Phoenix Project using maven .
Maven version : 3.3
Java version - 1.7_67
Phoenix - downloaded latest master from Git hub
If anybody find the the resolution please share.


Thanks,
Divya

On 3 May 2016 at 10:18, sunday2000 <2314476218@qq.com> wrote:

> [INFO]
> ------------------------------------------------------------------------
> [INFO] BUILD FAILURE
> [INFO]
> ------------------------------------------------------------------------
> [INFO] Total time: 14.765 s
> [INFO] Finished at: 2016-05-03T10:08:46+08:00
> [INFO] Final Memory: 35M/191M
> [INFO]
> ------------------------------------------------------------------------
> [ERROR] Failed to execute goal
> net.alchim31.maven:scala-maven-plugin:3.2.2:compile (scala-compile-first)
> on project spark-test-tags_2.10: Execution scala-compile-first of goal
> net.alchim31.maven:scala-maven-plugin:3.2.2:compile failed. CompileFailed
> -> [Help 1]
> org.apache.maven.lifecycle.LifecycleExecutionException: Failed to execute
> goal net.alchim31.maven:scala-maven-plugin:3.2.2:compile
> (scala-compile-first) on project spark-test-tags_2.10: Execution
> scala-compile-first of goal
> net.alchim31.maven:scala-maven-plugin:3.2.2:compile failed.
>         at
> org.apache.maven.lifecycle.internal.MojoExecutor.execute(MojoExecutor.java:224)
>         at
> org.apache.maven.lifecycle.internal.MojoExecutor.execute(MojoExecutor.java:153)
>         at
> org.apache.maven.lifecycle.internal.MojoExecutor.execute(MojoExecutor.java:145)
>         at
> org.apache.maven.lifecycle.internal.LifecycleModuleBuilder.buildProject(LifecycleModuleBuilder.java:116)
>         at
> org.apache.maven.lifecycle.internal.LifecycleModuleBuilder.buildProject(LifecycleModuleBuilder.java:80)
>         at
> org.apache.maven.lifecycle.internal.builder.singlethreaded.SingleThreadedBuilder.build(SingleThreadedBuilder.java:51)
>         at
> org.apache.maven.lifecycle.internal.LifecycleStarter.execute(LifecycleStarter.java:128)
>         at org.apache.maven.DefaultMaven.doExecute(DefaultMaven.java:307)
>         at org.apache.maven.DefaultMaven.doExecute(DefaultMaven.java:193)
>         at org.apache.maven.DefaultMaven.execute(DefaultMaven.java:106)
>         at org.apache.maven.cli.MavenCli.execute(MavenCli.java:862)
>         at org.apache.maven.cli.MavenCli.doMain(MavenCli.java:286)
>         at org.apache.maven.cli.MavenCli.main(MavenCli.java:197)
>         at sun.reflect.NativeMethodAccessorImpl.invoke0(Native Method)
>         at
> sun.reflect.NativeMethodAccessorImpl.invoke(NativeMethodAccessorImpl.java:62)
>         at
> sun.reflect.DelegatingMethodAccessorImpl.invoke(DelegatingMethodAccessorImpl.java:43)
>         at java.lang.reflect.Method.invoke(Method.java:498)
>         at
> org.codehaus.plexus.classworlds.launcher.Launcher.launchEnhanced(Launcher.java:289)
>         at
> org.codehaus.plexus.classworlds.launcher.Launcher.launch(Launcher.java:229)
>         at
> org.codehaus.plexus.classworlds.launcher.Launcher.mainWithExitCode(Launcher.java:415)
>         at
> org.codehaus.plexus.classworlds.launcher.Launcher.main(Launcher.java:356)
> Caused by: org.apache.maven.plugin.PluginExecutionException: Execution
> scala-compile-first of goal
> net.alchim31.maven:scala-maven-plugin:3.2.2:compile failed.
>         at
> org.apache.maven.plugin.DefaultBuildPluginManager.executeMojo(DefaultBuildPluginManager.java:145)
>         at
> org.apache.maven.lifecycle.internal.MojoExecutor.execute(MojoExecutor.java:208)
>         ... 20 more
> Caused by: Compile failed via zinc server
>         at
> sbt_inc.SbtIncrementalCompiler.zincCompile(SbtIncrementalCompiler.java:136)
>         at
> sbt_inc.SbtIncrementalCompiler.compile(SbtIncrementalCompiler.java:86)
>         at
> scala_maven.ScalaCompilerSupport.incrementalCompile(ScalaCompilerSupport.java:303)
>         at
> scala_maven.ScalaCompilerSupport.compile(ScalaCompilerSupport.java:119)
>         at
> scala_maven.ScalaCompilerSupport.doExecute(ScalaCompilerSupport.java:99)
>         at scala_maven.ScalaMojoSupport.execute(ScalaMojoSupport.java:482)
>         at
> org.apache.maven.plugin.DefaultBuildPluginManager.executeMojo(DefaultBuildPluginManager.java:134)
>         ... 21 more
> [ERROR]
> [ERROR]
> [ERROR] For more information about the errors and possible solutions,
> please read the following articles:
> [ERROR] [Help 1]
> http://cwiki.apache.org/confluence/display/MAVEN/PluginExecutionException
> [ERROR]
> [ERROR] After correcting the problems, you can resume the build with the
> command
> [ERROR]   mvn <goals> -rf :spark-test-tags_2.10

Mime
View raw message