mesos-reviews mailing list archives

Site index · List index
Message view « Date » · « Thread »
Top « Date » · « Thread »
From Mesos Reviewbot <revi...@mesos.apache.org>
Subject Re: Review Request 71867: WIP: Support for docker containerizer.
Date Fri, 10 Jan 2020 05:39:42 GMT

-----------------------------------------------------------
This is an automatically generated e-mail. To reply, visit:
https://reviews.apache.org/r/71867/#review219203
-----------------------------------------------------------



Bad patch!

Reviews applied: [71947, 71814, 71815, 71816, 71833, 71836, 71853, 71854, 71867]

Failed command: ['bash', '-c', "set -o pipefail; export OS='ubuntu:14.04' BUILDTOOL='autotools' COMPILER='gcc' CONFIGURATION='--verbose --disable-libtool-wrappers --disable-parallel-test-execution' ENVIRONMENT='GLOG_v=1 MESOS_VERBOSE=1'; ./support/docker-build.sh 2>&1 | tee build_71867"]

Error:
...<truncated>...
ed, _Alloc>&)
     operator!=(const unordered_multimap<_Key, _Tp, _Hash, _Pred, _Alloc>& __x,
     ^
/usr/include/c++/4.8/bits/unordered_map.h:1406:5: note:   template argument deduction/substitution failed:
In file included from ../3rdparty/googletest-release-1.8.0/googlemock/include/gmock/internal/gmock-internal-utils.h:47:0,
                 from ../3rdparty/googletest-release-1.8.0/googlemock/include/gmock/gmock-actions.h:46,
                 from ../3rdparty/googletest-release-1.8.0/googlemock/include/gmock/gmock.h:58,
                 from ../../src/tests/containerizer/docker_containerizer_tests.cpp:17:
../3rdparty/googletest-release-1.8.0/googletest/include/gtest/gtest.h:1522:28: note:   'const std::basic_string<char>' is not derived from 'const std::unordered_multimap<_Key, _Tp, _Hash, _Pred, _Alloc>'
 GTEST_IMPL_CMP_HELPER_(NE, !=);
                            ^
../3rdparty/googletest-release-1.8.0/googletest/include/gtest/gtest.h:1510:12: note: in definition of macro 'GTEST_IMPL_CMP_HELPER_'
   if (val1 op val2) {\
            ^
In file included from /usr/include/c++/4.8/unordered_map:48:0,
                 from ../3rdparty/protobuf-3.5.0/src/google/protobuf/stubs/hash.h:146,
                 from ../3rdparty/protobuf-3.5.0/src/google/protobuf/map.h:49,
                 from ../3rdparty/protobuf-3.5.0/src/google/protobuf/generated_message_table_driven.h:34,
                 from ../include/mesos/mesos.pb.h:25,
                 from ../../include/mesos/mesos.hpp:20,
                 from ../../include/mesos/slave/container_logger.hpp:24,
                 from ../../src/tests/containerizer/docker_containerizer_tests.cpp:21:
/usr/include/c++/4.8/bits/unordered_map.h:1394:5: note: template<class _Key, class _Tp, class _Hash, class _Pred, class _Alloc> bool std::operator!=(const std::unordered_map<_Key, _Tp, _Hash, _Pred, _Alloc>&, const std::unordered_map<_Key, _Tp, _Hash, _Pred, _Alloc>&)
     operator!=(const unordered_map<_Key, _Tp, _Hash, _Pred, _Alloc>& __x,
     ^
/usr/include/c++/4.8/bits/unordered_map.h:1394:5: note:   template argument deduction/substitution failed:
In file included from ../3rdparty/googletest-release-1.8.0/googlemock/include/gmock/internal/gmock-internal-utils.h:47:0,
                 from ../3rdparty/googletest-release-1.8.0/googlemock/include/gmock/gmock-actions.h:46,
                 from ../3rdparty/googletest-release-1.8.0/googlemock/include/gmock/gmock.h:58,
                 from ../../src/tests/containerizer/docker_containerizer_tests.cpp:17:
../3rdparty/googletest-release-1.8.0/googletest/include/gtest/gtest.h:1522:28: note:   'const std::basic_string<char>' is not derived from 'const std::unordered_map<_Key, _Tp, _Hash, _Pred, _Alloc>'
 GTEST_IMPL_CMP_HELPER_(NE, !=);
                            ^
../3rdparty/googletest-release-1.8.0/googletest/include/gtest/gtest.h:1510:12: note: in definition of macro 'GTEST_IMPL_CMP_HELPER_'
   if (val1 op val2) {\
            ^
In file included from /usr/include/c++/4.8/iterator:66:0,
                 from ../3rdparty/googletest-release-1.8.0/googletest/include/gtest/internal/gtest-param-util.h:39,
                 from ../3rdparty/googletest-release-1.8.0/googletest/include/gtest/gtest-param-test.h:192,
                 from ../3rdparty/googletest-release-1.8.0/googletest/include/gtest/gtest.h:62,
                 from ../3rdparty/googletest-release-1.8.0/googlemock/include/gmock/internal/gmock-internal-utils.h:47,
                 from ../3rdparty/googletest-release-1.8.0/googlemock/include/gmock/gmock-actions.h:46,
                 from ../3rdparty/googletest-release-1.8.0/googlemock/include/gmock/gmock.h:58,
                 from ../../src/tests/containerizer/docker_containerizer_tests.cpp:17:
/usr/include/c++/4.8/bits/stream_iterator.h:137:5: note: template<class _Tp, class _CharT, class _Traits, class _Dist> bool std::operator!=(const std::istream_iterator<_Tp, _CharT, _Traits, _Dist>&, const std::istream_iterator<_Tp, _CharT, _Traits, _Dist>&)
     operator!=(const istream_iterator<_Tp, _CharT, _Traits, _Dist>& __x,
     ^
/usr/include/c++/4.8/bits/stream_iterator.h:137:5: note:   template argument deduction/substitution failed:
In file included from ../3rdparty/googletest-release-1.8.0/googlemock/include/gmock/internal/gmock-internal-utils.h:47:0,
                 from ../3rdparty/googletest-release-1.8.0/googlemock/include/gmock/gmock-actions.h:46,
                 from ../3rdparty/googletest-release-1.8.0/googlemock/include/gmock/gmock.h:58,
                 from ../../src/tests/containerizer/docker_containerizer_tests.cpp:17:
../3rdparty/googletest-release-1.8.0/googletest/include/gtest/gtest.h:1522:28: note:   'const std::basic_string<char>' is not derived from 'const std::istream_iterator<_Tp, _CharT, _Traits, _Dist>'
 GTEST_IMPL_CMP_HELPER_(NE, !=);
                            ^
../3rdparty/googletest-release-1.8.0/googletest/include/gtest/gtest.h:1510:12: note: in definition of macro 'GTEST_IMPL_CMP_HELPER_'
   if (val1 op val2) {\
            ^
In file included from /usr/include/c++/4.8/set:62:0,
                 from ../3rdparty/googletest-release-1.8.0/googletest/include/gtest/internal/gtest-internal.h:59,
                 from ../3rdparty/googletest-release-1.8.0/googletest/include/gtest/gtest.h:58,
                 from ../3rdparty/googletest-release-1.8.0/googlemock/include/gmock/internal/gmock-internal-utils.h:47,
                 from ../3rdparty/googletest-release-1.8.0/googlemock/include/gmock/gmock-actions.h:46,
                 from ../3rdparty/googletest-release-1.8.0/googlemock/include/gmock/gmock.h:58,
                 from ../../src/tests/containerizer/docker_containerizer_tests.cpp:17:
/usr/include/c++/4.8/bits/stl_multiset.h:763:5: note: template<class _Key, class _Compare, class _Alloc> bool std::operator!=(const std::multiset<_Key, _Compare, _Alloc>&, const std::multiset<_Key, _Compare, _Alloc>&)
     operator!=(const multiset<_Key, _Compare, _Alloc>& __x,
     ^
/usr/include/c++/4.8/bits/stl_multiset.h:763:5: note:   template argument deduction/substitution failed:
In file included from ../3rdparty/googletest-release-1.8.0/googlemock/include/gmock/internal/gmock-internal-utils.h:47:0,
                 from ../3rdparty/googletest-release-1.8.0/googlemock/include/gmock/gmock-actions.h:46,
                 from ../3rdparty/googletest-release-1.8.0/googlemock/include/gmock/gmock.h:58,
                 from ../../src/tests/containerizer/docker_containerizer_tests.cpp:17:
../3rdparty/googletest-release-1.8.0/googletest/include/gtest/gtest.h:1522:28: note:   'const std::basic_string<char>' is not derived from 'const std::multiset<_Key, _Compare, _Alloc>'
 GTEST_IMPL_CMP_HELPER_(NE, !=);
                            ^
../3rdparty/googletest-release-1.8.0/googletest/include/gtest/gtest.h:1510:12: note: in definition of macro 'GTEST_IMPL_CMP_HELPER_'
   if (val1 op val2) {\
            ^
In file included from /usr/include/c++/4.8/set:61:0,
                 from ../3rdparty/googletest-release-1.8.0/googletest/include/gtest/internal/gtest-internal.h:59,
                 from ../3rdparty/googletest-release-1.8.0/googletest/include/gtest/gtest.h:58,
                 from ../3rdparty/googletest-release-1.8.0/googlemock/include/gmock/internal/gmock-internal-utils.h:47,
                 from ../3rdparty/googletest-release-1.8.0/googlemock/include/gmock/gmock-actions.h:46,
                 from ../3rdparty/googletest-release-1.8.0/googlemock/include/gmock/gmock.h:58,
                 from ../../src/tests/containerizer/docker_containerizer_tests.cpp:17:
/usr/include/c++/4.8/bits/stl_set.h:778:5: note: template<class _Key, class _Compare, class _Alloc> bool std::operator!=(const std::set<_Key, _Compare, _Alloc>&, const std::set<_Key, _Compare, _Alloc>&)
     operator!=(const set<_Key, _Compare, _Alloc>& __x,
     ^
/usr/include/c++/4.8/bits/stl_set.h:778:5: note:   template argument deduction/substitution failed:
In file included from ../3rdparty/googletest-release-1.8.0/googlemock/include/gmock/internal/gmock-internal-utils.h:47:0,
                 from ../3rdparty/googletest-release-1.8.0/googlemock/include/gmock/gmock-actions.h:46,
                 from ../3rdparty/googletest-release-1.8.0/googlemock/include/gmock/gmock.h:58,
                 from ../../src/tests/containerizer/docker_containerizer_tests.cpp:17:
../3rdparty/googletest-release-1.8.0/googletest/include/gtest/gtest.h:1522:28: note:   'const std::basic_string<char>' is not derived from 'const std::set<_Key, _Compare, _Alloc>'
 GTEST_IMPL_CMP_HELPER_(NE, !=);
                            ^
../3rdparty/googletest-release-1.8.0/googletest/include/gtest/gtest.h:1510:12: note: in definition of macro 'GTEST_IMPL_CMP_HELPER_'
   if (val1 op val2) {\
            ^
In file included from /usr/include/c++/4.8/map:62:0,
                 from ../3rdparty/googletest-release-1.8.0/googletest/include/gtest/internal/gtest-internal.h:58,
                 from ../3rdparty/googletest-release-1.8.0/googletest/include/gtest/gtest.h:58,
                 from ../3rdparty/googletest-release-1.8.0/googlemock/include/gmock/internal/gmock-internal-utils.h:47,
                 from ../3rdparty/googletest-release-1.8.0/googlemock/include/gmock/gmock-actions.h:46,
                 from ../3rdparty/googletest-release-1.8.0/googlemock/include/gmock/gmock.h:58,
                 from ../../src/tests/containerizer/docker_containerizer_tests.cpp:17:
/usr/include/c++/4.8/bits/stl_multimap.h:888:5: note: template<class _Key, class _Tp, class _Compare, class _Alloc> bool std::operator!=(const std::multimap<_Key, _Tp, _Compare, _Alloc>&, const std::multimap<_Key, _Tp, _Compare, _Alloc>&)
     operator!=(const multimap<_Key, _Tp, _Compare, _Alloc>& __x,
     ^
/usr/include/c++/4.8/bits/stl_multimap.h:888:5: note:   template argument deduction/substitution failed:
In file included from ../3rdparty/googletest-release-1.8.0/googlemock/include/gmock/internal/gmock-internal-utils.h:47:0,
                 from ../3rdparty/googletest-release-1.8.0/googlemock/include/gmock/gmock-actions.h:46,
                 from ../3rdparty/googletest-release-1.8.0/googlemock/include/gmock/gmock.h:58,
                 from ../../src/tests/containerizer/docker_containerizer_tests.cpp:17:
../3rdparty/googletest-release-1.8.0/googletest/include/gtest/gtest.h:1522:28: note:   'const std::basic_string<char>' is not derived from 'const std::multimap<_Key, _Tp, _Compare, _Alloc>'
 GTEST_IMPL_CMP_HELPER_(NE, !=);
                            ^
../3rdparty/googletest-release-1.8.0/googletest/include/gtest/gtest.h:1510:12: note: in definition of macro 'GTEST_IMPL_CMP_HELPER_'
   if (val1 op val2) {\
            ^
In file included from /usr/include/c++/4.8/map:61:0,
                 from ../3rdparty/googletest-release-1.8.0/googletest/include/gtest/internal/gtest-internal.h:58,
                 from ../3rdparty/googletest-release-1.8.0/googletest/include/gtest/gtest.h:58,
                 from ../3rdparty/googletest-release-1.8.0/googlemock/include/gmock/internal/gmock-internal-utils.h:47,
                 from ../3rdparty/googletest-release-1.8.0/googlemock/include/gmock/gmock-actions.h:46,
                 from ../3rdparty/googletest-release-1.8.0/googlemock/include/gmock/gmock.h:58,
                 from ../../src/tests/containerizer/docker_containerizer_tests.cpp:17:
/usr/include/c++/4.8/bits/stl_map.h:986:5: note: template<class _Key, class _Tp, class _Compare, class _Alloc> bool std::operator!=(const std::map<_Key, _Tp, _Compare, _Alloc>&, const std::map<_Key, _Tp, _Compare, _Alloc>&)
     operator!=(const map<_Key, _Tp, _Compare, _Alloc>& __x,
     ^
/usr/include/c++/4.8/bits/stl_map.h:986:5: note:   template argument deduction/substitution failed:
In file included from ../3rdparty/googletest-release-1.8.0/googlemock/include/gmock/internal/gmock-internal-utils.h:47:0,
                 from ../3rdparty/googletest-release-1.8.0/googlemock/include/gmock/gmock-actions.h:46,
                 from ../3rdparty/googletest-release-1.8.0/googlemock/include/gmock/gmock.h:58,
                 from ../../src/tests/containerizer/docker_containerizer_tests.cpp:17:
../3rdparty/googletest-release-1.8.0/googletest/include/gtest/gtest.h:1522:28: note:   'const std::basic_string<char>' is not derived from 'const std::map<_Key, _Tp, _Compare, _Alloc>'
 GTEST_IMPL_CMP_HELPER_(NE, !=);
                            ^
../3rdparty/googletest-release-1.8.0/googletest/include/gtest/gtest.h:1510:12: note: in definition of macro 'GTEST_IMPL_CMP_HELPER_'
   if (val1 op val2) {\
            ^
In file included from /usr/include/c++/4.8/map:60:0,
                 from ../3rdparty/googletest-release-1.8.0/googletest/include/gtest/internal/gtest-internal.h:58,
                 from ../3rdparty/googletest-release-1.8.0/googletest/include/gtest/gtest.h:58,
                 from ../3rdparty/googletest-release-1.8.0/googlemock/include/gmock/internal/gmock-internal-utils.h:47,
                 from ../3rdparty/googletest-release-1.8.0/googlemock/include/gmock/gmock-actions.h:46,
                 from ../3rdparty/googletest-release-1.8.0/googlemock/include/gmock/gmock.h:58,
                 from ../../src/tests/containerizer/docker_containerizer_tests.cpp:17:
/usr/include/c++/4.8/bits/stl_tree.h:927:5: note: template<class _Key, class _Val, class _KeyOfValue, class _Compare, class _Alloc> bool std::operator!=(const std::_Rb_tree<_Key, _Val, _KeyOfValue, _Compare, _Alloc>&, const std::_Rb_tree<_Key, _Val, _KeyOfValue, _Compare, _Alloc>&)
     operator!=(const _Rb_tree<_Key, _Val, _KeyOfValue, _Compare, _Alloc>& __x,
     ^
/usr/include/c++/4.8/bits/stl_tree.h:927:5: note:   template argument deduction/substitution failed:
In file included from ../3rdparty/googletest-release-1.8.0/googlemock/include/gmock/internal/gmock-internal-utils.h:47:0,
                 from ../3rdparty/googletest-release-1.8.0/googlemock/include/gmock/gmock-actions.h:46,
                 from ../3rdparty/googletest-release-1.8.0/googlemock/include/gmock/gmock.h:58,
                 from ../../src/tests/containerizer/docker_containerizer_tests.cpp:17:
../3rdparty/googletest-release-1.8.0/googletest/include/gtest/gtest.h:1522:28: note:   'const std::basic_string<char>' is not derived from 'const std::_Rb_tree<_Key, _Val, _KeyOfValue, _Compare, _Alloc>'
 GTEST_IMPL_CMP_HELPER_(NE, !=);
                            ^
../3rdparty/googletest-release-1.8.0/googletest/include/gtest/gtest.h:1510:12: note: in definition of macro 'GTEST_IMPL_CMP_HELPER_'
   if (val1 op val2) {\
            ^
In file included from /usr/include/c++/4.8/map:60:0,
                 from ../3rdparty/googletest-release-1.8.0/googletest/include/gtest/internal/gtest-internal.h:58,
                 from ../3rdparty/googletest-release-1.8.0/googletest/include/gtest/gtest.h:58,
                 from ../3rdparty/googletest-release-1.8.0/googlemock/include/gmock/internal/gmock-internal-utils.h:47,
                 from ../3rdparty/googletest-release-1.8.0/googlemock/include/gmock/gmock-actions.h:46,
                 from ../3rdparty/googletest-release-1.8.0/googlemock/include/gmock/gmock.h:58,
                 from ../../src/tests/containerizer/docker_containerizer_tests.cpp:17:
/usr/include/c++/4.8/bits/stl_tree.h:316:5: note: template<class _Val> bool std::operator!=(const std::_Rb_tree_iterator<_Tp>&, const std::_Rb_tree_const_iterator<_Val>&)
     operator!=(const _Rb_tree_iterator<_Val>& __x,
     ^
/usr/include/c++/4.8/bits/stl_tree.h:316:5: note:   template argument deduction/substitution failed:
In file included from ../3rdparty/googletest-release-1.8.0/googlemock/include/gmock/internal/gmock-internal-utils.h:47:0,
                 from ../3rdparty/googletest-release-1.8.0/googlemock/include/gmock/gmock-actions.h:46,
                 from ../3rdparty/googletest-release-1.8.0/googlemock/include/gmock/gmock.h:58,
                 from ../../src/tests/containerizer/docker_containerizer_tests.cpp:17:
../3rdparty/googletest-release-1.8.0/googletest/include/gtest/gtest.h:1522:28: note:   'const std::basic_string<char>' is not derived from 'const std::_Rb_tree_iterator<_Tp>'
 GTEST_IMPL_CMP_HELPER_(NE, !=);
                            ^
../3rdparty/googletest-release-1.8.0/googletest/include/gtest/gtest.h:1510:12: note: in definition of macro 'GTEST_IMPL_CMP_HELPER_'
   if (val1 op val2) {\
            ^
In file included from /usr/include/c++/4.8/bits/locale_facets.h:48:0,
                 from /usr/include/c++/4.8/bits/basic_ios.h:37,
                 from /usr/include/c++/4.8/ios:44,
                 from /usr/include/c++/4.8/ostream:38,
                 from ../3rdparty/googletest-release-1.8.0/googlemock/include/gmock/internal/gmock-internal-utils.h:42,
                 from ../3rdparty/googletest-release-1.8.0/googlemock/include/gmock/gmock-actions.h:46,
                 from ../3rdparty/googletest-release-1.8.0/googlemock/include/gmock/gmock.h:58,
                 from ../../src/tests/containerizer/docker_containerizer_tests.cpp:17:
/usr/include/c++/4.8/bits/streambuf_iterator.h:210:5: note: template<class _CharT, class _Traits> bool std::operator!=(const std::istreambuf_iterator<_CharT, _Traits>&, const std::istreambuf_iterator<_CharT, _Traits>&)
     operator!=(const istreambuf_iterator<_CharT, _Traits>& __a,
     ^
/usr/include/c++/4.8/bits/streambuf_iterator.h:210:5: note:   template argument deduction/substitution failed:
In file included from ../3rdparty/googletest-release-1.8.0/googlemock/include/gmock/internal/gmock-internal-utils.h:47:0,
                 from ../3rdparty/googletest-release-1.8.0/googlemock/include/gmock/gmock-actions.h:46,
                 from ../3rdparty/googletest-release-1.8.0/googlemock/include/gmock/gmock.h:58,
                 from ../../src/tests/containerizer/docker_containerizer_tests.cpp:17:
../3rdparty/googletest-release-1.8.0/googletest/include/gtest/gtest.h:1522:28: note:   'const std::basic_string<char>' is not derived from 'const std::istreambuf_iterator<_CharT, _Traits>'
 GTEST_IMPL_CMP_HELPER_(NE, !=);
                            ^
../3rdparty/googletest-release-1.8.0/googletest/include/gtest/gtest.h:1510:12: note: in definition of macro 'GTEST_IMPL_CMP_HELPER_'
   if (val1 op val2) {\
            ^
In file included from /usr/include/c++/4.8/bits/stl_algo.h:66:0,
                 from /usr/include/c++/4.8/algorithm:62,
                 from ../3rdparty/googletest-release-1.8.0/googlemock/include/gmock/gmock-actions.h:43,
                 from ../3rdparty/googletest-release-1.8.0/googlemock/include/gmock/gmock.h:58,
                 from ../../src/tests/containerizer/docker_containerizer_tests.cpp:17:
/usr/include/c++/4.8/functional:2561:5: note: template<class _Res, class ... _Args> bool std::operator!=(std::nullptr_t, const std::function<_Res(_ArgTypes ...)>&)
     operator!=(nullptr_t, const function<_Res(_Args...)>& __f) noexcept
     ^
/usr/include/c++/4.8/functional:2561:5: note:   template argument deduction/substitution failed:
In file included from ../3rdparty/googletest-release-1.8.0/googlemock/include/gmock/internal/gmock-internal-utils.h:47:0,
                 from ../3rdparty/googletest-release-1.8.0/googlemock/include/gmock/gmock-actions.h:46,
                 from ../3rdparty/googletest-release-1.8.0/googlemock/include/gmock/gmock.h:58,
                 from ../../src/tests/containerizer/docker_containerizer_tests.cpp:17:
../3rdparty/googletest-release-1.8.0/googletest/include/gtest/gtest.h:1522:28: note:   cannot convert 'val1' (type 'const std::basic_string<char>') to type 'std::nullptr_t'
 GTEST_IMPL_CMP_HELPER_(NE, !=);
                            ^
../3rdparty/googletest-release-1.8.0/googletest/include/gtest/gtest.h:1510:12: note: in definition of macro 'GTEST_IMPL_CMP_HELPER_'
   if (val1 op val2) {\
            ^
In file included from /usr/include/c++/4.8/bits/stl_algo.h:66:0,
                 from /usr/include/c++/4.8/algorithm:62,
                 from ../3rdparty/googletest-release-1.8.0/googlemock/include/gmock/gmock-actions.h:43,
                 from ../3rdparty/googletest-release-1.8.0/googlemock/include/gmock/gmock.h:58,
                 from ../../src/tests/containerizer/docker_containerizer_tests.cpp:17:
/usr/include/c++/4.8/functional:2555:5: note: template<class _Res, class ... _Args> bool std::operator!=(const std::function<_Res(_ArgTypes ...)>&, std::nullptr_t)
     operator!=(const function<_Res(_Args...)>& __f, nullptr_t) noexcept
     ^
/usr/include/c++/4.8/functional:2555:5: note:   template argument deduction/substitution failed:
In file included from ../3rdparty/googletest-release-1.8.0/googlemock/include/gmock/internal/gmock-internal-utils.h:47:0,
                 from ../3rdparty/googletest-release-1.8.0/googlemock/include/gmock/gmock-actions.h:46,
                 from ../3rdparty/googletest-release-1.8.0/googlemock/include/gmock/gmock.h:58,
                 from ../../src/tests/containerizer/docker_containerizer_tests.cpp:17:
../3rdparty/googletest-release-1.8.0/googletest/include/gtest/gtest.h:1522:28: note:   'const std::basic_string<char>' is not derived from 'const std::function<_Res(_ArgTypes ...)>'
 GTEST_IMPL_CMP_HELPER_(NE, !=);
                            ^
../3rdparty/googletest-release-1.8.0/googletest/include/gtest/gtest.h:1510:12: note: in definition of macro 'GTEST_IMPL_CMP_HELPER_'
   if (val1 op val2) {\
            ^
In file included from /usr/include/c++/4.8/functional:55:0,
                 from /usr/include/c++/4.8/bits/stl_algo.h:66,
                 from /usr/include/c++/4.8/algorithm:62,
                 from ../3rdparty/googletest-release-1.8.0/googlemock/include/gmock/gmock-actions.h:43,
                 from ../3rdparty/googletest-release-1.8.0/googlemock/include/gmock/gmock.h:58,
                 from ../../src/tests/containerizer/docker_containerizer_tests.cpp:17:
/usr/include/c++/4.8/tuple:835:5: note: template<class ... _TElements, class ... _UElements> constexpr bool std::operator!=(const std::tuple<_Elements ...>&, const std::tuple<_Elements ...>&)
     operator!=(const tuple<_TElements...>& __t,
     ^
/usr/include/c++/4.8/tuple:835:5: note:   template argument deduction/substitution failed:
In file included from ../3rdparty/googletest-release-1.8.0/googlemock/include/gmock/internal/gmock-internal-utils.h:47:0,
                 from ../3rdparty/googletest-release-1.8.0/googlemock/include/gmock/gmock-actions.h:46,
                 from ../3rdparty/googletest-release-1.8.0/googlemock/include/gmock/gmock.h:58,
                 from ../../src/tests/containerizer/docker_containerizer_tests.cpp:17:
../3rdparty/googletest-release-1.8.0/googletest/include/gtest/gtest.h:1522:28: note:   'const std::basic_string<char>' is not derived from 'const std::tuple<_Elements ...>'
 GTEST_IMPL_CMP_HELPER_(NE, !=);
                            ^
../3rdparty/googletest-release-1.8.0/googletest/include/gtest/gtest.h:1510:12: note: in definition of macro 'GTEST_IMPL_CMP_HELPER_'
   if (val1 op val2) {\
            ^
In file included from /usr/include/c++/4.8/tuple:39:0,
                 from /usr/include/c++/4.8/functional:55,
                 from /usr/include/c++/4.8/bits/stl_algo.h:66,
                 from /usr/include/c++/4.8/algorithm:62,
                 from ../3rdparty/googletest-release-1.8.0/googlemock/include/gmock/gmock-actions.h:43,
                 from ../3rdparty/googletest-release-1.8.0/googlemock/include/gmock/gmock.h:58,
                 from ../../src/tests/containerizer/docker_containerizer_tests.cpp:17:
/usr/include/c++/4.8/array:233:5: note: template<class _Tp, long unsigned int _Nm> bool std::operator!=(const std::array<_Tp, _Nm>&, const std::array<_Tp, _Nm>&)
     operator!=(const array<_Tp, _Nm>& __one, const array<_Tp, _Nm>& __two)
     ^
/usr/include/c++/4.8/array:233:5: note:   template argument deduction/substitution failed:
In file included from ../3rdparty/googletest-release-1.8.0/googlemock/include/gmock/internal/gmock-internal-utils.h:47:0,
                 from ../3rdparty/googletest-release-1.8.0/googlemock/include/gmock/gmock-actions.h:46,
                 from ../3rdparty/googletest-release-1.8.0/googlemock/include/gmock/gmock.h:58,
                 from ../../src/tests/containerizer/docker_containerizer_tests.cpp:17:
../3rdparty/googletest-release-1.8.0/googletest/include/gtest/gtest.h:1522:28: note:   'const std::basic_string<char>' is not derived from 'const std::array<_Tp, _Nm>'
 GTEST_IMPL_CMP_HELPER_(NE, !=);
                            ^
../3rdparty/googletest-release-1.8.0/googletest/include/gtest/gtest.h:1510:12: note: in definition of macro 'GTEST_IMPL_CMP_HELPER_'
   if (val1 op val2) {\
            ^
In file included from /usr/include/c++/4.8/random:50:0,
                 from /usr/include/c++/4.8/bits/stl_algo.h:65,
                 from /usr/include/c++/4.8/algorithm:62,
                 from ../3rdparty/googletest-release-1.8.0/googlemock/include/gmock/gmock-actions.h:43,
                 from ../3rdparty/googletest-release-1.8.0/googlemock/include/gmock/gmock.h:58,
                 from ../../src/tests/containerizer/docker_containerizer_tests.cpp:17:
/usr/include/c++/4.8/bits/random.h:6006:5: note: template<class _RealType> bool std::operator!=(const std::piecewise_linear_distribution<_RealType>&, const std::piecewise_linear_distribution<_RealType>&)
     operator!=(const std::piecewise_linear_distribution<_RealType>& __d1,
     ^
/usr/include/c++/4.8/bits/random.h:6006:5: note:   template argument deduction/substitution failed:
In file included from ../3rdparty/googletest-release-1.8.0/googlemock/include/gmock/internal/gmock-internal-utils.h:47:0,
                 from ../3rdparty/googletest-release-1.8.0/googlemock/include/gmock/gmock-actions.h:46,
                 from ../3rdparty/googletest-release-1.8.0/googlemock/include/gmock/gmock.h:58,
                 from ../../src/tests/containerizer/docker_containerizer_tests.cpp:17:
../3rdparty/googletest-release-1.8.0/googletest/include/gtest/gtest.h:1522:28: note:   'const std::basic_string<char>' is not derived from 'const std::piecewise_linear_distribution<_RealType>'
 GTEST_IMPL_CMP_HELPER_(NE, !=);
                            ^
../3rdparty/googletest-release-1.8.0/googletest/include/gtest/gtest.h:1510:12: note: in definition of macro 'GTEST_IMPL_CMP_HELPER_'
   if (val1 op val2) {\
            ^
In file included from /usr/include/c++/4.8/random:50:0,
                 from /usr/include/c++/4.8/bits/stl_algo.h:65,
                 from /usr/include/c++/4.8/algorithm:62,
                 from ../3rdparty/googletest-release-1.8.0/googlemock/include/gmock/gmock-actions.h:43,
                 from ../3rdparty/googletest-release-1.8.0/googlemock/include/gmock/gmock.h:58,
                 from ../../src/tests/containerizer/docker_containerizer_tests.cpp:17:
/usr/include/c++/4.8/bits/random.h:5736:5: note: template<class _RealType> bool std::operator!=(const std::piecewise_constant_distribution<_RealType>&, const std::piecewise_constant_distribution<_RealType>&)
     operator!=(const std::piecewise_constant_distribution<_RealType>& __d1,
     ^
/usr/include/c++/4.8/bits/random.h:5736:5: note:   template argument deduction/substitution failed:
In file included from ../3rdparty/googletest-release-1.8.0/googlemock/include/gmock/internal/gmock-internal-utils.h:47:0,
                 from ../3rdparty/googletest-release-1.8.0/googlemock/include/gmock/gmock-actions.h:46,
                 from ../3rdparty/googletest-release-1.8.0/googlemock/include/gmock/gmock.h:58,
                 from ../../src/tests/containerizer/docker_containerizer_tests.cpp:17:
../3rdparty/googletest-release-1.8.0/googletest/include/gtest/gtest.h:1522:28: note:   'const std::basic_string<char>' is not derived from 'const std::piecewise_constant_distribution<_RealType>'
 GTEST_IMPL_CMP_HELPER_(NE, !=);
                            ^
../3rdparty/googletest-release-1.8.0/googletest/include/gtest/gtest.h:1510:12: note: in definition of macro 'GTEST_IMPL_CMP_HELPER_'
   if (val1 op val2) {\
            ^
In file included from /usr/include/c++/4.8/random:50:0,
                 from /usr/include/c++/4.8/bits/stl_algo.h:65,
                 from /usr/include/c++/4.8/algorithm:62,
                 from ../3rdparty/googletest-release-1.8.0/googlemock/include/gmock/gmock-actions.h:43,
                 from ../3rdparty/googletest-release-1.8.0/googlemock/include/gmock/gmock.h:58,
                 from ../../src/tests/containerizer/docker_containerizer_tests.cpp:17:
/usr/include/c++/4.8/bits/random.h:5469:5: note: template<class _IntType> bool std::operator!=(const std::discrete_distribution<_IntType>&, const std::discrete_distribution<_IntType>&)
     operator!=(const std::discrete_distribution<_IntType>& __d1,
     ^
/usr/include/c++/4.8/bits/random.h:5469:5: note:   template argument deduction/substitution failed:
In file included from ../3rdparty/googletest-release-1.8.0/googlemock/include/gmock/internal/gmock-internal-utils.h:47:0,
                 from ../3rdparty/googletest-release-1.8.0/googlemock/include/gmock/gmock-actions.h:46,
                 from ../3rdparty/googletest-release-1.8.0/googlemock/include/gmock/gmock.h:58,
                 from ../../src/tests/containerizer/docker_containerizer_tests.cpp:17:
../3rdparty/googletest-release-1.8.0/googletest/include/gtest/gtest.h:1522:28: note:   'const std::basic_string<char>' is not derived from 'const std::discrete_distribution<_IntType>'
 GTEST_IMPL_CMP_HELPER_(NE, !=);
                            ^
../3rdparty/googletest-release-1.8.0/googletest/include/gtest/gtest.h:1510:12: note: in definition of macro 'GTEST_IMPL_CMP_HELPER_'
   if (val1 op val2) {\
            ^
In file included from /usr/include/c++/4.8/random:50:0,
                 from /usr/include/c++/4.8/bits/stl_algo.h:65,
                 from /usr/include/c++/4.8/algorithm:62,
                 from ../3rdparty/googletest-release-1.8.0/googlemock/include/gmock/gmock-actions.h:43,
                 from ../3rdparty/googletest-release-1.8.0/googlemock/include/gmock/gmock.h:58,
                 from ../../src/tests/containerizer/docker_containerizer_tests.cpp:17:
/usr/include/c++/4.8/bits/random.h:5209:5: note: template<class _RealType> bool std::operator!=(const std::extreme_value_distribution<_RealType>&, const std::extreme_value_distribution<_RealType>&)
     operator!=(const std::extreme_value_distribution<_RealType>& __d1,
     ^
/usr/include/c++/4.8/bits/random.h:5209:5: note:   template argument deduction/substitution failed:
In file included from ../3rdparty/googletest-release-1.8.0/googlemock/include/gmock/internal/gmock-internal-utils.h:47:0,
                 from ../3rdparty/googletest-release-1.8.0/googlemock/include/gmock/gmock-actions.h:46,
                 from ../3rdparty/googletest-release-1.8.0/googlemock/include/gmock/gmock.h:58,
                 from ../../src/tests/containerizer/docker_containerizer_tests.cpp:17:
../3rdparty/googletest-release-1.8.0/googletest/include/gtest/gtest.h:1522:28: note:   'const std::basic_string<char>' is not derived from 'const std::extreme_value_distribution<_RealType>'
 GTEST_IMPL_CMP_HELPER_(NE, !=);
                            ^
../3rdparty/googletest-release-1.8.0/googletest/include/gtest/gtest.h:1510:12: note: in definition of macro 'GTEST_IMPL_CMP_HELPER_'
   if (val1 op val2) {\
            ^
In file included from /usr/include/c++/4.8/random:50:0,
                 from /usr/include/c++/4.8/bits/stl_algo.h:65,
                 from /usr/include/c++/4.8/algorithm:62,
                 from ../3rdparty/googletest-release-1.8.0/googlemock/include/gmock/gmock-actions.h:43,
                 from ../3rdparty/googletest-release-1.8.0/googlemock/include/gmock/gmock.h:58,
                 from ../../src/tests/containerizer/docker_containerizer_tests.cpp:17:
/usr/include/c++/4.8/bits/random.h:5006:5: note: template<class _RealType> bool std::operator!=(const std::weibull_distribution<_RealType>&, const std::weibull_distribution<_RealType>&)
     operator!=(const std::weibull_distribution<_RealType>& __d1,
     ^
/usr/include/c++/4.8/bits/random.h:5006:5: note:   template argument deduction/substitution failed:
In file included from ../3rdparty/googletest-release-1.8.0/googlemock/include/gmock/internal/gmock-internal-utils.h:47:0,
                 from ../3rdparty/googletest-release-1.8.0/googlemock/include/gmock/gmock-actions.h:46,
                 from ../3rdparty/googletest-release-1.8.0/googlemock/include/gmock/gmock.h:58,
                 from ../../src/tests/containerizer/docker_containerizer_tests.cpp:17:
../3rdparty/googletest-release-1.8.0/googletest/include/gtest/gtest.h:1522:28: note:   'const std::basic_string<char>' is not derived from 'const std::weibull_distribution<_RealType>'
 GTEST_IMPL_CMP_HELPER_(NE, !=);
                            ^
../3rdparty/googletest-release-1.8.0/googletest/include/gtest/gtest.h:1510:12: note: in definition of macro 'GTEST_IMPL_CMP_HELPER_'
   if (val1 op val2) {\
            ^
In file included from /usr/include/c++/4.8/random:50:0,
                 from /usr/include/c++/4.8/bits/stl_algo.h:65,
                 from /usr/include/c++/4.8/algorithm:62,
                 from ../3rdparty/googletest-release-1.8.0/googlemock/include/gmock/gmock-actions.h:43,
                 from ../3rdparty/googletest-release-1.8.0/googlemock/include/gmock/gmock.h:58,
                 from ../../src/tests/containerizer/docker_containerizer_tests.cpp:17:
/usr/include/c++/4.8/bits/random.h:4803:5: note: template<class _RealType> bool std::operator!=(const std::exponential_distribution<_RealType>&, const std::exponential_distribution<_RealType>&)
     operator!=(const std::exponential_distribution<_RealType>& __d1,
     ^
/usr/include/c++/4.8/bits/random.h:4803:5: note:   template argument deduction/substitution failed:
In file included from ../3rdparty/googletest-release-1.8.0/googlemock/include/gmock/internal/gmock-internal-utils.h:47:0,
                 from ../3rdparty/googletest-release-1.8.0/googlemock/include/gmock/gmock-actions.h:46,
                 from ../3rdparty/googletest-release-1.8.0/googlemock/include/gmock/gmock.h:58,
                 from ../../src/tests/containerizer/docker_containerizer_tests.cpp:17:
../3rdparty/googletest-release-1.8.0/googletest/include/gtest/gtest.h:1522:28: note:   'const std::basic_string<char>' is not derived from 'const std::exponential_distribution<_RealType>'
 GTEST_IMPL_CMP_HELPER_(NE, !=);
                            ^
../3rdparty/googletest-release-1.8.0/googletest/include/gtest/gtest.h:1510:12: note: in definition of macro 'GTEST_IMPL_CMP_HELPER_'
   if (val1 op val2) {\
            ^
In file included from /usr/include/c++/4.8/random:50:0,
                 from /usr/include/c++/4.8/bits/stl_algo.h:65,
                 from /usr/include/c++/4.8/algorithm:62,
                 from ../3rdparty/googletest-release-1.8.0/googlemock/include/gmock/gmock-actions.h:43,
                 from ../3rdparty/googletest-release-1.8.0/googlemock/include/gmock/gmock.h:58,
                 from ../../src/tests/containerizer/docker_containerizer_tests.cpp:17:
/usr/include/c++/4.8/bits/random.h:4625:5: note: template<class _IntType> bool std::operator!=(const std::poisson_distribution<_IntType>&, const std::poisson_distribution<_IntType>&)
     operator!=(const std::poisson_distribution<_IntType>& __d1,
     ^
/usr/include/c++/4.8/bits/random.h:4625:5: note:   template argument deduction/substitution failed:
In file included from ../3rdparty/googletest-release-1.8.0/googlemock/include/gmock/internal/gmock-internal-utils.h:47:0,
                 from ../3rdparty/googletest-release-1.8.0/googlemock/include/gmock/gmock-actions.h:46,
                 from ../3rdparty/googletest-release-1.8.0/googlemock/include/gmock/gmock.h:58,
                 from ../../src/tests/containerizer/docker_containerizer_tests.cpp:17:
../3rdparty/googletest-release-1.8.0/googletest/include/gtest/gtest.h:1522:28: note:   'const std::basic_string<char>' is not derived from 'const std::poisson_distribution<_IntType>'
 GTEST_IMPL_CMP_HELPER_(NE, !=);
                            ^
../3rdparty/googletest-release-1.8.0/googletest/include/gtest/gtest.h:1510:12: note: in definition of macro 'GTEST_IMPL_CMP_HELPER_'
   if (val1 op val2) {\
            ^
In file included from /usr/include/c++/4.8/random:50:0,
                 from /usr/include/c++/4.8/bits/stl_algo.h:65,
                 from /usr/include/c++/4.8/algorithm:62,
                 from ../3rdparty/googletest-release-1.8.0/googlemock/include/gmock/gmock-actions.h:43,
                 from ../3rdparty/googletest-release-1.8.0/googlemock/include/gmock/gmock.h:58,
                 from ../../src/tests/containerizer/docker_containerizer_tests.cpp:17:
/usr/include/c++/4.8/bits/random.h:4409:5: note: template<class _IntType> bool std::operator!=(const std::negative_binomial_distribution<_IntType>&, const std::negative_binomial_distribution<_IntType>&)
     operator!=(const std::negative_binomial_distribution<_IntType>& __d1,
     ^
/usr/include/c++/4.8/bits/random.h:4409:5: note:   template argument deduction/substitution failed:
In file included from ../3rdparty/googletest-release-1.8.0/googlemock/include/gmock/internal/gmock-internal-utils.h:47:0,
                 from ../3rdparty/googletest-release-1.8.0/googlemock/include/gmock/gmock-actions.h:46,
                 from ../3rdparty/googletest-release-1.8.0/googlemock/include/gmock/gmock.h:58,
                 from ../../src/tests/containerizer/docker_containerizer_tests.cpp:17:
../3rdparty/googletest-release-1.8.0/googletest/include/gtest/gtest.h:1522:28: note:   'const std::basic_string<char>' is not derived from 'const std::negative_binomial_distribution<_IntType>'
 GTEST_IMPL_CMP_HELPER_(NE, !=);
                            ^
../3rdparty/googletest-release-1.8.0/googletest/include/gtest/gtest.h:1510:12: note: in definition of macro 'GTEST_IMPL_CMP_HELPER_'
   if (val1 op val2) {\
            ^
In file included from /usr/include/c++/4.8/random:50:0,
                 from /usr/include/c++/4.8/bits/stl_algo.h:65,
                 from /usr/include/c++/4.8/algorithm:62,
                 from ../3rdparty/googletest-release-1.8.0/googlemock/include/gmock/gmock-actions.h:43,
                 from ../3rdparty/googletest-release-1.8.0/googlemock/include/gmock/gmock.h:58,
                 from ../../src/tests/containerizer/docker_containerizer_tests.cpp:17:
/usr/include/c++/4.8/bits/random.h:4164:5: note: template<class _IntType> bool std::operator!=(const std::geometric_distribution<_IntType>&, const std::geometric_distribution<_IntType>&)
     operator!=(const std::geometric_distribution<_IntType>& __d1,
     ^
/usr/include/c++/4.8/bits/random.h:4164:5: note:   template argument deduction/substitution failed:
In file included from ../3rdparty/googletest-release-1.8.0/googlemock/include/gmock/internal/gmock-internal-utils.h:47:0,
                 from ../3rdparty/googletest-release-1.8.0/googlemock/include/gmock/gmock-actions.h:46,
                 from ../3rdparty/googletest-release-1.8.0/googlemock/include/gmock/gmock.h:58,
                 from ../../src/tests/containerizer/docker_containerizer_tests.cpp:17:
../3rdparty/googletest-release-1.8.0/googletest/include/gtest/gtest.h:1522:28: note:   'const std::basic_string<char>' is not derived from 'const std::geometric_distribution<_IntType>'
 GTEST_IMPL_CMP_HELPER_(NE, !=);
                            ^
../3rdparty/googletest-release-1.8.0/googletest/include/gtest/gtest.h:1510:12: note: in definition of macro 'GTEST_IMPL_CMP_HELPER_'
   if (val1 op val2) {\
            ^
In file included from /usr/include/c++/4.8/random:50:0,
                 from /usr/include/c++/4.8/bits/stl_algo.h:65,
                 from /usr/include/c++/4.8/algorithm:62,
                 from ../3rdparty/googletest-release-1.8.0/googlemock/include/gmock/gmock-actions.h:43,
                 from ../3rdparty/googletest-release-1.8.0/googlemock/include/gmock/gmock.h:58,
                 from ../../src/tests/containerizer/docker_containerizer_tests.cpp:17:
/usr/include/c++/4.8/bits/random.h:3995:5: note: template<class _IntType> bool std::operator!=(const std::binomial_distribution<_IntType>&, const std::binomial_distribution<_IntType>&)
     operator!=(const std::binomial_distribution<_IntType>& __d1,
     ^
/usr/include/c++/4.8/bits/random.h:3995:5: note:   template argument deduction/substitution failed:
In file included from ../3rdparty/googletest-release-1.8.0/googlemock/include/gmock/internal/gmock-internal-utils.h:47:0,
                 from ../3rdparty/googletest-release-1.8.0/googlemock/include/gmock/gmock-actions.h:46,
                 from ../3rdparty/googletest-release-1.8.0/googlemock/include/gmock/gmock.h:58,
                 from ../../src/tests/containerizer/docker_containerizer_tests.cpp:17:
../3rdparty/googletest-release-1.8.0/googletest/include/gtest/gtest.h:1522:28: note:   'const std::basic_string<char>' is not derived from 'const std::binomial_distribution<_IntType>'
 GTEST_IMPL_CMP_HELPER_(NE, !=);
                            ^
../3rdparty/googletest-release-1.8.0/googletest/include/gtest/gtest.h:1510:12: note: in definition of macro 'GTEST_IMPL_CMP_HELPER_'
   if (val1 op val2) {\
            ^
In file included from /usr/include/c++/4.8/random:50:0,
                 from /usr/include/c++/4.8/bits/stl_algo.h:65,
                 from /usr/include/c++/4.8/algorithm:62,
                 from ../3rdparty/googletest-release-1.8.0/googlemock/include/gmock/gmock-actions.h:43,
                 from ../3rdparty/googletest-release-1.8.0/googlemock/include/gmock/gmock.h:58,
                 from ../../src/tests/containerizer/docker_containerizer_tests.cpp:17:
/usr/include/c++/4.8/bits/random.h:3729:3: note: bool std::operator!=(const std::bernoulli_distribution&, const std::bernoulli_distribution&)
   operator!=(const std::bernoulli_distribution& __d1,
   ^
/usr/include/c++/4.8/bits/random.h:3729:3: note:   no known conversion for argument 1 from 'const std::basic_string<char>' to 'const std::bernoulli_distribution&'
/usr/include/c++/4.8/bits/random.h:3553:5: note: template<class _RealType> bool std::operator!=(const std::student_t_distribution<_RealType>&, const std::student_t_distribution<_RealType>&)
     operator!=(const std::student_t_distribution<_RealType>& __d1,
     ^
/usr/include/c++/4.8/bits/random.h:3553:5: note:   template argument deduction/substitution failed:
In file included from ../3rdparty/googletest-release-1.8.0/googlemock/include/gmock/internal/gmock-internal-utils.h:47:0,
                 from ../3rdparty/googletest-release-1.8.0/googlemock/include/gmock/gmock-actions.h:46,
                 from ../3rdparty/googletest-release-1.8.0/googlemock/include/gmock/gmock.h:58,
                 from ../../src/tests/containerizer/docker_containerizer_tests.cpp:17:
../3rdparty/googletest-release-1.8.0/googletest/include/gtest/gtest.h:1522:28: note:   'const std::basic_string<char>' is not derived from 'const std::student_t_distribution<_RealType>'
 GTEST_IMPL_CMP_HELPER_(NE, !=);
                            ^
../3rdparty/googletest-release-1.8.0/googletest/include/gtest/gtest.h:1510:12: note: in definition of macro 'GTEST_IMPL_CMP_HELPER_'
   if (val1 op val2) {\
            ^
In file included from /usr/include/c++/4.8/random:50:0,
                 from /usr/include/c++/4.8/bits/stl_algo.h:65,
                 from /usr/include/c++/4.8/algorithm:62,
                 from ../3rdparty/googletest-release-1.8.0/googlemock/include/gmock/gmock-actions.h:43,
                 from ../3rdparty/googletest-release-1.8.0/googlemock/include/gmock/gmock.h:58,
                 from ../../src/tests/containerizer/docker_containerizer_tests.cpp:17:
/usr/include/c++/4.8/bits/random.h:3340:5: note: template<class _RealType> bool std::operator!=(const std::fisher_f_distribution<_RealType>&, const std::fisher_f_distribution<_RealType>&)
     operator!=(const std::fisher_f_distribution<_RealType>& __d1,
     ^
/usr/include/c++/4.8/bits/random.h:3340:5: note:   template argument deduction/substitution failed:
In file included from ../3rdparty/googletest-release-1.8.0/googlemock/include/gmock/internal/gmock-internal-utils.h:47:0,
                 from ../3rdparty/googletest-release-1.8.0/googlemock/include/gmock/gmock-actions.h:46,
                 from ../3rdparty/googletest-release-1.8.0/googlemock/include/gmock/gmock.h:58,
                 from ../../src/tests/containerizer/docker_containerizer_tests.cpp:17:
../3rdparty/googletest-release-1.8.0/googletest/include/gtest/gtest.h:1522:28: note:   'const std::basic_string<char>' is not derived from 'const std::fisher_f_distribution<_RealType>'
 GTEST_IMPL_CMP_HELPER_(NE, !=);
                            ^
../3rdparty/googletest-release-1.8.0/googletest/include/gtest/gtest.h:1510:12: note: in definition of macro 'GTEST_IMPL_CMP_HELPER_'
   if (val1 op val2) {\
            ^
In file included from /usr/include/c++/4.8/random:50:0,
                 from /usr/include/c++/4.8/bits/stl_algo.h:65,
                 from /usr/include/c++/4.8/algorithm:62,
                 from ../3rdparty/googletest-release-1.8.0/googlemock/include/gmock/gmock-actions.h:43,
                 from ../3rdparty/googletest-release-1.8.0/googlemock/include/gmock/gmock.h:58,
                 from ../../src/tests/containerizer/docker_containerizer_tests.cpp:17:
/usr/include/c++/4.8/bits/random.h:3084:5: note: template<class _RealType> bool std::operator!=(const std::cauchy_distribution<_RealType>&, const std::cauchy_distribution<_RealType>&)
     operator!=(const std::cauchy_distribution<_RealType>& __d1,
     ^
/usr/include/c++/4.8/bits/random.h:3084:5: note:   template argument deduction/substitution failed:
In file included from ../3rdparty/googletest-release-1.8.0/googlemock/include/gmock/internal/gmock-internal-utils.h:47:0,
                 from ../3rdparty/googletest-release-1.8.0/googlemock/include/gmock/gmock-actions.h:46,
                 from ../3rdparty/googletest-release-1.8.0/googlemock/include/gmock/gmock.h:58,
                 from ../../src/tests/containerizer/docker_containerizer_tests.cpp:17:
../3rdparty/googletest-release-1.8.0/googletest/include/gtest/gtest.h:1522:28: note:   'const std::basic_string<char>' is not derived from 'const std::cauchy_distribution<_RealType>'
 GTEST_IMPL_CMP_HELPER_(NE, !=);
                            ^
../3rdparty/googletest-release-1.8.0/googletest/include/gtest/gtest.h:1510:12: note: in definition of macro 'GTEST_IMPL_CMP_HELPER_'
   if (val1 op val2) {\
            ^
In file included from /usr/include/c++/4.8/random:50:0,
                 from /usr/include/c++/4.8/bits/stl_algo.h:65,
                 from /usr/include/c++/4.8/algorithm:62,
                 from ../3rdparty/googletest-release-1.8.0/googlemock/include/gmock/gmock-actions.h:43,
                 from ../3rdparty/googletest-release-1.8.0/googlemock/include/gmock/gmock.h:58,
                 from ../../src/tests/containerizer/docker_containerizer_tests.cpp:17:
/usr/include/c++/4.8/bits/random.h:2917:5: note: template<class _RealType> bool std::operator!=(const std::chi_squared_distribution<_RealType>&, const std::chi_squared_distribution<_RealType>&)
     operator!=(const std::chi_squared_distribution<_RealType>& __d1,
     ^
/usr/include/c++/4.8/bits/random.h:2917:5: note:   template argument deduction/substitution failed:
In file included from ../3rdparty/googletest-release-1.8.0/googlemock/include/gmock/internal/gmock-internal-utils.h:47:0,
                 from ../3rdparty/googletest-release-1.8.0/googlemock/include/gmock/gmock-actions.h:46,
                 from ../3rdparty/googletest-release-1.8.0/googlemock/include/gmock/gmock.h:58,
                 from ../../src/tests/containerizer/docker_containerizer_tests.cpp:17:
../3rdparty/googletest-release-1.8.0/googletest/include/gtest/gtest.h:1522:28: note:   'const std::basic_string<char>' is not derived from 'const std::chi_squared_distribution<_RealType>'
 GTEST_IMPL_CMP_HELPER_(NE, !=);
                            ^
../3rdparty/googletest-release-1.8.0/googletest/include/gtest/gtest.h:1510:12: note: in definition of macro 'GTEST_IMPL_CMP_HELPER_'
   if (val1 op val2) {\
            ^
In file included from /usr/include/c++/4.8/random:50:0,
                 from /usr/include/c++/4.8/bits/stl_algo.h:65,
                 from /usr/include/c++/4.8/algorithm:62,
                 from ../3rdparty/googletest-release-1.8.0/googlemock/include/gmock/gmock-actions.h:43,
                 from ../3rdparty/googletest-release-1.8.0/googlemock/include/gmock/gmock.h:58,
                 from ../../src/tests/containerizer/docker_containerizer_tests.cpp:17:
/usr/include/c++/4.8/bits/random.h:2707:6: note: template<class _RealType> bool std::operator!=(const std::gamma_distribution<_RealType>&, const std::gamma_distribution<_RealType>&)
      operator!=(const std::gamma_distribution<_RealType>& __d1,
      ^
/usr/include/c++/4.8/bits/random.h:2707:6: note:   template argument deduction/substitution failed:
In file included from ../3rdparty/googletest-release-1.8.0/googlemock/include/gmock/internal/gmock-internal-utils.h:47:0,
                 from ../3rdparty/googletest-release-1.8.0/googlemock/include/gmock/gmock-actions.h:46,
                 from ../3rdparty/googletest-release-1.8.0/googlemock/include/gmock/gmock.h:58,
                 from ../../src/tests/containerizer/docker_containerizer_tests.cpp:17:
../3rdparty/googletest-release-1.8.0/googletest/include/gtest/gtest.h:1522:28: note:   'const std::basic_string<char>' is not derived from 'const std::gamma_distribution<_RealType>'
 GTEST_IMPL_CMP_HELPER_(NE, !=);
                            ^
../3rdparty/googletest-release-1.8.0/googletest/include/gtest/gtest.h:1510:12: note: in definition of macro 'GTEST_IMPL_CMP_HELPER_'
   if (val1 op val2) {\
            ^
In file included from /usr/include/c++/4.8/random:50:0,
                 from /usr/include/c++/4.8/bits/stl_algo.h:65,
                 from /usr/include/c++/4.8/algorithm:62,
                 from ../3rdparty/googletest-release-1.8.0/googlemock/include/gmock/gmock-actions.h:43,
                 from ../3rdparty/googletest-release-1.8.0/googlemock/include/gmock/gmock.h:58,
                 from ../../src/tests/containerizer/docker_containerizer_tests.cpp:17:
/usr/include/c++/4.8/bits/random.h:2487:5: note: template<class _RealType> bool std::operator!=(const std::lognormal_distribution<_RealType>&, const std::lognormal_distribution<_RealType>&)
     operator!=(const std::lognormal_distribution<_RealType>& __d1,
     ^
/usr/include/c++/4.8/bits/random.h:2487:5: note:   template argument deduction/substitution failed:
In file included from ../3rdparty/googletest-release-1.8.0/googlemock/include/gmock/internal/gmock-internal-utils.h:47:0,
                 from ../3rdparty/googletest-release-1.8.0/googlemock/include/gmock/gmock-actions.h:46,
                 from ../3rdparty/googletest-release-1.8.0/googlemock/include/gmock/gmock.h:58,
                 from ../../src/tests/containerizer/docker_containerizer_tests.cpp:17:
../3rdparty/googletest-release-1.8.0/googletest/include/gtest/gtest.h:1522:28: note:   'const std::basic_string<char>' is not derived from 'const std::lognormal_distribution<_RealType>'
 GTEST_IMPL_CMP_HELPER_(NE, !=);
                            ^
../3rdparty/googletest-release-1.8.0/googletest/include/gtest/gtest.h:1510:12: note: in definition of macro 'GTEST_IMPL_CMP_HELPER_'
   if (val1 op val2) {\
            ^
In file included from /usr/include/c++/4.8/random:50:0,
                 from /usr/include/c++/4.8/bits/stl_algo.h:65,
                 from /usr/include/c++/4.8/algorithm:62,
                 from ../3rdparty/googletest-release-1.8.0/googlemock/include/gmock/gmock-actions.h:43,
                 from ../3rdparty/googletest-release-1.8.0/googlemock/include/gmock/gmock.h:58,
                 from ../../src/tests/containerizer/docker_containerizer_tests.cpp:17:
/usr/include/c++/4.8/bits/random.h:2283:5: note: template<class _RealType> bool std::operator!=(const std::normal_distribution<_RealType>&, const std::normal_distribution<_RealType>&)
     operator!=(const std::normal_distribution<_RealType>& __d1,
     ^
/usr/include/c++/4.8/bits/random.h:2283:5: note:   template argument deduction/substitution failed:
In file included from ../3rdparty/googletest-release-1.8.0/googlemock/include/gmock/internal/gmock-internal-utils.h:47:0,
                 from ../3rdparty/googletest-release-1.8.0/googlemock/include/gmock/gmock-actions.h:46,
                 from ../3rdparty/googletest-release-1.8.0/googlemock/include/gmock/gmock.h:58,
                 from ../../src/tests/containerizer/docker_containerizer_tests.cpp:17:
../3rdparty/googletest-release-1.8.0/googletest/include/gtest/gtest.h:1522:28: note:   'const std::basic_string<char>' is not derived from 'const std::normal_distribution<_RealType>'
 GTEST_IMPL_CMP_HELPER_(NE, !=);
                            ^
../3rdparty/googletest-release-1.8.0/googletest/include/gtest/gtest.h:1510:12: note: in definition of macro 'GTEST_IMPL_CMP_HELPER_'
   if (val1 op val2) {\
            ^
In file included from /usr/include/c++/4.8/random:50:0,
                 from /usr/include/c++/4.8/bits/stl_algo.h:65,
                 from /usr/include/c++/4.8/algorithm:62,
                 from ../3rdparty/googletest-release-1.8.0/googlemock/include/gmock/gmock-actions.h:43,
                 from ../3rdparty/googletest-release-1.8.0/googlemock/include/gmock/gmock.h:58,
                 from ../../src/tests/containerizer/docker_containerizer_tests.cpp:17:
/usr/include/c++/4.8/bits/random.h:2034:5: note: template<class _IntType> bool std::operator!=(const std::uniform_real_distribution<_IntType>&, const std::uniform_real_distribution<_IntType>&)
     operator!=(const std::uniform_real_distribution<_IntType>& __d1,
     ^
/usr/include/c++/4.8/bits/random.h:2034:5: note:   template argument deduction/substitution failed:
In file included from ../3rdparty/googletest-release-1.8.0/googlemock/include/gmock/internal/gmock-internal-utils.h:47:0,
                 from ../3rdparty/googletest-release-1.8.0/googlemock/include/gmock/gmock-actions.h:46,
                 from ../3rdparty/googletest-release-1.8.0/googlemock/include/gmock/gmock.h:58,
                 from ../../src/tests/containerizer/docker_containerizer_tests.cpp:17:
../3rdparty/googletest-release-1.8.0/googletest/include/gtest/gtest.h:1522:28: note:   'const std::basic_string<char>' is not derived from 'const std::uniform_real_distribution<_IntType>'
 GTEST_IMPL_CMP_HELPER_(NE, !=);
                            ^
../3rdparty/googletest-release-1.8.0/googletest/include/gtest/gtest.h:1510:12: note: in definition of macro 'GTEST_IMPL_CMP_HELPER_'
   if (val1 op val2) {\
            ^
In file included from /usr/include/c++/4.8/random:50:0,
                 from /usr/include/c++/4.8/bits/stl_algo.h:65,
                 from /usr/include/c++/4.8/algorithm:62,
                 from ../3rdparty/googletest-release-1.8.0/googlemock/include/gmock/gmock-actions.h:43,
                 from ../3rdparty/googletest-release-1.8.0/googlemock/include/gmock/gmock.h:58,
                 from ../../src/tests/containerizer/docker_containerizer_tests.cpp:17:
/usr/include/c++/4.8/bits/random.h:1825:5: note: template<class _IntType> bool std::operator!=(const std::uniform_int_distribution<_IntType>&, const std::uniform_int_distribution<_IntType>&)
     operator!=(const std::uniform_int_distribution<_IntType>& __d1,
     ^
/usr/include/c++/4.8/bits/random.h:1825:5: note:   template argument deduction/substitution failed:
In file included from ../3rdparty/googletest-release-1.8.0/googlemock/include/gmock/internal/gmock-internal-utils.h:47:0,
                 from ../3rdparty/googletest-release-1.8.0/googlemock/include/gmock/gmock-actions.h:46,
                 from ../3rdparty/googletest-release-1.8.0/googlemock/include/gmock/gmock.h:58,
                 from ../../src/tests/containerizer/docker_containerizer_tests.cpp:17:
../3rdparty/googletest-release-1.8.0/googletest/include/gtest/gtest.h:1522:28: note:   'const std::basic_string<char>' is not derived from 'const std::uniform_int_distribution<_IntType>'
 GTEST_IMPL_CMP_HELPER_(NE, !=);
                            ^
../3rdparty/googletest-release-1.8.0/googletest/include/gtest/gtest.h:1510:12: note: in definition of macro 'GTEST_IMPL_CMP_HELPER_'
   if (val1 op val2) {\
            ^
In file included from /usr/include/c++/4.8/random:50:0,
                 from /usr/include/c++/4.8/bits/stl_algo.h:65,
                 from /usr/include/c++/4.8/algorithm:62,
                 from ../3rdparty/googletest-release-1.8.0/googlemock/include/gmock/gmock-actions.h:43,
                 from ../3rdparty/googletest-release-1.8.0/googlemock/include/gmock/gmock.h:58,
                 from ../../src/tests/containerizer/docker_containerizer_tests.cpp:17:
/usr/include/c++/4.8/bits/random.h:1510:5: note: template<class _RandomNumberEngine, long unsigned int __k> bool std::operator!=(const std::shuffle_order_engine<_RandomNumberEngine, __k>&, const std::shuffle_order_engine<_RandomNumberEngine, __k>&)
     operator!=(const std::shuffle_order_engine<_RandomNumberEngine,
     ^
/usr/include/c++/4.8/bits/random.h:1510:5: note:   template argument deduction/substitution failed:
In file included from ../3rdparty/googletest-release-1.8.0/googlemock/include/gmock/internal/gmock-internal-utils.h:47:0,
                 from ../3rdparty/googletest-release-1.8.0/googlemock/include/gmock/gmock-actions.h:46,
                 from ../3rdparty/googletest-release-1.8.0/googlemock/include/gmock/gmock.h:58,
                 from ../../src/tests/containerizer/docker_containerizer_tests.cpp:17:
../3rdparty/googletest-release-1.8.0/googletest/include/gtest/gtest.h:1522:28: note:   'const std::basic_string<char>' is not derived from 'const std::shuffle_order_engine<_RandomNumberEngine, __k>'
 GTEST_IMPL_CMP_HELPER_(NE, !=);
                            ^
../3rdparty/googletest-release-1.8.0/googletest/include/gtest/gtest.h:1510:12: note: in definition of macro 'GTEST_IMPL_CMP_HELPER_'
   if (val1 op val2) {\
            ^
In file included from /usr/include/c++/4.8/random:50:0,
                 from /usr/include/c++/4.8/bits/stl_algo.h:65,
                 from /usr/include/c++/4.8/algorithm:62,
                 from ../3rdparty/googletest-release-1.8.0/googlemock/include/gmock/gmock-actions.h:43,
                 from ../3rdparty/googletest-release-1.8.0/googlemock/include/gmock/gmock.h:58,
                 from ../../src/tests/containerizer/docker_containerizer_tests.cpp:17:
/usr/include/c++/4.8/bits/random.h:1258:5: note: template<class _RandomNumberEngine, long unsigned int __w, class _UIntType> bool std::operator!=(const std::independent_bits_engine<_RandomNumberEngine, __w, _UIntType>&, const std::independent_bits_engine<_RandomNumberEngine, __w, _UIntType>&)
     operator!=(const std::independent_bits_engine<_RandomNumberEngine, __w,
     ^
/usr/include/c++/4.8/bits/random.h:1258:5: note:   template argument deduction/substitution failed:
In file included from ../3rdparty/googletest-release-1.8.0/googlemock/include/gmock/internal/gmock-internal-utils.h:47:0,
                 from ../3rdparty/googletest-release-1.8.0/googlemock/include/gmock/gmock-actions.h:46,
                 from ../3rdparty/googletest-release-1.8.0/googlemock/include/gmock/gmock.h:58,
                 from ../../src/tests/containerizer/docker_containerizer_tests.cpp:17:
../3rdparty/googletest-release-1.8.0/googletest/include/gtest/gtest.h:1522:28: note:   'const std::basic_string<char>' is not derived from 'const std::independent_bits_engine<_RandomNumberEngine, __w, _UIntType>'
 GTEST_IMPL_CMP_HELPER_(NE, !=);
                            ^
../3rdparty/googletest-release-1.8.0/googletest/include/gtest/gtest.h:1510:12: note: in definition of macro 'GTEST_IMPL_CMP_HELPER_'
   if (val1 op val2) {\
            ^
In file included from /usr/include/c++/4.8/random:50:0,
                 from /usr/include/c++/4.8/bits/stl_algo.h:65,
                 from /usr/include/c++/4.8/algorithm:62,
                 from ../3rdparty/googletest-release-1.8.0/googlemock/include/gmock/gmock-actions.h:43,
                 from ../3rdparty/googletest-release-1.8.0/googlemock/include/gmock/gmock.h:58,
                 from ../../src/tests/containerizer/docker_containerizer_tests.cpp:17:
/usr/include/c++/4.8/bits/random.h:1062:5: note: template<class _RandomNumberEngine, long unsigned int __p, long unsigned int __r> bool std::operator!=(const std::discard_block_engine<_RandomNumberEngine, __p, __r>&, const std::discard_block_engine<_RandomNumberEngine, __p, __r>&)
     operator!=(const std::discard_block_engine<_RandomNumberEngine, __p,
     ^
/usr/include/c++/4.8/bits/random.h:1062:5: note:   template argument deduction/substitution failed:
In file included from ../3rdparty/googletest-release-1.8.0/googlemock/include/gmock/internal/gmock-internal-utils.h:47:0,
                 from ../3rdparty/googletest-release-1.8.0/googlemock/include/gmock/gmock-actions.h:46,
                 from ../3rdparty/googletest-release-1.8.0/googlemock/include/gmock/gmock.h:58,
                 from ../../src/tests/containerizer/docker_containerizer_tests.cpp:17:
../3rdparty/googletest-release-1.8.0/googletest/include/gtest/gtest.h:1522:28: note:   'const std::basic_string<char>' is not derived from 'const std::discard_block_engine<_RandomNumberEngine, __p, __r>'
 GTEST_IMPL_CMP_HELPER_(NE, !=);
                            ^
../3rdparty/googletest-release-1.8.0/googletest/include/gtest/gtest.h:1510:12: note: in definition of macro 'GTEST_IMPL_CMP_HELPER_'
   if (val1 op val2) {\
            ^
In file included from /usr/include/c++/4.8/random:50:0,
                 from /usr/include/c++/4.8/bits/stl_algo.h:65,
                 from /usr/include/c++/4.8/algorithm:62,
                 from ../3rdparty/googletest-release-1.8.0/googlemock/include/gmock/gmock-actions.h:43,
                 from ../3rdparty/googletest-release-1.8.0/googlemock/include/gmock/gmock.h:58,
                 from ../../src/tests/containerizer/docker_containerizer_tests.cpp:17:
/usr/include/c++/4.8/bits/random.h:840:5: note: template<class _UIntType, long unsigned int __w, long unsigned int __s, long unsigned int __r> bool std::operator!=(const std::subtract_with_carry_engine<_UIntType, __w, __s, __r>&, const std::subtract_with_carry_engine<_UIntType, __w, __s, __r>&)
     operator!=(const std::subtract_with_carry_engine<_UIntType, __w,
     ^
/usr/include/c++/4.8/bits/random.h:840:5: note:   template argument deduction/substitution failed:
In file included from ../3rdparty/googletest-release-1.8.0/googlemock/include/gmock/internal/gmock-internal-utils.h:47:0,
                 from ../3rdparty/googletest-release-1.8.0/googlemock/include/gmock/gmock-actions.h:46,
                 from ../3rdparty/googletest-release-1.8.0/googlemock/include/gmock/gmock.h:58,
                 from ../../src/tests/containerizer/docker_containerizer_tests.cpp:17:
../3rdparty/googletest-release-1.8.0/googletest/include/gtest/gtest.h:1522:28: note:   'const std::basic_string<char>' is not derived from 'const std::subtract_with_carry_engine<_UIntType, __w, __s, __r>'
 GTEST_IMPL_CMP_HELPER_(NE, !=);
                            ^
../3rdparty/googletest-release-1.8.0/googletest/include/gtest/gtest.h:1510:12: note: in definition of macro 'GTEST_IMPL_CMP_HELPER_'
   if (val1 op val2) {\
            ^
In file included from /usr/include/c++/4.8/random:50:0,
                 from /usr/include/c++/4.8/bits/stl_algo.h:65,
                 from /usr/include/c++/4.8/algorithm:62,
                 from ../3rdparty/googletest-release-1.8.0/googlemock/include/gmock/gmock-actions.h:43,
                 from ../3rdparty/googletest-release-1.8.0/googlemock/include/gmock/gmock.h:58,
                 from ../../src/tests/containerizer/docker_containerizer_tests.cpp:17:
/usr/include/c++/4.8/bits/random.h:641:5: note: template<class _UIntType, long unsigned int __w, long unsigned int __n, long unsigned int __m, long unsigned int __r, _UIntType __a, long unsigned int __u, _UIntType __d, long unsigned int __s, _UIntType __b, long unsigned int __t, _UIntType __c, long unsigned int __l, _UIntType __f> bool std::operator!=(const std::mersenne_twister_engine<_UIntType, __w, __n, __m, __r, __a, __u, __d, __s, __b, __t, __c, __l, __f>&, const std::mersenne_twister_engine<_UIntType, __w, __n, __m, __r, __a, __u, __d, __s, __b, __t, __c, __l, __f>&)
     operator!=(const std::mersenne_twister_engine<_UIntType, __w, __n, __m,
     ^
/usr/include/c++/4.8/bits/random.h:641:5: note:   template argument deduction/substitution failed:
In file included from ../3rdparty/googletest-release-1.8.0/googlemock/include/gmock/internal/gmock-internal-utils.h:47:0,
                 from ../3rdparty/googletest-release-1.8.0/googlemock/include/gmock/gmock-actions.h:46,
                 from ../3rdparty/googletest-release-1.8.0/googlemock/include/gmock/gmock.h:58,
                 from ../../src/tests/containerizer/docker_containerizer_tests.cpp:17:
../3rdparty/googletest-release-1.8.0/googletest/include/gtest/gtest.h:1522:28: note:   'const std::basic_string<char>' is not derived from 'const std::mersenne_twister_engine<_UIntType, __w, __n, __m, __r, __a, __u, __d, __s, __b, __t, __c, __l, __f>'
 GTEST_IMPL_CMP_HELPER_(NE, !=);
                            ^
../3rdparty/googletest-release-1.8.0/googletest/include/gtest/gtest.h:1510:12: note: in definition of macro 'GTEST_IMPL_CMP_HELPER_'
   if (val1 op val2) {\
            ^
In file included from /usr/include/c++/4.8/random:50:0,
                 from /usr/include/c++/4.8/bits/stl_algo.h:65,
                 from /usr/include/c++/4.8/algorithm:62,
                 from ../3rdparty/googletest-release-1.8.0/googlemock/include/gmock/gmock-actions.h:43,
                 from ../3rdparty/googletest-release-1.8.0/googlemock/include/gmock/gmock.h:58,
                 from ../../src/tests/containerizer/docker_containerizer_tests.cpp:17:
/usr/include/c++/4.8/bits/random.h:409:5: note: template<class _UIntType, _UIntType __a, _UIntType __c, _UIntType __m> bool std::operator!=(const std::linear_congruential_engine<_UIntType, __a, __c, __m>&, const std::linear_congruential_engine<_UIntType, __a, __c, __m>&)
     operator!=(const std::linear_congruential_engine<_UIntType, __a,
     ^
/usr/include/c++/4.8/bits/random.h:409:5: note:   template argument deduction/substitution failed:
In file included from ../3rdparty/googletest-release-1.8.0/googlemock/include/gmock/internal/gmock-internal-utils.h:47:0,
                 from ../3rdparty/googletest-release-1.8.0/googlemock/include/gmock/gmock-actions.h:46,
                 from ../3rdparty/googletest-release-1.8.0/googlemock/include/gmock/gmock.h:58,
                 from ../../src/tests/containerizer/docker_containerizer_tests.cpp:17:
../3rdparty/googletest-release-1.8.0/googletest/include/gtest/gtest.h:1522:28: note:   'const std::basic_string<char>' is not derived from 'const std::linear_congruential_engine<_UIntType, __a, __c, __m>'
 GTEST_IMPL_CMP_HELPER_(NE, !=);
                            ^
../3rdparty/googletest-release-1.8.0/googletest/include/gtest/gtest.h:1510:12: note: in definition of macro 'GTEST_IMPL_CMP_HELPER_'
   if (val1 op val2) {\
            ^
In file included from /usr/include/c++/4.8/vector:64:0,
                 from /usr/include/c++/4.8/bits/random.h:34,
                 from /usr/include/c++/4.8/random:50,
                 from /usr/include/c++/4.8/bits/stl_algo.h:65,
                 from /usr/include/c++/4.8/algorithm:62,
                 from ../3rdparty/googletest-release-1.8.0/googlemock/include/gmock/gmock-actions.h:43,
                 from ../3rdparty/googletest-release-1.8.0/googlemock/include/gmock/gmock.h:58,
                 from ../../src/tests/containerizer/docker_containerizer_tests.cpp:17:
/usr/include/c++/4.8/bits/stl_vector.h:1428:5: note: template<class _Tp, class _Alloc> bool std::operator!=(const std::vector<_Tp, _Alloc>&, const std::vector<_Tp, _Alloc>&)
     operator!=(const vector<_Tp, _Alloc>& __x, const vector<_Tp, _Alloc>& __y)
     ^
/usr/include/c++/4.8/bits/stl_vector.h:1428:5: note:   template argument deduction/substitution failed:
In file included from ../3rdparty/googletest-release-1.8.0/googlemock/include/gmock/internal/gmock-internal-utils.h:47:0,
                 from ../3rdparty/googletest-release-1.8.0/googlemock/include/gmock/gmock-actions.h:46,
                 from ../3rdparty/googletest-release-1.8.0/googlemock/include/gmock/gmock.h:58,
                 from ../../src/tests/containerizer/docker_containerizer_tests.cpp:17:
../3rdparty/googletest-release-1.8.0/googletest/include/gtest/gtest.h:1522:28: note:   'const std::basic_string<char>' is not derived from 'const std::vector<_Tp, _Alloc>'
 GTEST_IMPL_CMP_HELPER_(NE, !=);
                            ^
../3rdparty/googletest-release-1.8.0/googletest/include/gtest/gtest.h:1510:12: note: in definition of macro 'GTEST_IMPL_CMP_HELPER_'
   if (val1 op val2) {\
            ^
In file included from /usr/include/c++/4.8/string:52:0,
                 from /usr/include/c++/4.8/random:41,
                 from /usr/include/c++/4.8/bits/stl_algo.h:65,
                 from /usr/include/c++/4.8/algorithm:62,
                 from ../3rdparty/googletest-release-1.8.0/googlemock/include/gmock/gmock-actions.h:43,
                 from ../3rdparty/googletest-release-1.8.0/googlemock/include/gmock/gmock.h:58,
                 from ../../src/tests/containerizer/docker_containerizer_tests.cpp:17:
/usr/include/c++/4.8/bits/basic_string.h:2556:5: note: template<class _CharT, class _Traits, class _Alloc> bool std::operator!=(const std::basic_string<_CharT, _Traits, _Alloc>&, const _CharT*)
     operator!=(const basic_string<_CharT, _Traits, _Alloc>& __lhs,
     ^
/usr/include/c++/4.8/bits/basic_string.h:2556:5: note:   template argument deduction/substitution failed:
In file included from ../3rdparty/googletest-release-1.8.0/googlemock/include/gmock/internal/gmock-internal-utils.h:47:0,
                 from ../3rdparty/googletest-release-1.8.0/googlemock/include/gmock/gmock-actions.h:46,
                 from ../3rdparty/googletest-release-1.8.0/googlemock/include/gmock/gmock.h:58,
                 from ../../src/tests/containerizer/docker_containerizer_tests.cpp:17:
../3rdparty/googletest-release-1.8.0/googletest/include/gtest/gtest.h:1522:28: note:   mismatched types 'const _CharT*' and 'Option<std::basic_string<char> >'
 GTEST_IMPL_CMP_HELPER_(NE, !=);
                            ^
../3rdparty/googletest-release-1.8.0/googletest/include/gtest/gtest.h:1510:12: note: in definition of macro 'GTEST_IMPL_CMP_HELPER_'
   if (val1 op val2) {\
            ^
In file included from /usr/include/c++/4.8/string:52:0,
                 from /usr/include/c++/4.8/random:41,
                 from /usr/include/c++/4.8/bits/stl_algo.h:65,
                 from /usr/include/c++/4.8/algorithm:62,
                 from ../3rdparty/googletest-release-1.8.0/googlemock/include/gmock/gmock-actions.h:43,
                 from ../3rdparty/googletest-release-1.8.0/googlemock/include/gmock/gmock.h:58,
                 from ../../src/tests/containerizer/docker_containerizer_tests.cpp:17:
/usr/include/c++/4.8/bits/basic_string.h:2544:5: note: template<class _CharT, class _Traits, class _Alloc> bool std::operator!=(const _CharT*, const std::basic_string<_CharT, _Traits, _Alloc>&)
     operator!=(const _CharT* __lhs,
     ^
/usr/include/c++/4.8/bits/basic_string.h:2544:5: note:   template argument deduction/substitution failed:
In file included from ../3rdparty/googletest-release-1.8.0/googlemock/include/gmock/internal/gmock-internal-utils.h:47:0,
                 from ../3rdparty/googletest-release-1.8.0/googlemock/include/gmock/gmock-actions.h:46,
                 from ../3rdparty/googletest-release-1.8.0/googlemock/include/gmock/gmock.h:58,
                 from ../../src/tests/containerizer/docker_containerizer_tests.cpp:17:
../3rdparty/googletest-release-1.8.0/googletest/include/gtest/gtest.h:1522:28: note:   mismatched types 'const _CharT*' and 'std::basic_string<char>'
 GTEST_IMPL_CMP_HELPER_(NE, !=);
                            ^
../3rdparty/googletest-release-1.8.0/googletest/include/gtest/gtest.h:1510:12: note: in definition of macro 'GTEST_IMPL_CMP_HELPER_'
   if (val1 op val2) {\
            ^
In file included from /usr/include/c++/4.8/string:52:0,
                 from /usr/include/c++/4.8/random:41,
                 from /usr/include/c++/4.8/bits/stl_algo.h:65,
                 from /usr/include/c++/4.8/algorithm:62,
                 from ../3rdparty/googletest-release-1.8.0/googlemock/include/gmock/gmock-actions.h:43,
                 from ../3rdparty/googletest-release-1.8.0/googlemock/include/gmock/gmock.h:58,
                 from ../../src/tests/containerizer/docker_containerizer_tests.cpp:17:
/usr/include/c++/4.8/bits/basic_string.h:2532:5: note: template<class _CharT, class _Traits, class _Alloc> bool std::operator!=(const std::basic_string<_CharT, _Traits, _Alloc>&, const std::basic_string<_CharT, _Traits, _Alloc>&)
     operator!=(const basic_string<_CharT, _Traits, _Alloc>& __lhs,
     ^
/usr/include/c++/4.8/bits/basic_string.h:2532:5: note:   template argument deduction/substitution failed:
In file included from ../3rdparty/googletest-release-1.8.0/googlemock/include/gmock/internal/gmock-internal-utils.h:47:0,
                 from ../3rdparty/googletest-release-1.8.0/googlemock/include/gmock/gmock-actions.h:46,
                 from ../3rdparty/googletest-release-1.8.0/googlemock/include/gmock/gmock.h:58,
                 from ../../src/tests/containerizer/docker_containerizer_tests.cpp:17:
../3rdparty/googletest-release-1.8.0/googletest/include/gtest/gtest.h:1522:28: note:   'const Option<std::basic_string<char> >' is not derived from 'const std::basic_string<_CharT, _Traits, _Alloc>'
 GTEST_IMPL_CMP_HELPER_(NE, !=);
                            ^
../3rdparty/googletest-release-1.8.0/googletest/include/gtest/gtest.h:1510:12: note: in definition of macro 'GTEST_IMPL_CMP_HELPER_'
   if (val1 op val2) {\
            ^
In file included from /usr/include/c++/4.8/string:41:0,
                 from /usr/include/c++/4.8/random:41,
                 from /usr/include/c++/4.8/bits/stl_algo.h:65,
                 from /usr/include/c++/4.8/algorithm:62,
                 from ../3rdparty/googletest-release-1.8.0/googlemock/include/gmock/gmock-actions.h:43,
                 from ../3rdparty/googletest-release-1.8.0/googlemock/include/gmock/gmock.h:58,
                 from ../../src/tests/containerizer/docker_containerizer_tests.cpp:17:
/usr/include/c++/4.8/bits/allocator.h:143:5: note: template<class _Tp> bool std::operator!=(const std::allocator<_Tp>&, const std::allocator<_Tp>&)
     operator!=(const allocator<_Tp>&, const allocator<_Tp>&)
     ^
/usr/include/c++/4.8/bits/allocator.h:143:5: note:   template argument deduction/substitution failed:
In file included from ../3rdparty/googletest-release-1.8.0/googlemock/include/gmock/internal/gmock-internal-utils.h:47:0,
                 from ../3rdparty/googletest-release-1.8.0/googlemock/include/gmock/gmock-actions.h:46,
                 from ../3rdparty/googletest-release-1.8.0/googlemock/include/gmock/gmock.h:58,
                 from ../../src/tests/containerizer/docker_containerizer_tests.cpp:17:
../3rdparty/googletest-release-1.8.0/googletest/include/gtest/gtest.h:1522:28: note:   'const std::basic_string<char>' is not derived from 'const std::allocator<_Tp>'
 GTEST_IMPL_CMP_HELPER_(NE, !=);
                            ^
../3rdparty/googletest-release-1.8.0/googletest/include/gtest/gtest.h:1510:12: note: in definition of macro 'GTEST_IMPL_CMP_HELPER_'
   if (val1 op val2) {\
            ^
In file included from /usr/include/c++/4.8/string:41:0,
                 from /usr/include/c++/4.8/random:41,
                 from /usr/include/c++/4.8/bits/stl_algo.h:65,
                 from /usr/include/c++/4.8/algorithm:62,
                 from ../3rdparty/googletest-release-1.8.0/googlemock/include/gmock/gmock-actions.h:43,
                 from ../3rdparty/googletest-release-1.8.0/googlemock/include/gmock/gmock.h:58,
                 from ../../src/tests/containerizer/docker_containerizer_tests.cpp:17:
/usr/include/c++/4.8/bits/allocator.h:138:5: note: template<class _T1, class _T2> bool std::operator!=(const std::allocator<_Tp>&, const std::allocator<_Tp>&)
     operator!=(const allocator<_T1>&, const allocator<_T2>&)
     ^
/usr/include/c++/4.8/bits/allocator.h:138:5: note:   template argument deduction/substitution failed:
In file included from ../3rdparty/googletest-release-1.8.0/googlemock/include/gmock/internal/gmock-internal-utils.h:47:0,
                 from ../3rdparty/googletest-release-1.8.0/googlemock/include/gmock/gmock-actions.h:46,
                 from ../3rdparty/googletest-release-1.8.0/googlemock/include/gmock/gmock.h:58,
                 from ../../src/tests/containerizer/docker_containerizer_tests.cpp:17:
../3rdparty/googletest-release-1.8.0/googletest/include/gtest/gtest.h:1522:28: note:   'const std::basic_string<char>' is not derived from 'const std::allocator<_Tp>'
 GTEST_IMPL_CMP_HELPER_(NE, !=);
                            ^
../3rdparty/googletest-release-1.8.0/googletest/include/gtest/gtest.h:1510:12: note: in definition of macro 'GTEST_IMPL_CMP_HELPER_'
   if (val1 op val2) {\
            ^
In file included from /usr/include/c++/4.8/bits/char_traits.h:40:0,
                 from /usr/include/c++/4.8/string:40,
                 from /usr/include/c++/4.8/random:41,
                 from /usr/include/c++/4.8/bits/stl_algo.h:65,
                 from /usr/include/c++/4.8/algorithm:62,
                 from ../3rdparty/googletest-release-1.8.0/googlemock/include/gmock/gmock-actions.h:43,
                 from ../3rdparty/googletest-release-1.8.0/googlemock/include/gmock/gmock.h:58,
                 from ../../src/tests/containerizer/docker_containerizer_tests.cpp:17:
/usr/include/c++/4.8/bits/postypes.h:221:5: note: template<class _StateT> bool std::operator!=(const std::fpos<_StateT>&, const std::fpos<_StateT>&)
     operator!=(const fpos<_StateT>& __lhs, const fpos<_StateT>& __rhs)
     ^
/usr/include/c++/4.8/bits/postypes.h:221:5: note:   template argument deduction/substitution failed:
In file included from ../3rdparty/googletest-release-1.8.0/googlemock/include/gmock/internal/gmock-internal-utils.h:47:0,
                 from ../3rdparty/googletest-release-1.8.0/googlemock/include/gmock/gmock-actions.h:46,
                 from ../3rdparty/googletest-release-1.8.0/googlemock/include/gmock/gmock.h:58,
                 from ../../src/tests/containerizer/docker_containerizer_tests.cpp:17:
../3rdparty/googletest-release-1.8.0/googletest/include/gtest/gtest.h:1522:28: note:   'const std::basic_string<char>' is not derived from 'const std::fpos<_StateT>'
 GTEST_IMPL_CMP_HELPER_(NE, !=);
                            ^
../3rdparty/googletest-release-1.8.0/googletest/include/gtest/gtest.h:1510:12: note: in definition of macro 'GTEST_IMPL_CMP_HELPER_'
   if (val1 op val2) {\
            ^
In file included from /usr/include/c++/4.8/bits/stl_algobase.h:67:0,
                 from /usr/include/c++/4.8/algorithm:61,
                 from ../3rdparty/googletest-release-1.8.0/googlemock/include/gmock/gmock-actions.h:43,
                 from ../3rdparty/googletest-release-1.8.0/googlemock/include/gmock/gmock.h:58,
                 from ../../src/tests/containerizer/docker_containerizer_tests.cpp:17:
/usr/include/c++/4.8/bits/stl_iterator.h:1049:5: note: template<class _Iterator> bool std::operator!=(const std::move_iterator<_Iterator>&, const std::move_iterator<_Iterator>&)
     operator!=(const move_iterator<_Iterator>& __x,
     ^
/usr/include/c++/4.8/bits/stl_iterator.h:1049:5: note:   template argument deduction/substitution failed:
In file included from ../3rdparty/googletest-release-1.8.0/googlemock/include/gmock/internal/gmock-internal-utils.h:47:0,
                 from ../3rdparty/googletest-release-1.8.0/googlemock/include/gmock/gmock-actions.h:46,
                 from ../3rdparty/googletest-release-1.8.0/googlemock/include/gmock/gmock.h:58,
                 from ../../src/tests/containerizer/docker_containerizer_tests.cpp:17:
../3rdparty/googletest-release-1.8.0/googletest/include/gtest/gtest.h:1522:28: note:   'const std::basic_string<char>' is not derived from 'const std::move_iterator<_Iterator>'
 GTEST_IMPL_CMP_HELPER_(NE, !=);
                            ^
../3rdparty/googletest-release-1.8.0/googletest/include/gtest/gtest.h:1510:12: note: in definition of macro 'GTEST_IMPL_CMP_HELPER_'
   if (val1 op val2) {\
            ^
In file included from /usr/include/c++/4.8/bits/stl_algobase.h:67:0,
                 from /usr/include/c++/4.8/algorithm:61,
                 from ../3rdparty/googletest-release-1.8.0/googlemock/include/gmock/gmock-actions.h:43,
                 from ../3rdparty/googletest-release-1.8.0/googlemock/include/gmock/gmock.h:58,
                 from ../../src/tests/containerizer/docker_containerizer_tests.cpp:17:
/usr/include/c++/4.8/bits/stl_iterator.h:1043:5: note: template<class _IteratorL, class _IteratorR> bool std::operator!=(const std::move_iterator<_Iterator>&, const std::move_iterator<_IteratorR>&)
     operator!=(const move_iterator<_IteratorL>& __x,
     ^
/usr/include/c++/4.8/bits/stl_iterator.h:1043:5: note:   template argument deduction/substitution failed:
In file included from ../3rdparty/googletest-release-1.8.0/googlemock/include/gmock/internal/gmock-internal-utils.h:47:0,
                 from ../3rdparty/googletest-release-1.8.0/googlemock/include/gmock/gmock-actions.h:46,
                 from ../3rdparty/googletest-release-1.8.0/googlemock/include/gmock/gmock.h:58,
                 from ../../src/tests/containerizer/docker_containerizer_tests.cpp:17:
../3rdparty/googletest-release-1.8.0/googletest/include/gtest/gtest.h:1522:28: note:   'const std::basic_string<char>' is not derived from 'const std::move_iterator<_Iterator>'
 GTEST_IMPL_CMP_HELPER_(NE, !=);
                            ^
../3rdparty/googletest-release-1.8.0/googletest/include/gtest/gtest.h:1510:12: note: in definition of macro 'GTEST_IMPL_CMP_HELPER_'
   if (val1 op val2) {\
            ^
In file included from /usr/include/c++/4.8/bits/stl_algobase.h:67:0,
                 from /usr/include/c++/4.8/algorithm:61,
                 from ../3rdparty/googletest-release-1.8.0/googlemock/include/gmock/gmock-actions.h:43,
                 from ../3rdparty/googletest-release-1.8.0/googlemock/include/gmock/gmock.h:58,
                 from ../../src/tests/containerizer/docker_containerizer_tests.cpp:17:
/usr/include/c++/4.8/bits/stl_iterator.h:353:5: note: template<class _IteratorL, class _IteratorR> bool std::operator!=(const std::reverse_iterator<_Iterator>&, const std::reverse_iterator<_IteratorR>&)
     operator!=(const reverse_iterator<_IteratorL>& __x,
     ^
/usr/include/c++/4.8/bits/stl_iterator.h:353:5: note:   template argument deduction/substitution failed:
In file included from ../3rdparty/googletest-release-1.8.0/googlemock/include/gmock/internal/gmock-internal-utils.h:47:0,
                 from ../3rdparty/googletest-release-1.8.0/googlemock/include/gmock/gmock-actions.h:46,
                 from ../3rdparty/googletest-release-1.8.0/googlemock/include/gmock/gmock.h:58,
                 from ../../src/tests/containerizer/docker_containerizer_tests.cpp:17:
../3rdparty/googletest-release-1.8.0/googletest/include/gtest/gtest.h:1522:28: note:   'const std::basic_string<char>' is not derived from 'const std::reverse_iterator<_Iterator>'
 GTEST_IMPL_CMP_HELPER_(NE, !=);
                            ^
../3rdparty/googletest-release-1.8.0/googletest/include/gtest/gtest.h:1510:12: note: in definition of macro 'GTEST_IMPL_CMP_HELPER_'
   if (val1 op val2) {\
            ^
In file included from /usr/include/c++/4.8/bits/stl_algobase.h:67:0,
                 from /usr/include/c++/4.8/algorithm:61,
                 from ../3rdparty/googletest-release-1.8.0/googlemock/include/gmock/gmock-actions.h:43,
                 from ../3rdparty/googletest-release-1.8.0/googlemock/include/gmock/gmock.h:58,
                 from ../../src/tests/containerizer/docker_containerizer_tests.cpp:17:
/usr/include/c++/4.8/bits/stl_iterator.h:303:5: note: template<class _Iterator> bool std::operator!=(const std::reverse_iterator<_Iterator>&, const std::reverse_iterator<_Iterator>&)
     operator!=(const reverse_iterator<_Iterator>& __x,
     ^
/usr/include/c++/4.8/bits/stl_iterator.h:303:5: note:   template argument deduction/substitution failed:
In file included from ../3rdparty/googletest-release-1.8.0/googlemock/include/gmock/internal/gmock-internal-utils.h:47:0,
                 from ../3rdparty/googletest-release-1.8.0/googlemock/include/gmock/gmock-actions.h:46,
                 from ../3rdparty/googletest-release-1.8.0/googlemock/include/gmock/gmock.h:58,
                 from ../../src/tests/containerizer/docker_containerizer_tests.cpp:17:
../3rdparty/googletest-release-1.8.0/googletest/include/gtest/gtest.h:1522:28: note:   'const std::basic_string<char>' is not derived from 'const std::reverse_iterator<_Iterator>'
 GTEST_IMPL_CMP_HELPER_(NE, !=);
                            ^
../3rdparty/googletest-release-1.8.0/googletest/include/gtest/gtest.h:1510:12: note: in definition of macro 'GTEST_IMPL_CMP_HELPER_'
   if (val1 op val2) {\
            ^
In file included from /usr/include/c++/4.8/utility:70:0,
                 from /usr/include/c++/4.8/algorithm:60,
                 from ../3rdparty/googletest-release-1.8.0/googlemock/include/gmock/gmock-actions.h:43,
                 from ../3rdparty/googletest-release-1.8.0/googlemock/include/gmock/gmock.h:58,
                 from ../../src/tests/containerizer/docker_containerizer_tests.cpp:17:
/usr/include/c++/4.8/bits/stl_pair.h:227:5: note: template<class _T1, class _T2> constexpr bool std::operator!=(const std::pair<_T1, _T2>&, const std::pair<_T1, _T2>&)
     operator!=(const pair<_T1, _T2>& __x, const pair<_T1, _T2>& __y)
     ^
/usr/include/c++/4.8/bits/stl_pair.h:227:5: note:   template argument deduction/substitution failed:
In file included from ../3rdparty/googletest-release-1.8.0/googlemock/include/gmock/internal/gmock-internal-utils.h:47:0,
                 from ../3rdparty/googletest-release-1.8.0/googlemock/include/gmock/gmock-actions.h:46,
                 from ../3rdparty/googletest-release-1.8.0/googlemock/include/gmock/gmock.h:58,
                 from ../../src/tests/containerizer/docker_containerizer_tests.cpp:17:
../3rdparty/googletest-release-1.8.0/googletest/include/gtest/gtest.h:1522:28: note:   'const std::basic_string<char>' is not derived from 'const std::pair<_T1, _T2>'
 GTEST_IMPL_CMP_HELPER_(NE, !=);
                            ^
../3rdparty/googletest-release-1.8.0/googletest/include/gtest/gtest.h:1510:12: note: in definition of macro 'GTEST_IMPL_CMP_HELPER_'
   if (val1 op val2) {\
            ^
In file included from /usr/include/x86_64-linux-gnu/c++/4.8/bits/c++allocator.h:33:0,
                 from /usr/include/c++/4.8/bits/allocator.h:46,
                 from /usr/include/c++/4.8/string:41,
                 from /usr/include/c++/4.8/random:41,
                 from /usr/include/c++/4.8/bits/stl_algo.h:65,
                 from /usr/include/c++/4.8/algorithm:62,
                 from ../3rdparty/googletest-release-1.8.0/googlemock/include/gmock/gmock-actions.h:43,
                 from ../3rdparty/googletest-release-1.8.0/googlemock/include/gmock/gmock.h:58,
                 from ../../src/tests/containerizer/docker_containerizer_tests.cpp:17:
/usr/include/c++/4.8/ext/new_allocator.h:144:5: note: template<class _Tp> bool __gnu_cxx::operator!=(const __gnu_cxx::new_allocator<_Tp>&, const __gnu_cxx::new_allocator<_Tp>&)
     operator!=(const new_allocator<_Tp>&, const new_allocator<_Tp>&)
     ^
/usr/include/c++/4.8/ext/new_allocator.h:144:5: note:   template argument deduction/substitution failed:
In file included from ../3rdparty/googletest-release-1.8.0/googlemock/include/gmock/internal/gmock-internal-utils.h:47:0,
                 from ../3rdparty/googletest-release-1.8.0/googlemock/include/gmock/gmock-actions.h:46,
                 from ../3rdparty/googletest-release-1.8.0/googlemock/include/gmock/gmock.h:58,
                 from ../../src/tests/containerizer/docker_containerizer_tests.cpp:17:
../3rdparty/googletest-release-1.8.0/googletest/include/gtest/gtest.h:1522:28: note:   'const std::basic_string<char>' is not derived from 'const __gnu_cxx::new_allocator<_Tp>'
 GTEST_IMPL_CMP_HELPER_(NE, !=);
                            ^
../3rdparty/googletest-release-1.8.0/googletest/include/gtest/gtest.h:1510:12: note: in definition of macro 'GTEST_IMPL_CMP_HELPER_'
   if (val1 op val2) {\
            ^
In file included from /usr/include/c++/4.8/bits/stl_algobase.h:67:0,
                 from /usr/include/c++/4.8/algorithm:61,
                 from ../3rdparty/googletest-release-1.8.0/googlemock/include/gmock/gmock-actions.h:43,
                 from ../3rdparty/googletest-release-1.8.0/googlemock/include/gmock/gmock.h:58,
                 from ../../src/tests/containerizer/docker_containerizer_tests.cpp:17:
/usr/include/c++/4.8/bits/stl_iterator.h:823:5: note: template<class _Iterator, class _Container> bool __gnu_cxx::operator!=(const __gnu_cxx::__normal_iterator<_Iterator, _Container>&, const __gnu_cxx::__normal_iterator<_Iterator, _Container>&)
     operator!=(const __normal_iterator<_Iterator, _Container>& __lhs,
     ^
/usr/include/c++/4.8/bits/stl_iterator.h:823:5: note:   template argument deduction/substitution failed:
In file included from ../3rdparty/googletest-release-1.8.0/googlemock/include/gmock/internal/gmock-internal-utils.h:47:0,
                 from ../3rdparty/googletest-release-1.8.0/googlemock/include/gmock/gmock-actions.h:46,
                 from ../3rdparty/googletest-release-1.8.0/googlemock/include/gmock/gmock.h:58,
                 from ../../src/tests/containerizer/docker_containerizer_tests.cpp:17:
../3rdparty/googletest-release-1.8.0/googletest/include/gtest/gtest.h:1522:28: note:   'const std::basic_string<char>' is not derived from 'const __gnu_cxx::__normal_iterator<_Iterator, _Container>'
 GTEST_IMPL_CMP_HELPER_(NE, !=);
                            ^
../3rdparty/googletest-release-1.8.0/googletest/include/gtest/gtest.h:1510:12: note: in definition of macro 'GTEST_IMPL_CMP_HELPER_'
   if (val1 op val2) {\
            ^
In file included from /usr/include/c++/4.8/bits/stl_algobase.h:67:0,
                 from /usr/include/c++/4.8/algorithm:61,
                 from ../3rdparty/googletest-release-1.8.0/googlemock/include/gmock/gmock-actions.h:43,
                 from ../3rdparty/googletest-release-1.8.0/googlemock/include/gmock/gmock.h:58,
                 from ../../src/tests/containerizer/docker_containerizer_tests.cpp:17:
/usr/include/c++/4.8/bits/stl_iterator.h:817:5: note: template<class _IteratorL, class _IteratorR, class _Container> bool __gnu_cxx::operator!=(const __gnu_cxx::__normal_iterator<_IteratorL, _Container>&, const __gnu_cxx::__normal_iterator<_IteratorR, _Container>&)
     operator!=(const __normal_iterator<_IteratorL, _Container>& __lhs,
     ^
/usr/include/c++/4.8/bits/stl_iterator.h:817:5: note:   template argument deduction/substitution failed:
In file included from ../3rdparty/googletest-release-1.8.0/googlemock/include/gmock/internal/gmock-internal-utils.h:47:0,
                 from ../3rdparty/googletest-release-1.8.0/googlemock/include/gmock/gmock-actions.h:46,
                 from ../3rdparty/googletest-release-1.8.0/googlemock/include/gmock/gmock.h:58,
                 from ../../src/tests/containerizer/docker_containerizer_tests.cpp:17:
../3rdparty/googletest-release-1.8.0/googletest/include/gtest/gtest.h:1522:28: note:   'const std::basic_string<char>' is not derived from 'const __gnu_cxx::__normal_iterator<_IteratorL, _Container>'
 GTEST_IMPL_CMP_HELPER_(NE, !=);
                            ^
../3rdparty/googletest-release-1.8.0/googletest/include/gtest/gtest.h:1510:12: note: in definition of macro 'GTEST_IMPL_CMP_HELPER_'
   if (val1 op val2) {\
            ^
In file included from ../../3rdparty/stout/include/stout/flags/flags.hpp:31:0,
                 from ../../3rdparty/stout/include/stout/flags.hpp:16,
                 from ../../3rdparty/libprocess/include/process/subprocess.hpp:23,
                 from ../../include/mesos/slave/containerizer.hpp:23,
                 from ../../include/mesos/slave/container_logger.hpp:26,
                 from ../../src/tests/containerizer/docker_containerizer_tests.cpp:21:
../../3rdparty/stout/include/stout/path.hpp:487:13: note: bool operator!=(const Path&, const Path&)
 inline bool operator!=(const Path& left, const Path& right)
             ^
../../3rdparty/stout/include/stout/path.hpp:487:13: note:   no known conversion for argument 1 from 'const std::basic_string<char>' to 'const Path&'
g++ -DPACKAGE_NAME=\"mesos\" -DPACKAGE_TARNAME=\"mesos\" -DPACKAGE_VERSION=\"1.10.0\" -DPACKAGE_STRING=\"mesos\ 1.10.0\" -DPACKAGE_BUGREPORT=\"\" -DPACKAGE_URL=\"\" -DPACKAGE=\"mesos\" -DVERSION=\"1.10.0\" -DSTDC_HEADERS=1 -DHAVE_SYS_TYPES_H=1 -DHAVE_SYS_STAT_H=1 -DHAVE_STDLIB_H=1 -DHAVE_STRING_H=1 -DHAVE_MEMORY_H=1 -DHAVE_STRINGS_H=1 -DHAVE_INTTYPES_H=1 -DHAVE_STDINT_H=1 -DHAVE_UNISTD_H=1 -DHAVE_DLFCN_H=1 -DLT_OBJDIR=\".libs/\" -DHAVE_CXX11=1 -DHAVE_PTHREAD_PRIO_INHERIT=1 -DHAVE_PTHREAD=1 -DHAVE_OPENSSL_SSL_H=1 -DHAVE_FTS_H=1 -DHAVE_APR_POOLS_H=1 -DHAVE_LIBAPR_1=1 -DHAVE_LIBCURL=1 -DMESOS_HAS_JAVA=1 -DHAVE_LIBSASL2=1 -DHAVE_SVN_VERSION_H=1 -DHAVE_LIBSVN_SUBR_1=1 -DHAVE_SVN_DELTA_H=1 -DHAVE_LIBSVN_DELTA_1=1 -DHAVE_ZLIB_H=1 -DHAVE_LIBZ=1 -DHAVE_PYTHON=\"2.7\" -DMESOS_HAS_PYTHON=1 -I. -I../../src   -Werror -DLIBDIR=\"/mesos/mesos-1.10.0/_inst/lib\" -DPKGLIBEXECDIR=\"/mesos/mesos-1.10.0/_inst/libexec/mesos\" -DPKGDATADIR=\"/mesos/mesos-1.10.0/_inst/share/mesos\" -DPKGMODULEDIR=\"/mesos/
 mesos-1.10.0/_inst/lib/mesos/modules\" -I../../include -I../include -I../include/mesos -D__STDC_FORMAT_MACROS -I../3rdparty/boost-1.65.0 -I../3rdparty/concurrentqueue-7b69a8f -I../3rdparty/elfio-3.2 -I../3rdparty/glog-0.4.0/src -I../3rdparty/grpc-1.10.0/include -I../3rdparty/leveldb-1.19/include -I../3rdparty/libarchive-3.3.2/libarchive/ -I../../3rdparty/libprocess/include  -I../3rdparty/nvml-352.79 -I../3rdparty/picojson-1.3.0 -I../3rdparty/protobuf-3.5.0/src -I../3rdparty/rapidjson-1.1.0/include -I../../3rdparty/stout/include -I../3rdparty/zookeeper-3.4.8/src/c/include -I../3rdparty/zookeeper-3.4.8/src/c/generated -DSOURCE_DIR=\"/mesos/mesos-1.10.0/_build/..\" -DBUILD_DIR=\"/mesos/mesos-1.10.0/_build\" -I../3rdparty/googletest-release-1.8.0/googletest/include -I../3rdparty/googletest-release-1.8.0/googlemock/include -DTESTLIBEXECDIR=\"/mesos/mesos-1.10.0/_inst/libexec/mesos/tests\" -DSBINDIR=\"/mesos/mesos-1.10.0/_inst/sbin\" -I/usr/lib/jvm/java-7-openjdk-amd64/include -I/usr/lib/
 jvm/java-7-openjdk-amd64/include/linux -DZOOKEEPER_VERSION=\"3.4.8\" -I/usr/include/subversion-1 -I/usr/include/apr-1 -I/usr/include/apr-1.0	       -pthread -Wall -Wsign-compare -Wformat-security -fstack-protector -fPIC -fPIE -g1 -O0 -Wno-unused-local-typedefs -std=c++11 -c -o tests/containerizer/mesos_tests-memory_isolator_tests.o `test -f 'tests/containerizer/memory_isolator_tests.cpp' || echo '../../src/'`tests/containerizer/memory_isolator_tests.cpp
In file included from ../3rdparty/googletest-release-1.8.0/googlemock/include/gmock/internal/gmock-internal-utils.h:47:0,
                 from ../3rdparty/googletest-release-1.8.0/googlemock/include/gmock/gmock-actions.h:46,
                 from ../3rdparty/googletest-release-1.8.0/googlemock/include/gmock/gmock.h:58,
                 from ../../src/tests/containerizer/docker_containerizer_tests.cpp:17:
../3rdparty/googletest-release-1.8.0/googletest/include/gtest/gtest.h: In function 'testing::AssertionResult testing::internal::CmpHelperNE(const char*, const char*, const T1&, const T2&) [with T1 = std::basic_string<char>; T2 = Option<std::basic_string<char> >]':
../3rdparty/googletest-release-1.8.0/googletest/include/gtest/gtest.h:1515:1: error: control reaches end of non-void function [-Werror=return-type]
 }\
 ^
../3rdparty/googletest-release-1.8.0/googletest/include/gtest/gtest.h:1522:1: note: in expansion of macro 'GTEST_IMPL_CMP_HELPER_'
 GTEST_IMPL_CMP_HELPER_(NE, !=);
 ^
cc1plus: all warnings being treated as errors
make[4]: *** [tests/containerizer/mesos_tests-docker_containerizer_tests.o] Error 1
make[4]: *** Waiting for unfinished jobs....
make[4]: Leaving directory `/mesos/mesos-1.10.0/_build/src'
make[3]: *** [check-am] Error 2
make[3]: Leaving directory `/mesos/mesos-1.10.0/_build/src'
make[2]: *** [check] Error 2
make[2]: Leaving directory `/mesos/mesos-1.10.0/_build/src'
make[1]: *** [check-recursive] Error 1
make[1]: Leaving directory `/mesos/mesos-1.10.0/_build'
make: *** [distcheck] Error 1
+ docker rmi --force mesos-1578629772-21427
Untagged: mesos-1578629772-21427:latest
Deleted: sha256:04fe9e92abaa08a02368c5a65f8f4e3dbdbfb80bed9bacab69c3560bf46998d2
Deleted: sha256:8ba878169171f316eaf4703298c3d556d137d0df603ff1646839ca053f7d9c02
Deleted: sha256:7adf32ab46108d35590403cd6d55d05ea654d72832dca0cd2aadb23258a04237
Deleted: sha256:5130cb16f5ff8baee1f374ca85a3673a3c94247bd725dccf1ec2aa74c23909ba
Deleted: sha256:352fa6f654ce2f10630faa8c78a2ea89f5885d120c4b867f00d7df202116fd77
Deleted: sha256:6a1347b7767fde66c6a2d346c6428de99521bd7c94be76d1fc7e5a23e6a930ea
Deleted: sha256:a37dd15e736791913ed2c7708f3b6ba1ebec1f857d893fc5ced03738e9e9912a
Deleted: sha256:78e830424c249ebb428be59f112201b64350020bc897700e8cf6003c52af7984
Deleted: sha256:b45200b513c93d498b9ce7137dfd5c16cfb3448962dc884805b9452085991034
Deleted: sha256:a3f7de2e9046b626791e21878cbc40b9f1c8a7d1432d94f59254215c99d1a5aa
Deleted: sha256:dde7aa3efcf0446cdaedaf7ad88c166459be737762ac8b1f3e0e1e232f98f45d
Deleted: sha256:7124f3c1efcd31bdc451546a4218872c96575230def4ac93d2a85f9d44048577
Deleted: sha256:470fc947fd1d24e3d0364bcc9dd51badc7cf4edfb07adef70d432ec7099d8271
Deleted: sha256:b570ed40f7fddd72a19d2077b6a9fac86e32c3fe28c297e2151e9eea8f6f0d48
Deleted: sha256:3451c89291744a1ec2c1669bfacd5c692a3dc07c489d6b42d02ce53ec2462c4b
Deleted: sha256:ce6be2ef3496264bbf34fe466252c14dffbe58ede0f352d12e028584d27ac7ad
Deleted: sha256:b2bd4b0f6233997c16eeb00117ddddaa203ba656d6a714a497327995266d67f2
Deleted: sha256:28477afbc5b58537bccb7d9159dccc17082da6ce99345ef21c29454a3c8e2b80
Deleted: sha256:bd9e1c926d3811fd91e93b6488e27f81db6890cbf6a298b90c092e2744911ebd
Deleted: sha256:a156ae026ba4348a2364ddbc96f039c3bfa47ace267abaa44d47e88db1742ae5
Deleted: sha256:879a1c29795f6c63c912cb1ca7c924b9e1d78ceec95a2d05a80ee4eb97625cef
Deleted: sha256:1f82e6bf09bec84e01285340e7eaec2bc6d3dae5466f16327ebe8fe170eb8730
Deleted: sha256:983ea9e37a95b1fda93bc95010c13d5ee9fcf954a93b7f93e7364230098ed309
Deleted: sha256:5079b7881df185419cf32c49bb29bd0e0bffd8c5638e63168c7171877b673f6d
Deleted: sha256:6492ec74743f555ddf32d8e5fe33050b1f4ae6d946e7fbb1489b043465d475c7
Deleted: sha256:ad547aadbf65f021b8968a5631af8dd48df8a17b7493ccf695710861e32a01bf
Deleted: sha256:c5bee6ee66a92f39972292f92e505730785fc4eb5c99c2d73b466d0997e52ff3
Deleted: sha256:45f5555c29ca3e4d09abe9a9d0ae4628c8f870b2e2491928d656ca7170d8dddc
Deleted: sha256:2532db227c87b7c364158def22a202c572293409430b59d5c88d376021421321
Deleted: sha256:c57d00b38cad599c32f7bd644182af5eedf3bee2c6df07f203129970b98e8ca4
Deleted: sha256:dbcea35824626cc538b29a3936d599d856eb8d6df76080bce9a1a985a65ed8eb

Full log: https://builds.apache.org/job/Mesos-Reviewbot-Linux/6352/console

- Mesos Reviewbot


On Dec. 3, 2019, 6:34 p.m., Benno Evers wrote:
> 
> -----------------------------------------------------------
> This is an automatically generated e-mail. To reply, visit:
> https://reviews.apache.org/r/71867/
> -----------------------------------------------------------
> 
> (Updated Dec. 3, 2019, 6:34 p.m.)
> 
> 
> Review request for mesos and Benjamin Bannier.
> 
> 
> Repository: mesos
> 
> 
> Description
> -------
> 
> Note that currently we cannot test the code, because that
> would require launching an executor inside a docker container,
> which seems to be unprecedented in unit tests.
> 
> 
> Diffs
> -----
> 
>   src/slave/containerizer/docker.hpp 0349f537cef9651427e0e3ed33fd693107e07aa0 
>   src/slave/containerizer/docker.cpp 2a9b2ffcbd01ae916839ae43c8342285ac3e14a2 
>   src/tests/containerizer/docker_containerizer_tests.cpp 689a7220a09f2a58dffdf0dc9fd9f0548600be0e 
> 
> 
> Diff: https://reviews.apache.org/r/71867/diff/1/
> 
> 
> Testing
> -------
> 
> 
> Thanks,
> 
> Benno Evers
> 
>


Mime
  • Unnamed multipart/alternative (inline, None, 0 bytes)
View raw message