mesos-reviews mailing list archives

Site index · List index
Message view « Date » · « Thread »
Top « Date » · « Thread »
From Mesos Reviewbot <revi...@mesos.apache.org>
Subject Re: Review Request 71159: Updated quota related endpoints to return quota configurations.
Date Fri, 26 Jul 2019 03:04:14 GMT

-----------------------------------------------------------
This is an automatically generated e-mail. To reply, visit:
https://reviews.apache.org/r/71159/#review216873
-----------------------------------------------------------



Bad patch!

Reviews applied: [71158, 71159]

Failed command: ['bash', '-c', "set -o pipefail; export OS='ubuntu:14.04' BUILDTOOL='autotools' COMPILER='gcc' CONFIGURATION='--verbose --disable-libtool-wrappers --disable-parallel-test-execution' ENVIRONMENT='GLOG_v=1 MESOS_VERBOSE=1'; ./support/docker-build.sh 2>&1 | tee build_71159"]

Error:
...<truncated>...
tests.cpp' || echo '../../../3rdparty/stout/'`tests/interval_tests.cpp
g++ -DPACKAGE_NAME=\"mesos\" -DPACKAGE_TARNAME=\"mesos\" -DPACKAGE_VERSION=\"1.9.0\" -DPACKAGE_STRING=\"mesos\ 1.9.0\" -DPACKAGE_BUGREPORT=\"\" -DPACKAGE_URL=\"\" -DPACKAGE=\"mesos\" -DVERSION=\"1.9.0\" -DSTDC_HEADERS=1 -DHAVE_SYS_TYPES_H=1 -DHAVE_SYS_STAT_H=1 -DHAVE_STDLIB_H=1 -DHAVE_STRING_H=1 -DHAVE_MEMORY_H=1 -DHAVE_STRINGS_H=1 -DHAVE_INTTYPES_H=1 -DHAVE_STDINT_H=1 -DHAVE_UNISTD_H=1 -DHAVE_DLFCN_H=1 -DLT_OBJDIR=\".libs/\" -DHAVE_CXX11=1 -DHAVE_PTHREAD_PRIO_INHERIT=1 -DHAVE_PTHREAD=1 -DHAVE_OPENSSL_SSL_H=1 -DHAVE_FTS_H=1 -DHAVE_APR_POOLS_H=1 -DHAVE_LIBAPR_1=1 -DHAVE_LIBCURL=1 -DMESOS_HAS_JAVA=1 -DHAVE_LIBSASL2=1 -DHAVE_SVN_VERSION_H=1 -DHAVE_LIBSVN_SUBR_1=1 -DHAVE_SVN_DELTA_H=1 -DHAVE_LIBSVN_DELTA_1=1 -DHAVE_ZLIB_H=1 -DHAVE_LIBZ=1 -DHAVE_PYTHON=\"2.7\" -DMESOS_HAS_PYTHON=1 -I. -I../../../3rdparty/stout  -I../../../3rdparty/stout/include -I../boost-1.65.0 -I../elfio-3.2 -I../glog-0.4.0/src -I../googletest-release-1.8.0/googlemock/include -I../googletest-release-1.8.0/googletest/inc
 lude -I../libarchive-3.3.2/libarchive -D__STDC_FORMAT_MACROS -I../picojson-1.3.0 -I../protobuf-3.5.0/src -I../rapidjson-1.1.0/include  -I/usr/include/subversion-1 -I/usr/include/apr-1 -I/usr/include/apr-1.0	       -Wall -Wsign-compare -Wformat-security -fstack-protector -fPIC -fPIE -g1 -O0 -Wno-unused-local-typedefs -std=c++11 -c -o stout_tests-ip_tests.o `test -f 'tests/ip_tests.cpp' || echo '../../../3rdparty/stout/'`tests/ip_tests.cpp
g++ -DPACKAGE_NAME=\"mesos\" -DPACKAGE_TARNAME=\"mesos\" -DPACKAGE_VERSION=\"1.9.0\" -DPACKAGE_STRING=\"mesos\ 1.9.0\" -DPACKAGE_BUGREPORT=\"\" -DPACKAGE_URL=\"\" -DPACKAGE=\"mesos\" -DVERSION=\"1.9.0\" -DSTDC_HEADERS=1 -DHAVE_SYS_TYPES_H=1 -DHAVE_SYS_STAT_H=1 -DHAVE_STDLIB_H=1 -DHAVE_STRING_H=1 -DHAVE_MEMORY_H=1 -DHAVE_STRINGS_H=1 -DHAVE_INTTYPES_H=1 -DHAVE_STDINT_H=1 -DHAVE_UNISTD_H=1 -DHAVE_DLFCN_H=1 -DLT_OBJDIR=\".libs/\" -DHAVE_CXX11=1 -DHAVE_PTHREAD_PRIO_INHERIT=1 -DHAVE_PTHREAD=1 -DHAVE_OPENSSL_SSL_H=1 -DHAVE_FTS_H=1 -DHAVE_APR_POOLS_H=1 -DHAVE_LIBAPR_1=1 -DHAVE_LIBCURL=1 -DMESOS_HAS_JAVA=1 -DHAVE_LIBSASL2=1 -DHAVE_SVN_VERSION_H=1 -DHAVE_LIBSVN_SUBR_1=1 -DHAVE_SVN_DELTA_H=1 -DHAVE_LIBSVN_DELTA_1=1 -DHAVE_ZLIB_H=1 -DHAVE_LIBZ=1 -DHAVE_PYTHON=\"2.7\" -DMESOS_HAS_PYTHON=1 -I. -I../../../3rdparty/stout  -I../../../3rdparty/stout/include -I../boost-1.65.0 -I../elfio-3.2 -I../glog-0.4.0/src -I../googletest-release-1.8.0/googlemock/include -I../googletest-release-1.8.0/googletest/inc
 lude -I../libarchive-3.3.2/libarchive -D__STDC_FORMAT_MACROS -I../picojson-1.3.0 -I../protobuf-3.5.0/src -I../rapidjson-1.1.0/include  -I/usr/include/subversion-1 -I/usr/include/apr-1 -I/usr/include/apr-1.0	       -Wall -Wsign-compare -Wformat-security -fstack-protector -fPIC -fPIE -g1 -O0 -Wno-unused-local-typedefs -std=c++11 -c -o stout_tests-json_tests.o `test -f 'tests/json_tests.cpp' || echo '../../../3rdparty/stout/'`tests/json_tests.cpp
g++ -DPACKAGE_NAME=\"mesos\" -DPACKAGE_TARNAME=\"mesos\" -DPACKAGE_VERSION=\"1.9.0\" -DPACKAGE_STRING=\"mesos\ 1.9.0\" -DPACKAGE_BUGREPORT=\"\" -DPACKAGE_URL=\"\" -DPACKAGE=\"mesos\" -DVERSION=\"1.9.0\" -DSTDC_HEADERS=1 -DHAVE_SYS_TYPES_H=1 -DHAVE_SYS_STAT_H=1 -DHAVE_STDLIB_H=1 -DHAVE_STRING_H=1 -DHAVE_MEMORY_H=1 -DHAVE_STRINGS_H=1 -DHAVE_INTTYPES_H=1 -DHAVE_STDINT_H=1 -DHAVE_UNISTD_H=1 -DHAVE_DLFCN_H=1 -DLT_OBJDIR=\".libs/\" -DHAVE_CXX11=1 -DHAVE_PTHREAD_PRIO_INHERIT=1 -DHAVE_PTHREAD=1 -DHAVE_OPENSSL_SSL_H=1 -DHAVE_FTS_H=1 -DHAVE_APR_POOLS_H=1 -DHAVE_LIBAPR_1=1 -DHAVE_LIBCURL=1 -DMESOS_HAS_JAVA=1 -DHAVE_LIBSASL2=1 -DHAVE_SVN_VERSION_H=1 -DHAVE_LIBSVN_SUBR_1=1 -DHAVE_SVN_DELTA_H=1 -DHAVE_LIBSVN_DELTA_1=1 -DHAVE_ZLIB_H=1 -DHAVE_LIBZ=1 -DHAVE_PYTHON=\"2.7\" -DMESOS_HAS_PYTHON=1 -I. -I../../../3rdparty/stout  -I../../../3rdparty/stout/include -I../boost-1.65.0 -I../elfio-3.2 -I../glog-0.4.0/src -I../googletest-release-1.8.0/googlemock/include -I../googletest-release-1.8.0/googletest/inc
 lude -I../libarchive-3.3.2/libarchive -D__STDC_FORMAT_MACROS -I../picojson-1.3.0 -I../protobuf-3.5.0/src -I../rapidjson-1.1.0/include  -I/usr/include/subversion-1 -I/usr/include/apr-1 -I/usr/include/apr-1.0	       -Wall -Wsign-compare -Wformat-security -fstack-protector -fPIC -fPIE -g1 -O0 -Wno-unused-local-typedefs -std=c++11 -c -o stout_tests-jsonify_tests.o `test -f 'tests/jsonify_tests.cpp' || echo '../../../3rdparty/stout/'`tests/jsonify_tests.cpp
g++ -DPACKAGE_NAME=\"mesos\" -DPACKAGE_TARNAME=\"mesos\" -DPACKAGE_VERSION=\"1.9.0\" -DPACKAGE_STRING=\"mesos\ 1.9.0\" -DPACKAGE_BUGREPORT=\"\" -DPACKAGE_URL=\"\" -DPACKAGE=\"mesos\" -DVERSION=\"1.9.0\" -DSTDC_HEADERS=1 -DHAVE_SYS_TYPES_H=1 -DHAVE_SYS_STAT_H=1 -DHAVE_STDLIB_H=1 -DHAVE_STRING_H=1 -DHAVE_MEMORY_H=1 -DHAVE_STRINGS_H=1 -DHAVE_INTTYPES_H=1 -DHAVE_STDINT_H=1 -DHAVE_UNISTD_H=1 -DHAVE_DLFCN_H=1 -DLT_OBJDIR=\".libs/\" -DHAVE_CXX11=1 -DHAVE_PTHREAD_PRIO_INHERIT=1 -DHAVE_PTHREAD=1 -DHAVE_OPENSSL_SSL_H=1 -DHAVE_FTS_H=1 -DHAVE_APR_POOLS_H=1 -DHAVE_LIBAPR_1=1 -DHAVE_LIBCURL=1 -DMESOS_HAS_JAVA=1 -DHAVE_LIBSASL2=1 -DHAVE_SVN_VERSION_H=1 -DHAVE_LIBSVN_SUBR_1=1 -DHAVE_SVN_DELTA_H=1 -DHAVE_LIBSVN_DELTA_1=1 -DHAVE_ZLIB_H=1 -DHAVE_LIBZ=1 -DHAVE_PYTHON=\"2.7\" -DMESOS_HAS_PYTHON=1 -I. -I../../../3rdparty/stout  -I../../../3rdparty/stout/include -I../boost-1.65.0 -I../elfio-3.2 -I../glog-0.4.0/src -I../googletest-release-1.8.0/googlemock/include -I../googletest-release-1.8.0/googletest/inc
 lude -I../libarchive-3.3.2/libarchive -D__STDC_FORMAT_MACROS -I../picojson-1.3.0 -I../protobuf-3.5.0/src -I../rapidjson-1.1.0/include  -I/usr/include/subversion-1 -I/usr/include/apr-1 -I/usr/include/apr-1.0	       -Wall -Wsign-compare -Wformat-security -fstack-protector -fPIC -fPIE -g1 -O0 -Wno-unused-local-typedefs -std=c++11 -c -o stout_tests-lambda_tests.o `test -f 'tests/lambda_tests.cpp' || echo '../../../3rdparty/stout/'`tests/lambda_tests.cpp
g++ -DPACKAGE_NAME=\"mesos\" -DPACKAGE_TARNAME=\"mesos\" -DPACKAGE_VERSION=\"1.9.0\" -DPACKAGE_STRING=\"mesos\ 1.9.0\" -DPACKAGE_BUGREPORT=\"\" -DPACKAGE_URL=\"\" -DPACKAGE=\"mesos\" -DVERSION=\"1.9.0\" -DSTDC_HEADERS=1 -DHAVE_SYS_TYPES_H=1 -DHAVE_SYS_STAT_H=1 -DHAVE_STDLIB_H=1 -DHAVE_STRING_H=1 -DHAVE_MEMORY_H=1 -DHAVE_STRINGS_H=1 -DHAVE_INTTYPES_H=1 -DHAVE_STDINT_H=1 -DHAVE_UNISTD_H=1 -DHAVE_DLFCN_H=1 -DLT_OBJDIR=\".libs/\" -DHAVE_CXX11=1 -DHAVE_PTHREAD_PRIO_INHERIT=1 -DHAVE_PTHREAD=1 -DHAVE_OPENSSL_SSL_H=1 -DHAVE_FTS_H=1 -DHAVE_APR_POOLS_H=1 -DHAVE_LIBAPR_1=1 -DHAVE_LIBCURL=1 -DMESOS_HAS_JAVA=1 -DHAVE_LIBSASL2=1 -DHAVE_SVN_VERSION_H=1 -DHAVE_LIBSVN_SUBR_1=1 -DHAVE_SVN_DELTA_H=1 -DHAVE_LIBSVN_DELTA_1=1 -DHAVE_ZLIB_H=1 -DHAVE_LIBZ=1 -DHAVE_PYTHON=\"2.7\" -DMESOS_HAS_PYTHON=1 -I. -I../../../3rdparty/stout  -I../../../3rdparty/stout/include -I../boost-1.65.0 -I../elfio-3.2 -I../glog-0.4.0/src -I../googletest-release-1.8.0/googlemock/include -I../googletest-release-1.8.0/googletest/inc
 lude -I../libarchive-3.3.2/libarchive -D__STDC_FORMAT_MACROS -I../picojson-1.3.0 -I../protobuf-3.5.0/src -I../rapidjson-1.1.0/include  -I/usr/include/subversion-1 -I/usr/include/apr-1 -I/usr/include/apr-1.0	       -Wall -Wsign-compare -Wformat-security -fstack-protector -fPIC -fPIE -g1 -O0 -Wno-unused-local-typedefs -std=c++11 -c -o stout_tests-linkedhashmap_tests.o `test -f 'tests/linkedhashmap_tests.cpp' || echo '../../../3rdparty/stout/'`tests/linkedhashmap_tests.cpp
g++ -DPACKAGE_NAME=\"mesos\" -DPACKAGE_TARNAME=\"mesos\" -DPACKAGE_VERSION=\"1.9.0\" -DPACKAGE_STRING=\"mesos\ 1.9.0\" -DPACKAGE_BUGREPORT=\"\" -DPACKAGE_URL=\"\" -DPACKAGE=\"mesos\" -DVERSION=\"1.9.0\" -DSTDC_HEADERS=1 -DHAVE_SYS_TYPES_H=1 -DHAVE_SYS_STAT_H=1 -DHAVE_STDLIB_H=1 -DHAVE_STRING_H=1 -DHAVE_MEMORY_H=1 -DHAVE_STRINGS_H=1 -DHAVE_INTTYPES_H=1 -DHAVE_STDINT_H=1 -DHAVE_UNISTD_H=1 -DHAVE_DLFCN_H=1 -DLT_OBJDIR=\".libs/\" -DHAVE_CXX11=1 -DHAVE_PTHREAD_PRIO_INHERIT=1 -DHAVE_PTHREAD=1 -DHAVE_OPENSSL_SSL_H=1 -DHAVE_FTS_H=1 -DHAVE_APR_POOLS_H=1 -DHAVE_LIBAPR_1=1 -DHAVE_LIBCURL=1 -DMESOS_HAS_JAVA=1 -DHAVE_LIBSASL2=1 -DHAVE_SVN_VERSION_H=1 -DHAVE_LIBSVN_SUBR_1=1 -DHAVE_SVN_DELTA_H=1 -DHAVE_LIBSVN_DELTA_1=1 -DHAVE_ZLIB_H=1 -DHAVE_LIBZ=1 -DHAVE_PYTHON=\"2.7\" -DMESOS_HAS_PYTHON=1 -I. -I../../../3rdparty/stout  -I../../../3rdparty/stout/include -I../boost-1.65.0 -I../elfio-3.2 -I../glog-0.4.0/src -I../googletest-release-1.8.0/googlemock/include -I../googletest-release-1.8.0/googletest/inc
 lude -I../libarchive-3.3.2/libarchive -D__STDC_FORMAT_MACROS -I../picojson-1.3.0 -I../protobuf-3.5.0/src -I../rapidjson-1.1.0/include  -I/usr/include/subversion-1 -I/usr/include/apr-1 -I/usr/include/apr-1.0	       -Wall -Wsign-compare -Wformat-security -fstack-protector -fPIC -fPIE -g1 -O0 -Wno-unused-local-typedefs -std=c++11 -c -o stout_tests-mac_tests.o `test -f 'tests/mac_tests.cpp' || echo '../../../3rdparty/stout/'`tests/mac_tests.cpp
g++ -DPACKAGE_NAME=\"mesos\" -DPACKAGE_TARNAME=\"mesos\" -DPACKAGE_VERSION=\"1.9.0\" -DPACKAGE_STRING=\"mesos\ 1.9.0\" -DPACKAGE_BUGREPORT=\"\" -DPACKAGE_URL=\"\" -DPACKAGE=\"mesos\" -DVERSION=\"1.9.0\" -DSTDC_HEADERS=1 -DHAVE_SYS_TYPES_H=1 -DHAVE_SYS_STAT_H=1 -DHAVE_STDLIB_H=1 -DHAVE_STRING_H=1 -DHAVE_MEMORY_H=1 -DHAVE_STRINGS_H=1 -DHAVE_INTTYPES_H=1 -DHAVE_STDINT_H=1 -DHAVE_UNISTD_H=1 -DHAVE_DLFCN_H=1 -DLT_OBJDIR=\".libs/\" -DHAVE_CXX11=1 -DHAVE_PTHREAD_PRIO_INHERIT=1 -DHAVE_PTHREAD=1 -DHAVE_OPENSSL_SSL_H=1 -DHAVE_FTS_H=1 -DHAVE_APR_POOLS_H=1 -DHAVE_LIBAPR_1=1 -DHAVE_LIBCURL=1 -DMESOS_HAS_JAVA=1 -DHAVE_LIBSASL2=1 -DHAVE_SVN_VERSION_H=1 -DHAVE_LIBSVN_SUBR_1=1 -DHAVE_SVN_DELTA_H=1 -DHAVE_LIBSVN_DELTA_1=1 -DHAVE_ZLIB_H=1 -DHAVE_LIBZ=1 -DHAVE_PYTHON=\"2.7\" -DMESOS_HAS_PYTHON=1 -I. -I../../../3rdparty/stout  -I../../../3rdparty/stout/include -I../boost-1.65.0 -I../elfio-3.2 -I../glog-0.4.0/src -I../googletest-release-1.8.0/googlemock/include -I../googletest-release-1.8.0/googletest/inc
 lude -I../libarchive-3.3.2/libarchive -D__STDC_FORMAT_MACROS -I../picojson-1.3.0 -I../protobuf-3.5.0/src -I../rapidjson-1.1.0/include  -I/usr/include/subversion-1 -I/usr/include/apr-1 -I/usr/include/apr-1.0	       -Wall -Wsign-compare -Wformat-security -fstack-protector -fPIC -fPIE -g1 -O0 -Wno-unused-local-typedefs -std=c++11 -c -o stout_tests-main.o `test -f 'tests/main.cpp' || echo '../../../3rdparty/stout/'`tests/main.cpp
g++ -DPACKAGE_NAME=\"mesos\" -DPACKAGE_TARNAME=\"mesos\" -DPACKAGE_VERSION=\"1.9.0\" -DPACKAGE_STRING=\"mesos\ 1.9.0\" -DPACKAGE_BUGREPORT=\"\" -DPACKAGE_URL=\"\" -DPACKAGE=\"mesos\" -DVERSION=\"1.9.0\" -DSTDC_HEADERS=1 -DHAVE_SYS_TYPES_H=1 -DHAVE_SYS_STAT_H=1 -DHAVE_STDLIB_H=1 -DHAVE_STRING_H=1 -DHAVE_MEMORY_H=1 -DHAVE_STRINGS_H=1 -DHAVE_INTTYPES_H=1 -DHAVE_STDINT_H=1 -DHAVE_UNISTD_H=1 -DHAVE_DLFCN_H=1 -DLT_OBJDIR=\".libs/\" -DHAVE_CXX11=1 -DHAVE_PTHREAD_PRIO_INHERIT=1 -DHAVE_PTHREAD=1 -DHAVE_OPENSSL_SSL_H=1 -DHAVE_FTS_H=1 -DHAVE_APR_POOLS_H=1 -DHAVE_LIBAPR_1=1 -DHAVE_LIBCURL=1 -DMESOS_HAS_JAVA=1 -DHAVE_LIBSASL2=1 -DHAVE_SVN_VERSION_H=1 -DHAVE_LIBSVN_SUBR_1=1 -DHAVE_SVN_DELTA_H=1 -DHAVE_LIBSVN_DELTA_1=1 -DHAVE_ZLIB_H=1 -DHAVE_LIBZ=1 -DHAVE_PYTHON=\"2.7\" -DMESOS_HAS_PYTHON=1 -I. -I../../../3rdparty/stout  -I../../../3rdparty/stout/include -I../boost-1.65.0 -I../elfio-3.2 -I../glog-0.4.0/src -I../googletest-release-1.8.0/googlemock/include -I../googletest-release-1.8.0/googletest/inc
 lude -I../libarchive-3.3.2/libarchive -D__STDC_FORMAT_MACROS -I../picojson-1.3.0 -I../protobuf-3.5.0/src -I../rapidjson-1.1.0/include  -I/usr/include/subversion-1 -I/usr/include/apr-1 -I/usr/include/apr-1.0	       -Wall -Wsign-compare -Wformat-security -fstack-protector -fPIC -fPIE -g1 -O0 -Wno-unused-local-typedefs -std=c++11 -c -o stout_tests-multimap_tests.o `test -f 'tests/multimap_tests.cpp' || echo '../../../3rdparty/stout/'`tests/multimap_tests.cpp
g++ -DPACKAGE_NAME=\"mesos\" -DPACKAGE_TARNAME=\"mesos\" -DPACKAGE_VERSION=\"1.9.0\" -DPACKAGE_STRING=\"mesos\ 1.9.0\" -DPACKAGE_BUGREPORT=\"\" -DPACKAGE_URL=\"\" -DPACKAGE=\"mesos\" -DVERSION=\"1.9.0\" -DSTDC_HEADERS=1 -DHAVE_SYS_TYPES_H=1 -DHAVE_SYS_STAT_H=1 -DHAVE_STDLIB_H=1 -DHAVE_STRING_H=1 -DHAVE_MEMORY_H=1 -DHAVE_STRINGS_H=1 -DHAVE_INTTYPES_H=1 -DHAVE_STDINT_H=1 -DHAVE_UNISTD_H=1 -DHAVE_DLFCN_H=1 -DLT_OBJDIR=\".libs/\" -DHAVE_CXX11=1 -DHAVE_PTHREAD_PRIO_INHERIT=1 -DHAVE_PTHREAD=1 -DHAVE_OPENSSL_SSL_H=1 -DHAVE_FTS_H=1 -DHAVE_APR_POOLS_H=1 -DHAVE_LIBAPR_1=1 -DHAVE_LIBCURL=1 -DMESOS_HAS_JAVA=1 -DHAVE_LIBSASL2=1 -DHAVE_SVN_VERSION_H=1 -DHAVE_LIBSVN_SUBR_1=1 -DHAVE_SVN_DELTA_H=1 -DHAVE_LIBSVN_DELTA_1=1 -DHAVE_ZLIB_H=1 -DHAVE_LIBZ=1 -DHAVE_PYTHON=\"2.7\" -DMESOS_HAS_PYTHON=1 -I. -I../../../3rdparty/stout  -I../../../3rdparty/stout/include -I../boost-1.65.0 -I../elfio-3.2 -I../glog-0.4.0/src -I../googletest-release-1.8.0/googlemock/include -I../googletest-release-1.8.0/googletest/inc
 lude -I../libarchive-3.3.2/libarchive -D__STDC_FORMAT_MACROS -I../picojson-1.3.0 -I../protobuf-3.5.0/src -I../rapidjson-1.1.0/include  -I/usr/include/subversion-1 -I/usr/include/apr-1 -I/usr/include/apr-1.0	       -Wall -Wsign-compare -Wformat-security -fstack-protector -fPIC -fPIE -g1 -O0 -Wno-unused-local-typedefs -std=c++11 -c -o stout_tests-none_tests.o `test -f 'tests/none_tests.cpp' || echo '../../../3rdparty/stout/'`tests/none_tests.cpp
g++ -DPACKAGE_NAME=\"mesos\" -DPACKAGE_TARNAME=\"mesos\" -DPACKAGE_VERSION=\"1.9.0\" -DPACKAGE_STRING=\"mesos\ 1.9.0\" -DPACKAGE_BUGREPORT=\"\" -DPACKAGE_URL=\"\" -DPACKAGE=\"mesos\" -DVERSION=\"1.9.0\" -DSTDC_HEADERS=1 -DHAVE_SYS_TYPES_H=1 -DHAVE_SYS_STAT_H=1 -DHAVE_STDLIB_H=1 -DHAVE_STRING_H=1 -DHAVE_MEMORY_H=1 -DHAVE_STRINGS_H=1 -DHAVE_INTTYPES_H=1 -DHAVE_STDINT_H=1 -DHAVE_UNISTD_H=1 -DHAVE_DLFCN_H=1 -DLT_OBJDIR=\".libs/\" -DHAVE_CXX11=1 -DHAVE_PTHREAD_PRIO_INHERIT=1 -DHAVE_PTHREAD=1 -DHAVE_OPENSSL_SSL_H=1 -DHAVE_FTS_H=1 -DHAVE_APR_POOLS_H=1 -DHAVE_LIBAPR_1=1 -DHAVE_LIBCURL=1 -DMESOS_HAS_JAVA=1 -DHAVE_LIBSASL2=1 -DHAVE_SVN_VERSION_H=1 -DHAVE_LIBSVN_SUBR_1=1 -DHAVE_SVN_DELTA_H=1 -DHAVE_LIBSVN_DELTA_1=1 -DHAVE_ZLIB_H=1 -DHAVE_LIBZ=1 -DHAVE_PYTHON=\"2.7\" -DMESOS_HAS_PYTHON=1 -I. -I../../../3rdparty/stout  -I../../../3rdparty/stout/include -I../boost-1.65.0 -I../elfio-3.2 -I../glog-0.4.0/src -I../googletest-release-1.8.0/googlemock/include -I../googletest-release-1.8.0/googletest/inc
 lude -I../libarchive-3.3.2/libarchive -D__STDC_FORMAT_MACROS -I../picojson-1.3.0 -I../protobuf-3.5.0/src -I../rapidjson-1.1.0/include  -I/usr/include/subversion-1 -I/usr/include/apr-1 -I/usr/include/apr-1.0	       -Wall -Wsign-compare -Wformat-security -fstack-protector -fPIC -fPIE -g1 -O0 -Wno-unused-local-typedefs -std=c++11 -c -o stout_tests-numify_tests.o `test -f 'tests/numify_tests.cpp' || echo '../../../3rdparty/stout/'`tests/numify_tests.cpp
g++ -DPACKAGE_NAME=\"mesos\" -DPACKAGE_TARNAME=\"mesos\" -DPACKAGE_VERSION=\"1.9.0\" -DPACKAGE_STRING=\"mesos\ 1.9.0\" -DPACKAGE_BUGREPORT=\"\" -DPACKAGE_URL=\"\" -DPACKAGE=\"mesos\" -DVERSION=\"1.9.0\" -DSTDC_HEADERS=1 -DHAVE_SYS_TYPES_H=1 -DHAVE_SYS_STAT_H=1 -DHAVE_STDLIB_H=1 -DHAVE_STRING_H=1 -DHAVE_MEMORY_H=1 -DHAVE_STRINGS_H=1 -DHAVE_INTTYPES_H=1 -DHAVE_STDINT_H=1 -DHAVE_UNISTD_H=1 -DHAVE_DLFCN_H=1 -DLT_OBJDIR=\".libs/\" -DHAVE_CXX11=1 -DHAVE_PTHREAD_PRIO_INHERIT=1 -DHAVE_PTHREAD=1 -DHAVE_OPENSSL_SSL_H=1 -DHAVE_FTS_H=1 -DHAVE_APR_POOLS_H=1 -DHAVE_LIBAPR_1=1 -DHAVE_LIBCURL=1 -DMESOS_HAS_JAVA=1 -DHAVE_LIBSASL2=1 -DHAVE_SVN_VERSION_H=1 -DHAVE_LIBSVN_SUBR_1=1 -DHAVE_SVN_DELTA_H=1 -DHAVE_LIBSVN_DELTA_1=1 -DHAVE_ZLIB_H=1 -DHAVE_LIBZ=1 -DHAVE_PYTHON=\"2.7\" -DMESOS_HAS_PYTHON=1 -I. -I../../../3rdparty/stout  -I../../../3rdparty/stout/include -I../boost-1.65.0 -I../elfio-3.2 -I../glog-0.4.0/src -I../googletest-release-1.8.0/googlemock/include -I../googletest-release-1.8.0/googletest/inc
 lude -I../libarchive-3.3.2/libarchive -D__STDC_FORMAT_MACROS -I../picojson-1.3.0 -I../protobuf-3.5.0/src -I../rapidjson-1.1.0/include  -I/usr/include/subversion-1 -I/usr/include/apr-1 -I/usr/include/apr-1.0	       -Wall -Wsign-compare -Wformat-security -fstack-protector -fPIC -fPIE -g1 -O0 -Wno-unused-local-typedefs -std=c++11 -c -o stout_tests-option_tests.o `test -f 'tests/option_tests.cpp' || echo '../../../3rdparty/stout/'`tests/option_tests.cpp
g++ -DPACKAGE_NAME=\"mesos\" -DPACKAGE_TARNAME=\"mesos\" -DPACKAGE_VERSION=\"1.9.0\" -DPACKAGE_STRING=\"mesos\ 1.9.0\" -DPACKAGE_BUGREPORT=\"\" -DPACKAGE_URL=\"\" -DPACKAGE=\"mesos\" -DVERSION=\"1.9.0\" -DSTDC_HEADERS=1 -DHAVE_SYS_TYPES_H=1 -DHAVE_SYS_STAT_H=1 -DHAVE_STDLIB_H=1 -DHAVE_STRING_H=1 -DHAVE_MEMORY_H=1 -DHAVE_STRINGS_H=1 -DHAVE_INTTYPES_H=1 -DHAVE_STDINT_H=1 -DHAVE_UNISTD_H=1 -DHAVE_DLFCN_H=1 -DLT_OBJDIR=\".libs/\" -DHAVE_CXX11=1 -DHAVE_PTHREAD_PRIO_INHERIT=1 -DHAVE_PTHREAD=1 -DHAVE_OPENSSL_SSL_H=1 -DHAVE_FTS_H=1 -DHAVE_APR_POOLS_H=1 -DHAVE_LIBAPR_1=1 -DHAVE_LIBCURL=1 -DMESOS_HAS_JAVA=1 -DHAVE_LIBSASL2=1 -DHAVE_SVN_VERSION_H=1 -DHAVE_LIBSVN_SUBR_1=1 -DHAVE_SVN_DELTA_H=1 -DHAVE_LIBSVN_DELTA_1=1 -DHAVE_ZLIB_H=1 -DHAVE_LIBZ=1 -DHAVE_PYTHON=\"2.7\" -DMESOS_HAS_PYTHON=1 -I. -I../../../3rdparty/stout  -I../../../3rdparty/stout/include -I../boost-1.65.0 -I../elfio-3.2 -I../glog-0.4.0/src -I../googletest-release-1.8.0/googlemock/include -I../googletest-release-1.8.0/googletest/inc
 lude -I../libarchive-3.3.2/libarchive -D__STDC_FORMAT_MACROS -I../picojson-1.3.0 -I../protobuf-3.5.0/src -I../rapidjson-1.1.0/include  -I/usr/include/subversion-1 -I/usr/include/apr-1 -I/usr/include/apr-1.0	       -Wall -Wsign-compare -Wformat-security -fstack-protector -fPIC -fPIE -g1 -O0 -Wno-unused-local-typedefs -std=c++11 -c -o stout_tests-os_tests.o `test -f 'tests/os_tests.cpp' || echo '../../../3rdparty/stout/'`tests/os_tests.cpp
g++ -DPACKAGE_NAME=\"mesos\" -DPACKAGE_TARNAME=\"mesos\" -DPACKAGE_VERSION=\"1.9.0\" -DPACKAGE_STRING=\"mesos\ 1.9.0\" -DPACKAGE_BUGREPORT=\"\" -DPACKAGE_URL=\"\" -DPACKAGE=\"mesos\" -DVERSION=\"1.9.0\" -DSTDC_HEADERS=1 -DHAVE_SYS_TYPES_H=1 -DHAVE_SYS_STAT_H=1 -DHAVE_STDLIB_H=1 -DHAVE_STRING_H=1 -DHAVE_MEMORY_H=1 -DHAVE_STRINGS_H=1 -DHAVE_INTTYPES_H=1 -DHAVE_STDINT_H=1 -DHAVE_UNISTD_H=1 -DHAVE_DLFCN_H=1 -DLT_OBJDIR=\".libs/\" -DHAVE_CXX11=1 -DHAVE_PTHREAD_PRIO_INHERIT=1 -DHAVE_PTHREAD=1 -DHAVE_OPENSSL_SSL_H=1 -DHAVE_FTS_H=1 -DHAVE_APR_POOLS_H=1 -DHAVE_LIBAPR_1=1 -DHAVE_LIBCURL=1 -DMESOS_HAS_JAVA=1 -DHAVE_LIBSASL2=1 -DHAVE_SVN_VERSION_H=1 -DHAVE_LIBSVN_SUBR_1=1 -DHAVE_SVN_DELTA_H=1 -DHAVE_LIBSVN_DELTA_1=1 -DHAVE_ZLIB_H=1 -DHAVE_LIBZ=1 -DHAVE_PYTHON=\"2.7\" -DMESOS_HAS_PYTHON=1 -I. -I../../../3rdparty/stout  -I../../../3rdparty/stout/include -I../boost-1.65.0 -I../elfio-3.2 -I../glog-0.4.0/src -I../googletest-release-1.8.0/googlemock/include -I../googletest-release-1.8.0/googletest/inc
 lude -I../libarchive-3.3.2/libarchive -D__STDC_FORMAT_MACROS -I../picojson-1.3.0 -I../protobuf-3.5.0/src -I../rapidjson-1.1.0/include  -I/usr/include/subversion-1 -I/usr/include/apr-1 -I/usr/include/apr-1.0	       -Wall -Wsign-compare -Wformat-security -fstack-protector -fPIC -fPIE -g1 -O0 -Wno-unused-local-typedefs -std=c++11 -c -o stout_tests-copyfile_tests.o `test -f 'tests/os/copyfile_tests.cpp' || echo '../../../3rdparty/stout/'`tests/os/copyfile_tests.cpp
g++ -DPACKAGE_NAME=\"mesos\" -DPACKAGE_TARNAME=\"mesos\" -DPACKAGE_VERSION=\"1.9.0\" -DPACKAGE_STRING=\"mesos\ 1.9.0\" -DPACKAGE_BUGREPORT=\"\" -DPACKAGE_URL=\"\" -DPACKAGE=\"mesos\" -DVERSION=\"1.9.0\" -DSTDC_HEADERS=1 -DHAVE_SYS_TYPES_H=1 -DHAVE_SYS_STAT_H=1 -DHAVE_STDLIB_H=1 -DHAVE_STRING_H=1 -DHAVE_MEMORY_H=1 -DHAVE_STRINGS_H=1 -DHAVE_INTTYPES_H=1 -DHAVE_STDINT_H=1 -DHAVE_UNISTD_H=1 -DHAVE_DLFCN_H=1 -DLT_OBJDIR=\".libs/\" -DHAVE_CXX11=1 -DHAVE_PTHREAD_PRIO_INHERIT=1 -DHAVE_PTHREAD=1 -DHAVE_OPENSSL_SSL_H=1 -DHAVE_FTS_H=1 -DHAVE_APR_POOLS_H=1 -DHAVE_LIBAPR_1=1 -DHAVE_LIBCURL=1 -DMESOS_HAS_JAVA=1 -DHAVE_LIBSASL2=1 -DHAVE_SVN_VERSION_H=1 -DHAVE_LIBSVN_SUBR_1=1 -DHAVE_SVN_DELTA_H=1 -DHAVE_LIBSVN_DELTA_1=1 -DHAVE_ZLIB_H=1 -DHAVE_LIBZ=1 -DHAVE_PYTHON=\"2.7\" -DMESOS_HAS_PYTHON=1 -I. -I../../../3rdparty/stout  -I../../../3rdparty/stout/include -I../boost-1.65.0 -I../elfio-3.2 -I../glog-0.4.0/src -I../googletest-release-1.8.0/googlemock/include -I../googletest-release-1.8.0/googletest/inc
 lude -I../libarchive-3.3.2/libarchive -D__STDC_FORMAT_MACROS -I../picojson-1.3.0 -I../protobuf-3.5.0/src -I../rapidjson-1.1.0/include  -I/usr/include/subversion-1 -I/usr/include/apr-1 -I/usr/include/apr-1.0	       -Wall -Wsign-compare -Wformat-security -fstack-protector -fPIC -fPIE -g1 -O0 -Wno-unused-local-typedefs -std=c++11 -c -o stout_tests-env_tests.o `test -f 'tests/os/env_tests.cpp' || echo '../../../3rdparty/stout/'`tests/os/env_tests.cpp
g++ -DPACKAGE_NAME=\"mesos\" -DPACKAGE_TARNAME=\"mesos\" -DPACKAGE_VERSION=\"1.9.0\" -DPACKAGE_STRING=\"mesos\ 1.9.0\" -DPACKAGE_BUGREPORT=\"\" -DPACKAGE_URL=\"\" -DPACKAGE=\"mesos\" -DVERSION=\"1.9.0\" -DSTDC_HEADERS=1 -DHAVE_SYS_TYPES_H=1 -DHAVE_SYS_STAT_H=1 -DHAVE_STDLIB_H=1 -DHAVE_STRING_H=1 -DHAVE_MEMORY_H=1 -DHAVE_STRINGS_H=1 -DHAVE_INTTYPES_H=1 -DHAVE_STDINT_H=1 -DHAVE_UNISTD_H=1 -DHAVE_DLFCN_H=1 -DLT_OBJDIR=\".libs/\" -DHAVE_CXX11=1 -DHAVE_PTHREAD_PRIO_INHERIT=1 -DHAVE_PTHREAD=1 -DHAVE_OPENSSL_SSL_H=1 -DHAVE_FTS_H=1 -DHAVE_APR_POOLS_H=1 -DHAVE_LIBAPR_1=1 -DHAVE_LIBCURL=1 -DMESOS_HAS_JAVA=1 -DHAVE_LIBSASL2=1 -DHAVE_SVN_VERSION_H=1 -DHAVE_LIBSVN_SUBR_1=1 -DHAVE_SVN_DELTA_H=1 -DHAVE_LIBSVN_DELTA_1=1 -DHAVE_ZLIB_H=1 -DHAVE_LIBZ=1 -DHAVE_PYTHON=\"2.7\" -DMESOS_HAS_PYTHON=1 -I. -I../../../3rdparty/stout  -I../../../3rdparty/stout/include -I../boost-1.65.0 -I../elfio-3.2 -I../glog-0.4.0/src -I../googletest-release-1.8.0/googlemock/include -I../googletest-release-1.8.0/googletest/inc
 lude -I../libarchive-3.3.2/libarchive -D__STDC_FORMAT_MACROS -I../picojson-1.3.0 -I../protobuf-3.5.0/src -I../rapidjson-1.1.0/include  -I/usr/include/subversion-1 -I/usr/include/apr-1 -I/usr/include/apr-1.0	       -Wall -Wsign-compare -Wformat-security -fstack-protector -fPIC -fPIE -g1 -O0 -Wno-unused-local-typedefs -std=c++11 -c -o stout_tests-filesystem_tests.o `test -f 'tests/os/filesystem_tests.cpp' || echo '../../../3rdparty/stout/'`tests/os/filesystem_tests.cpp
g++ -DPACKAGE_NAME=\"mesos\" -DPACKAGE_TARNAME=\"mesos\" -DPACKAGE_VERSION=\"1.9.0\" -DPACKAGE_STRING=\"mesos\ 1.9.0\" -DPACKAGE_BUGREPORT=\"\" -DPACKAGE_URL=\"\" -DPACKAGE=\"mesos\" -DVERSION=\"1.9.0\" -DSTDC_HEADERS=1 -DHAVE_SYS_TYPES_H=1 -DHAVE_SYS_STAT_H=1 -DHAVE_STDLIB_H=1 -DHAVE_STRING_H=1 -DHAVE_MEMORY_H=1 -DHAVE_STRINGS_H=1 -DHAVE_INTTYPES_H=1 -DHAVE_STDINT_H=1 -DHAVE_UNISTD_H=1 -DHAVE_DLFCN_H=1 -DLT_OBJDIR=\".libs/\" -DHAVE_CXX11=1 -DHAVE_PTHREAD_PRIO_INHERIT=1 -DHAVE_PTHREAD=1 -DHAVE_OPENSSL_SSL_H=1 -DHAVE_FTS_H=1 -DHAVE_APR_POOLS_H=1 -DHAVE_LIBAPR_1=1 -DHAVE_LIBCURL=1 -DMESOS_HAS_JAVA=1 -DHAVE_LIBSASL2=1 -DHAVE_SVN_VERSION_H=1 -DHAVE_LIBSVN_SUBR_1=1 -DHAVE_SVN_DELTA_H=1 -DHAVE_LIBSVN_DELTA_1=1 -DHAVE_ZLIB_H=1 -DHAVE_LIBZ=1 -DHAVE_PYTHON=\"2.7\" -DMESOS_HAS_PYTHON=1 -I. -I../../../3rdparty/stout  -I../../../3rdparty/stout/include -I../boost-1.65.0 -I../elfio-3.2 -I../glog-0.4.0/src -I../googletest-release-1.8.0/googlemock/include -I../googletest-release-1.8.0/googletest/inc
 lude -I../libarchive-3.3.2/libarchive -D__STDC_FORMAT_MACROS -I../picojson-1.3.0 -I../protobuf-3.5.0/src -I../rapidjson-1.1.0/include  -I/usr/include/subversion-1 -I/usr/include/apr-1 -I/usr/include/apr-1.0	       -Wall -Wsign-compare -Wformat-security -fstack-protector -fPIC -fPIE -g1 -O0 -Wno-unused-local-typedefs -std=c++11 -c -o stout_tests-process_tests.o `test -f 'tests/os/process_tests.cpp' || echo '../../../3rdparty/stout/'`tests/os/process_tests.cpp
g++ -DPACKAGE_NAME=\"mesos\" -DPACKAGE_TARNAME=\"mesos\" -DPACKAGE_VERSION=\"1.9.0\" -DPACKAGE_STRING=\"mesos\ 1.9.0\" -DPACKAGE_BUGREPORT=\"\" -DPACKAGE_URL=\"\" -DPACKAGE=\"mesos\" -DVERSION=\"1.9.0\" -DSTDC_HEADERS=1 -DHAVE_SYS_TYPES_H=1 -DHAVE_SYS_STAT_H=1 -DHAVE_STDLIB_H=1 -DHAVE_STRING_H=1 -DHAVE_MEMORY_H=1 -DHAVE_STRINGS_H=1 -DHAVE_INTTYPES_H=1 -DHAVE_STDINT_H=1 -DHAVE_UNISTD_H=1 -DHAVE_DLFCN_H=1 -DLT_OBJDIR=\".libs/\" -DHAVE_CXX11=1 -DHAVE_PTHREAD_PRIO_INHERIT=1 -DHAVE_PTHREAD=1 -DHAVE_OPENSSL_SSL_H=1 -DHAVE_FTS_H=1 -DHAVE_APR_POOLS_H=1 -DHAVE_LIBAPR_1=1 -DHAVE_LIBCURL=1 -DMESOS_HAS_JAVA=1 -DHAVE_LIBSASL2=1 -DHAVE_SVN_VERSION_H=1 -DHAVE_LIBSVN_SUBR_1=1 -DHAVE_SVN_DELTA_H=1 -DHAVE_LIBSVN_DELTA_1=1 -DHAVE_ZLIB_H=1 -DHAVE_LIBZ=1 -DHAVE_PYTHON=\"2.7\" -DMESOS_HAS_PYTHON=1 -I. -I../../../3rdparty/stout  -I../../../3rdparty/stout/include -I../boost-1.65.0 -I../elfio-3.2 -I../glog-0.4.0/src -I../googletest-release-1.8.0/googlemock/include -I../googletest-release-1.8.0/googletest/inc
 lude -I../libarchive-3.3.2/libarchive -D__STDC_FORMAT_MACROS -I../picojson-1.3.0 -I../protobuf-3.5.0/src -I../rapidjson-1.1.0/include  -I/usr/include/subversion-1 -I/usr/include/apr-1 -I/usr/include/apr-1.0	       -Wall -Wsign-compare -Wformat-security -fstack-protector -fPIC -fPIE -g1 -O0 -Wno-unused-local-typedefs -std=c++11 -c -o stout_tests-rmdir_tests.o `test -f 'tests/os/rmdir_tests.cpp' || echo '../../../3rdparty/stout/'`tests/os/rmdir_tests.cpp
g++ -DPACKAGE_NAME=\"mesos\" -DPACKAGE_TARNAME=\"mesos\" -DPACKAGE_VERSION=\"1.9.0\" -DPACKAGE_STRING=\"mesos\ 1.9.0\" -DPACKAGE_BUGREPORT=\"\" -DPACKAGE_URL=\"\" -DPACKAGE=\"mesos\" -DVERSION=\"1.9.0\" -DSTDC_HEADERS=1 -DHAVE_SYS_TYPES_H=1 -DHAVE_SYS_STAT_H=1 -DHAVE_STDLIB_H=1 -DHAVE_STRING_H=1 -DHAVE_MEMORY_H=1 -DHAVE_STRINGS_H=1 -DHAVE_INTTYPES_H=1 -DHAVE_STDINT_H=1 -DHAVE_UNISTD_H=1 -DHAVE_DLFCN_H=1 -DLT_OBJDIR=\".libs/\" -DHAVE_CXX11=1 -DHAVE_PTHREAD_PRIO_INHERIT=1 -DHAVE_PTHREAD=1 -DHAVE_OPENSSL_SSL_H=1 -DHAVE_FTS_H=1 -DHAVE_APR_POOLS_H=1 -DHAVE_LIBAPR_1=1 -DHAVE_LIBCURL=1 -DMESOS_HAS_JAVA=1 -DHAVE_LIBSASL2=1 -DHAVE_SVN_VERSION_H=1 -DHAVE_LIBSVN_SUBR_1=1 -DHAVE_SVN_DELTA_H=1 -DHAVE_LIBSVN_DELTA_1=1 -DHAVE_ZLIB_H=1 -DHAVE_LIBZ=1 -DHAVE_PYTHON=\"2.7\" -DMESOS_HAS_PYTHON=1 -I. -I../../../3rdparty/stout  -I../../../3rdparty/stout/include -I../boost-1.65.0 -I../elfio-3.2 -I../glog-0.4.0/src -I../googletest-release-1.8.0/googlemock/include -I../googletest-release-1.8.0/googletest/inc
 lude -I../libarchive-3.3.2/libarchive -D__STDC_FORMAT_MACROS -I../picojson-1.3.0 -I../protobuf-3.5.0/src -I../rapidjson-1.1.0/include  -I/usr/include/subversion-1 -I/usr/include/apr-1 -I/usr/include/apr-1.0	       -Wall -Wsign-compare -Wformat-security -fstack-protector -fPIC -fPIE -g1 -O0 -Wno-unused-local-typedefs -std=c++11 -c -o stout_tests-sendfile_tests.o `test -f 'tests/os/sendfile_tests.cpp' || echo '../../../3rdparty/stout/'`tests/os/sendfile_tests.cpp
g++ -DPACKAGE_NAME=\"mesos\" -DPACKAGE_TARNAME=\"mesos\" -DPACKAGE_VERSION=\"1.9.0\" -DPACKAGE_STRING=\"mesos\ 1.9.0\" -DPACKAGE_BUGREPORT=\"\" -DPACKAGE_URL=\"\" -DPACKAGE=\"mesos\" -DVERSION=\"1.9.0\" -DSTDC_HEADERS=1 -DHAVE_SYS_TYPES_H=1 -DHAVE_SYS_STAT_H=1 -DHAVE_STDLIB_H=1 -DHAVE_STRING_H=1 -DHAVE_MEMORY_H=1 -DHAVE_STRINGS_H=1 -DHAVE_INTTYPES_H=1 -DHAVE_STDINT_H=1 -DHAVE_UNISTD_H=1 -DHAVE_DLFCN_H=1 -DLT_OBJDIR=\".libs/\" -DHAVE_CXX11=1 -DHAVE_PTHREAD_PRIO_INHERIT=1 -DHAVE_PTHREAD=1 -DHAVE_OPENSSL_SSL_H=1 -DHAVE_FTS_H=1 -DHAVE_APR_POOLS_H=1 -DHAVE_LIBAPR_1=1 -DHAVE_LIBCURL=1 -DMESOS_HAS_JAVA=1 -DHAVE_LIBSASL2=1 -DHAVE_SVN_VERSION_H=1 -DHAVE_LIBSVN_SUBR_1=1 -DHAVE_SVN_DELTA_H=1 -DHAVE_LIBSVN_DELTA_1=1 -DHAVE_ZLIB_H=1 -DHAVE_LIBZ=1 -DHAVE_PYTHON=\"2.7\" -DMESOS_HAS_PYTHON=1 -I. -I../../../3rdparty/stout  -I../../../3rdparty/stout/include -I../boost-1.65.0 -I../elfio-3.2 -I../glog-0.4.0/src -I../googletest-release-1.8.0/googlemock/include -I../googletest-release-1.8.0/googletest/inc
 lude -I../libarchive-3.3.2/libarchive -D__STDC_FORMAT_MACROS -I../picojson-1.3.0 -I../protobuf-3.5.0/src -I../rapidjson-1.1.0/include  -I/usr/include/subversion-1 -I/usr/include/apr-1 -I/usr/include/apr-1.0	       -Wall -Wsign-compare -Wformat-security -fstack-protector -fPIC -fPIE -g1 -O0 -Wno-unused-local-typedefs -std=c++11 -c -o stout_tests-signals_tests.o `test -f 'tests/os/signals_tests.cpp' || echo '../../../3rdparty/stout/'`tests/os/signals_tests.cpp
g++ -DPACKAGE_NAME=\"mesos\" -DPACKAGE_TARNAME=\"mesos\" -DPACKAGE_VERSION=\"1.9.0\" -DPACKAGE_STRING=\"mesos\ 1.9.0\" -DPACKAGE_BUGREPORT=\"\" -DPACKAGE_URL=\"\" -DPACKAGE=\"mesos\" -DVERSION=\"1.9.0\" -DSTDC_HEADERS=1 -DHAVE_SYS_TYPES_H=1 -DHAVE_SYS_STAT_H=1 -DHAVE_STDLIB_H=1 -DHAVE_STRING_H=1 -DHAVE_MEMORY_H=1 -DHAVE_STRINGS_H=1 -DHAVE_INTTYPES_H=1 -DHAVE_STDINT_H=1 -DHAVE_UNISTD_H=1 -DHAVE_DLFCN_H=1 -DLT_OBJDIR=\".libs/\" -DHAVE_CXX11=1 -DHAVE_PTHREAD_PRIO_INHERIT=1 -DHAVE_PTHREAD=1 -DHAVE_OPENSSL_SSL_H=1 -DHAVE_FTS_H=1 -DHAVE_APR_POOLS_H=1 -DHAVE_LIBAPR_1=1 -DHAVE_LIBCURL=1 -DMESOS_HAS_JAVA=1 -DHAVE_LIBSASL2=1 -DHAVE_SVN_VERSION_H=1 -DHAVE_LIBSVN_SUBR_1=1 -DHAVE_SVN_DELTA_H=1 -DHAVE_LIBSVN_DELTA_1=1 -DHAVE_ZLIB_H=1 -DHAVE_LIBZ=1 -DHAVE_PYTHON=\"2.7\" -DMESOS_HAS_PYTHON=1 -I. -I../../../3rdparty/stout  -I../../../3rdparty/stout/include -I../boost-1.65.0 -I../elfio-3.2 -I../glog-0.4.0/src -I../googletest-release-1.8.0/googlemock/include -I../googletest-release-1.8.0/googletest/inc
 lude -I../libarchive-3.3.2/libarchive -D__STDC_FORMAT_MACROS -I../picojson-1.3.0 -I../protobuf-3.5.0/src -I../rapidjson-1.1.0/include  -I/usr/include/subversion-1 -I/usr/include/apr-1 -I/usr/include/apr-1.0	       -Wall -Wsign-compare -Wformat-security -fstack-protector -fPIC -fPIE -g1 -O0 -Wno-unused-local-typedefs -std=c++11 -c -o stout_tests-socket_tests.o `test -f 'tests/os/socket_tests.cpp' || echo '../../../3rdparty/stout/'`tests/os/socket_tests.cpp
g++ -DPACKAGE_NAME=\"mesos\" -DPACKAGE_TARNAME=\"mesos\" -DPACKAGE_VERSION=\"1.9.0\" -DPACKAGE_STRING=\"mesos\ 1.9.0\" -DPACKAGE_BUGREPORT=\"\" -DPACKAGE_URL=\"\" -DPACKAGE=\"mesos\" -DVERSION=\"1.9.0\" -DSTDC_HEADERS=1 -DHAVE_SYS_TYPES_H=1 -DHAVE_SYS_STAT_H=1 -DHAVE_STDLIB_H=1 -DHAVE_STRING_H=1 -DHAVE_MEMORY_H=1 -DHAVE_STRINGS_H=1 -DHAVE_INTTYPES_H=1 -DHAVE_STDINT_H=1 -DHAVE_UNISTD_H=1 -DHAVE_DLFCN_H=1 -DLT_OBJDIR=\".libs/\" -DHAVE_CXX11=1 -DHAVE_PTHREAD_PRIO_INHERIT=1 -DHAVE_PTHREAD=1 -DHAVE_OPENSSL_SSL_H=1 -DHAVE_FTS_H=1 -DHAVE_APR_POOLS_H=1 -DHAVE_LIBAPR_1=1 -DHAVE_LIBCURL=1 -DMESOS_HAS_JAVA=1 -DHAVE_LIBSASL2=1 -DHAVE_SVN_VERSION_H=1 -DHAVE_LIBSVN_SUBR_1=1 -DHAVE_SVN_DELTA_H=1 -DHAVE_LIBSVN_DELTA_1=1 -DHAVE_ZLIB_H=1 -DHAVE_LIBZ=1 -DHAVE_PYTHON=\"2.7\" -DMESOS_HAS_PYTHON=1 -I. -I../../../3rdparty/stout  -I../../../3rdparty/stout/include -I../boost-1.65.0 -I../elfio-3.2 -I../glog-0.4.0/src -I../googletest-release-1.8.0/googlemock/include -I../googletest-release-1.8.0/googletest/inc
 lude -I../libarchive-3.3.2/libarchive -D__STDC_FORMAT_MACROS -I../picojson-1.3.0 -I../protobuf-3.5.0/src -I../rapidjson-1.1.0/include  -I/usr/include/subversion-1 -I/usr/include/apr-1 -I/usr/include/apr-1.0	       -Wall -Wsign-compare -Wformat-security -fstack-protector -fPIC -fPIE -g1 -O0 -Wno-unused-local-typedefs -std=c++11 -c -o stout_tests-strerror_tests.o `test -f 'tests/os/strerror_tests.cpp' || echo '../../../3rdparty/stout/'`tests/os/strerror_tests.cpp
g++ -DPACKAGE_NAME=\"mesos\" -DPACKAGE_TARNAME=\"mesos\" -DPACKAGE_VERSION=\"1.9.0\" -DPACKAGE_STRING=\"mesos\ 1.9.0\" -DPACKAGE_BUGREPORT=\"\" -DPACKAGE_URL=\"\" -DPACKAGE=\"mesos\" -DVERSION=\"1.9.0\" -DSTDC_HEADERS=1 -DHAVE_SYS_TYPES_H=1 -DHAVE_SYS_STAT_H=1 -DHAVE_STDLIB_H=1 -DHAVE_STRING_H=1 -DHAVE_MEMORY_H=1 -DHAVE_STRINGS_H=1 -DHAVE_INTTYPES_H=1 -DHAVE_STDINT_H=1 -DHAVE_UNISTD_H=1 -DHAVE_DLFCN_H=1 -DLT_OBJDIR=\".libs/\" -DHAVE_CXX11=1 -DHAVE_PTHREAD_PRIO_INHERIT=1 -DHAVE_PTHREAD=1 -DHAVE_OPENSSL_SSL_H=1 -DHAVE_FTS_H=1 -DHAVE_APR_POOLS_H=1 -DHAVE_LIBAPR_1=1 -DHAVE_LIBCURL=1 -DMESOS_HAS_JAVA=1 -DHAVE_LIBSASL2=1 -DHAVE_SVN_VERSION_H=1 -DHAVE_LIBSVN_SUBR_1=1 -DHAVE_SVN_DELTA_H=1 -DHAVE_LIBSVN_DELTA_1=1 -DHAVE_ZLIB_H=1 -DHAVE_LIBZ=1 -DHAVE_PYTHON=\"2.7\" -DMESOS_HAS_PYTHON=1 -I. -I../../../3rdparty/stout  -I../../../3rdparty/stout/include -I../boost-1.65.0 -I../elfio-3.2 -I../glog-0.4.0/src -I../googletest-release-1.8.0/googlemock/include -I../googletest-release-1.8.0/googletest/inc
 lude -I../libarchive-3.3.2/libarchive -D__STDC_FORMAT_MACROS -I../picojson-1.3.0 -I../protobuf-3.5.0/src -I../rapidjson-1.1.0/include  -I/usr/include/subversion-1 -I/usr/include/apr-1 -I/usr/include/apr-1.0	       -Wall -Wsign-compare -Wformat-security -fstack-protector -fPIC -fPIE -g1 -O0 -Wno-unused-local-typedefs -std=c++11 -c -o stout_tests-systems_tests.o `test -f 'tests/os/systems_tests.cpp' || echo '../../../3rdparty/stout/'`tests/os/systems_tests.cpp
g++ -DPACKAGE_NAME=\"mesos\" -DPACKAGE_TARNAME=\"mesos\" -DPACKAGE_VERSION=\"1.9.0\" -DPACKAGE_STRING=\"mesos\ 1.9.0\" -DPACKAGE_BUGREPORT=\"\" -DPACKAGE_URL=\"\" -DPACKAGE=\"mesos\" -DVERSION=\"1.9.0\" -DSTDC_HEADERS=1 -DHAVE_SYS_TYPES_H=1 -DHAVE_SYS_STAT_H=1 -DHAVE_STDLIB_H=1 -DHAVE_STRING_H=1 -DHAVE_MEMORY_H=1 -DHAVE_STRINGS_H=1 -DHAVE_INTTYPES_H=1 -DHAVE_STDINT_H=1 -DHAVE_UNISTD_H=1 -DHAVE_DLFCN_H=1 -DLT_OBJDIR=\".libs/\" -DHAVE_CXX11=1 -DHAVE_PTHREAD_PRIO_INHERIT=1 -DHAVE_PTHREAD=1 -DHAVE_OPENSSL_SSL_H=1 -DHAVE_FTS_H=1 -DHAVE_APR_POOLS_H=1 -DHAVE_LIBAPR_1=1 -DHAVE_LIBCURL=1 -DMESOS_HAS_JAVA=1 -DHAVE_LIBSASL2=1 -DHAVE_SVN_VERSION_H=1 -DHAVE_LIBSVN_SUBR_1=1 -DHAVE_SVN_DELTA_H=1 -DHAVE_LIBSVN_DELTA_1=1 -DHAVE_ZLIB_H=1 -DHAVE_LIBZ=1 -DHAVE_PYTHON=\"2.7\" -DMESOS_HAS_PYTHON=1 -I. -I../../../3rdparty/stout  -I../../../3rdparty/stout/include -I../boost-1.65.0 -I../elfio-3.2 -I../glog-0.4.0/src -I../googletest-release-1.8.0/googlemock/include -I../googletest-release-1.8.0/googletest/inc
 lude -I../libarchive-3.3.2/libarchive -D__STDC_FORMAT_MACROS -I../picojson-1.3.0 -I../protobuf-3.5.0/src -I../rapidjson-1.1.0/include  -I/usr/include/subversion-1 -I/usr/include/apr-1 -I/usr/include/apr-1.0	       -Wall -Wsign-compare -Wformat-security -fstack-protector -fPIC -fPIE -g1 -O0 -Wno-unused-local-typedefs -std=c++11 -c -o stout_tests-path_tests.o `test -f 'tests/path_tests.cpp' || echo '../../../3rdparty/stout/'`tests/path_tests.cpp
g++ -DPACKAGE_NAME=\"mesos\" -DPACKAGE_TARNAME=\"mesos\" -DPACKAGE_VERSION=\"1.9.0\" -DPACKAGE_STRING=\"mesos\ 1.9.0\" -DPACKAGE_BUGREPORT=\"\" -DPACKAGE_URL=\"\" -DPACKAGE=\"mesos\" -DVERSION=\"1.9.0\" -DSTDC_HEADERS=1 -DHAVE_SYS_TYPES_H=1 -DHAVE_SYS_STAT_H=1 -DHAVE_STDLIB_H=1 -DHAVE_STRING_H=1 -DHAVE_MEMORY_H=1 -DHAVE_STRINGS_H=1 -DHAVE_INTTYPES_H=1 -DHAVE_STDINT_H=1 -DHAVE_UNISTD_H=1 -DHAVE_DLFCN_H=1 -DLT_OBJDIR=\".libs/\" -DHAVE_CXX11=1 -DHAVE_PTHREAD_PRIO_INHERIT=1 -DHAVE_PTHREAD=1 -DHAVE_OPENSSL_SSL_H=1 -DHAVE_FTS_H=1 -DHAVE_APR_POOLS_H=1 -DHAVE_LIBAPR_1=1 -DHAVE_LIBCURL=1 -DMESOS_HAS_JAVA=1 -DHAVE_LIBSASL2=1 -DHAVE_SVN_VERSION_H=1 -DHAVE_LIBSVN_SUBR_1=1 -DHAVE_SVN_DELTA_H=1 -DHAVE_LIBSVN_DELTA_1=1 -DHAVE_ZLIB_H=1 -DHAVE_LIBZ=1 -DHAVE_PYTHON=\"2.7\" -DMESOS_HAS_PYTHON=1 -I. -I../../../3rdparty/stout  -I../../../3rdparty/stout/include -I../boost-1.65.0 -I../elfio-3.2 -I../glog-0.4.0/src -I../googletest-release-1.8.0/googlemock/include -I../googletest-release-1.8.0/googletest/inc
 lude -I../libarchive-3.3.2/libarchive -D__STDC_FORMAT_MACROS -I../picojson-1.3.0 -I../protobuf-3.5.0/src -I../rapidjson-1.1.0/include  -I/usr/include/subversion-1 -I/usr/include/apr-1 -I/usr/include/apr-1.0	       -Wall -Wsign-compare -Wformat-security -fstack-protector -fPIC -fPIE -g1 -O0 -Wno-unused-local-typedefs -std=c++11 -c -o stout_tests-protobuf_tests.o `test -f 'tests/protobuf_tests.cpp' || echo '../../../3rdparty/stout/'`tests/protobuf_tests.cpp
g++ -DPACKAGE_NAME=\"mesos\" -DPACKAGE_TARNAME=\"mesos\" -DPACKAGE_VERSION=\"1.9.0\" -DPACKAGE_STRING=\"mesos\ 1.9.0\" -DPACKAGE_BUGREPORT=\"\" -DPACKAGE_URL=\"\" -DPACKAGE=\"mesos\" -DVERSION=\"1.9.0\" -DSTDC_HEADERS=1 -DHAVE_SYS_TYPES_H=1 -DHAVE_SYS_STAT_H=1 -DHAVE_STDLIB_H=1 -DHAVE_STRING_H=1 -DHAVE_MEMORY_H=1 -DHAVE_STRINGS_H=1 -DHAVE_INTTYPES_H=1 -DHAVE_STDINT_H=1 -DHAVE_UNISTD_H=1 -DHAVE_DLFCN_H=1 -DLT_OBJDIR=\".libs/\" -DHAVE_CXX11=1 -DHAVE_PTHREAD_PRIO_INHERIT=1 -DHAVE_PTHREAD=1 -DHAVE_OPENSSL_SSL_H=1 -DHAVE_FTS_H=1 -DHAVE_APR_POOLS_H=1 -DHAVE_LIBAPR_1=1 -DHAVE_LIBCURL=1 -DMESOS_HAS_JAVA=1 -DHAVE_LIBSASL2=1 -DHAVE_SVN_VERSION_H=1 -DHAVE_LIBSVN_SUBR_1=1 -DHAVE_SVN_DELTA_H=1 -DHAVE_LIBSVN_DELTA_1=1 -DHAVE_ZLIB_H=1 -DHAVE_LIBZ=1 -DHAVE_PYTHON=\"2.7\" -DMESOS_HAS_PYTHON=1 -I. -I../../../3rdparty/stout  -I../../../3rdparty/stout/include -I../boost-1.65.0 -I../elfio-3.2 -I../glog-0.4.0/src -I../googletest-release-1.8.0/googlemock/include -I../googletest-release-1.8.0/googletest/inc
 lude -I../libarchive-3.3.2/libarchive -D__STDC_FORMAT_MACROS -I../picojson-1.3.0 -I../protobuf-3.5.0/src -I../rapidjson-1.1.0/include  -I/usr/include/subversion-1 -I/usr/include/apr-1 -I/usr/include/apr-1.0	       -Wall -Wsign-compare -Wformat-security -fstack-protector -fPIC -fPIE -g1 -O0 -Wno-unused-local-typedefs -std=c++11 -c -o stout_tests-recordio_tests.o `test -f 'tests/recordio_tests.cpp' || echo '../../../3rdparty/stout/'`tests/recordio_tests.cpp
g++ -DPACKAGE_NAME=\"mesos\" -DPACKAGE_TARNAME=\"mesos\" -DPACKAGE_VERSION=\"1.9.0\" -DPACKAGE_STRING=\"mesos\ 1.9.0\" -DPACKAGE_BUGREPORT=\"\" -DPACKAGE_URL=\"\" -DPACKAGE=\"mesos\" -DVERSION=\"1.9.0\" -DSTDC_HEADERS=1 -DHAVE_SYS_TYPES_H=1 -DHAVE_SYS_STAT_H=1 -DHAVE_STDLIB_H=1 -DHAVE_STRING_H=1 -DHAVE_MEMORY_H=1 -DHAVE_STRINGS_H=1 -DHAVE_INTTYPES_H=1 -DHAVE_STDINT_H=1 -DHAVE_UNISTD_H=1 -DHAVE_DLFCN_H=1 -DLT_OBJDIR=\".libs/\" -DHAVE_CXX11=1 -DHAVE_PTHREAD_PRIO_INHERIT=1 -DHAVE_PTHREAD=1 -DHAVE_OPENSSL_SSL_H=1 -DHAVE_FTS_H=1 -DHAVE_APR_POOLS_H=1 -DHAVE_LIBAPR_1=1 -DHAVE_LIBCURL=1 -DMESOS_HAS_JAVA=1 -DHAVE_LIBSASL2=1 -DHAVE_SVN_VERSION_H=1 -DHAVE_LIBSVN_SUBR_1=1 -DHAVE_SVN_DELTA_H=1 -DHAVE_LIBSVN_DELTA_1=1 -DHAVE_ZLIB_H=1 -DHAVE_LIBZ=1 -DHAVE_PYTHON=\"2.7\" -DMESOS_HAS_PYTHON=1 -I. -I../../../3rdparty/stout  -I../../../3rdparty/stout/include -I../boost-1.65.0 -I../elfio-3.2 -I../glog-0.4.0/src -I../googletest-release-1.8.0/googlemock/include -I../googletest-release-1.8.0/googletest/inc
 lude -I../libarchive-3.3.2/libarchive -D__STDC_FORMAT_MACROS -I../picojson-1.3.0 -I../protobuf-3.5.0/src -I../rapidjson-1.1.0/include  -I/usr/include/subversion-1 -I/usr/include/apr-1 -I/usr/include/apr-1.0	       -Wall -Wsign-compare -Wformat-security -fstack-protector -fPIC -fPIE -g1 -O0 -Wno-unused-local-typedefs -std=c++11 -c -o stout_tests-result_tests.o `test -f 'tests/result_tests.cpp' || echo '../../../3rdparty/stout/'`tests/result_tests.cpp
g++ -DPACKAGE_NAME=\"mesos\" -DPACKAGE_TARNAME=\"mesos\" -DPACKAGE_VERSION=\"1.9.0\" -DPACKAGE_STRING=\"mesos\ 1.9.0\" -DPACKAGE_BUGREPORT=\"\" -DPACKAGE_URL=\"\" -DPACKAGE=\"mesos\" -DVERSION=\"1.9.0\" -DSTDC_HEADERS=1 -DHAVE_SYS_TYPES_H=1 -DHAVE_SYS_STAT_H=1 -DHAVE_STDLIB_H=1 -DHAVE_STRING_H=1 -DHAVE_MEMORY_H=1 -DHAVE_STRINGS_H=1 -DHAVE_INTTYPES_H=1 -DHAVE_STDINT_H=1 -DHAVE_UNISTD_H=1 -DHAVE_DLFCN_H=1 -DLT_OBJDIR=\".libs/\" -DHAVE_CXX11=1 -DHAVE_PTHREAD_PRIO_INHERIT=1 -DHAVE_PTHREAD=1 -DHAVE_OPENSSL_SSL_H=1 -DHAVE_FTS_H=1 -DHAVE_APR_POOLS_H=1 -DHAVE_LIBAPR_1=1 -DHAVE_LIBCURL=1 -DMESOS_HAS_JAVA=1 -DHAVE_LIBSASL2=1 -DHAVE_SVN_VERSION_H=1 -DHAVE_LIBSVN_SUBR_1=1 -DHAVE_SVN_DELTA_H=1 -DHAVE_LIBSVN_DELTA_1=1 -DHAVE_ZLIB_H=1 -DHAVE_LIBZ=1 -DHAVE_PYTHON=\"2.7\" -DMESOS_HAS_PYTHON=1 -I. -I../../../3rdparty/stout  -I../../../3rdparty/stout/include -I../boost-1.65.0 -I../elfio-3.2 -I../glog-0.4.0/src -I../googletest-release-1.8.0/googlemock/include -I../googletest-release-1.8.0/googletest/inc
 lude -I../libarchive-3.3.2/libarchive -D__STDC_FORMAT_MACROS -I../picojson-1.3.0 -I../protobuf-3.5.0/src -I../rapidjson-1.1.0/include  -I/usr/include/subversion-1 -I/usr/include/apr-1 -I/usr/include/apr-1.0	       -Wall -Wsign-compare -Wformat-security -fstack-protector -fPIC -fPIE -g1 -O0 -Wno-unused-local-typedefs -std=c++11 -c -o stout_tests-some_tests.o `test -f 'tests/some_tests.cpp' || echo '../../../3rdparty/stout/'`tests/some_tests.cpp
g++ -DPACKAGE_NAME=\"mesos\" -DPACKAGE_TARNAME=\"mesos\" -DPACKAGE_VERSION=\"1.9.0\" -DPACKAGE_STRING=\"mesos\ 1.9.0\" -DPACKAGE_BUGREPORT=\"\" -DPACKAGE_URL=\"\" -DPACKAGE=\"mesos\" -DVERSION=\"1.9.0\" -DSTDC_HEADERS=1 -DHAVE_SYS_TYPES_H=1 -DHAVE_SYS_STAT_H=1 -DHAVE_STDLIB_H=1 -DHAVE_STRING_H=1 -DHAVE_MEMORY_H=1 -DHAVE_STRINGS_H=1 -DHAVE_INTTYPES_H=1 -DHAVE_STDINT_H=1 -DHAVE_UNISTD_H=1 -DHAVE_DLFCN_H=1 -DLT_OBJDIR=\".libs/\" -DHAVE_CXX11=1 -DHAVE_PTHREAD_PRIO_INHERIT=1 -DHAVE_PTHREAD=1 -DHAVE_OPENSSL_SSL_H=1 -DHAVE_FTS_H=1 -DHAVE_APR_POOLS_H=1 -DHAVE_LIBAPR_1=1 -DHAVE_LIBCURL=1 -DMESOS_HAS_JAVA=1 -DHAVE_LIBSASL2=1 -DHAVE_SVN_VERSION_H=1 -DHAVE_LIBSVN_SUBR_1=1 -DHAVE_SVN_DELTA_H=1 -DHAVE_LIBSVN_DELTA_1=1 -DHAVE_ZLIB_H=1 -DHAVE_LIBZ=1 -DHAVE_PYTHON=\"2.7\" -DMESOS_HAS_PYTHON=1 -I. -I../../../3rdparty/stout  -I../../../3rdparty/stout/include -I../boost-1.65.0 -I../elfio-3.2 -I../glog-0.4.0/src -I../googletest-release-1.8.0/googlemock/include -I../googletest-release-1.8.0/googletest/inc
 lude -I../libarchive-3.3.2/libarchive -D__STDC_FORMAT_MACROS -I../picojson-1.3.0 -I../protobuf-3.5.0/src -I../rapidjson-1.1.0/include  -I/usr/include/subversion-1 -I/usr/include/apr-1 -I/usr/include/apr-1.0	       -Wall -Wsign-compare -Wformat-security -fstack-protector -fPIC -fPIE -g1 -O0 -Wno-unused-local-typedefs -std=c++11 -c -o stout_tests-strings_tests.o `test -f 'tests/strings_tests.cpp' || echo '../../../3rdparty/stout/'`tests/strings_tests.cpp
g++ -DPACKAGE_NAME=\"mesos\" -DPACKAGE_TARNAME=\"mesos\" -DPACKAGE_VERSION=\"1.9.0\" -DPACKAGE_STRING=\"mesos\ 1.9.0\" -DPACKAGE_BUGREPORT=\"\" -DPACKAGE_URL=\"\" -DPACKAGE=\"mesos\" -DVERSION=\"1.9.0\" -DSTDC_HEADERS=1 -DHAVE_SYS_TYPES_H=1 -DHAVE_SYS_STAT_H=1 -DHAVE_STDLIB_H=1 -DHAVE_STRING_H=1 -DHAVE_MEMORY_H=1 -DHAVE_STRINGS_H=1 -DHAVE_INTTYPES_H=1 -DHAVE_STDINT_H=1 -DHAVE_UNISTD_H=1 -DHAVE_DLFCN_H=1 -DLT_OBJDIR=\".libs/\" -DHAVE_CXX11=1 -DHAVE_PTHREAD_PRIO_INHERIT=1 -DHAVE_PTHREAD=1 -DHAVE_OPENSSL_SSL_H=1 -DHAVE_FTS_H=1 -DHAVE_APR_POOLS_H=1 -DHAVE_LIBAPR_1=1 -DHAVE_LIBCURL=1 -DMESOS_HAS_JAVA=1 -DHAVE_LIBSASL2=1 -DHAVE_SVN_VERSION_H=1 -DHAVE_LIBSVN_SUBR_1=1 -DHAVE_SVN_DELTA_H=1 -DHAVE_LIBSVN_DELTA_1=1 -DHAVE_ZLIB_H=1 -DHAVE_LIBZ=1 -DHAVE_PYTHON=\"2.7\" -DMESOS_HAS_PYTHON=1 -I. -I../../../3rdparty/stout  -I../../../3rdparty/stout/include -I../boost-1.65.0 -I../elfio-3.2 -I../glog-0.4.0/src -I../googletest-release-1.8.0/googlemock/include -I../googletest-release-1.8.0/googletest/inc
 lude -I../libarchive-3.3.2/libarchive -D__STDC_FORMAT_MACROS -I../picojson-1.3.0 -I../protobuf-3.5.0/src -I../rapidjson-1.1.0/include  -I/usr/include/subversion-1 -I/usr/include/apr-1 -I/usr/include/apr-1.0	       -Wall -Wsign-compare -Wformat-security -fstack-protector -fPIC -fPIE -g1 -O0 -Wno-unused-local-typedefs -std=c++11 -c -o stout_tests-subcommand_tests.o `test -f 'tests/subcommand_tests.cpp' || echo '../../../3rdparty/stout/'`tests/subcommand_tests.cpp
g++ -DPACKAGE_NAME=\"mesos\" -DPACKAGE_TARNAME=\"mesos\" -DPACKAGE_VERSION=\"1.9.0\" -DPACKAGE_STRING=\"mesos\ 1.9.0\" -DPACKAGE_BUGREPORT=\"\" -DPACKAGE_URL=\"\" -DPACKAGE=\"mesos\" -DVERSION=\"1.9.0\" -DSTDC_HEADERS=1 -DHAVE_SYS_TYPES_H=1 -DHAVE_SYS_STAT_H=1 -DHAVE_STDLIB_H=1 -DHAVE_STRING_H=1 -DHAVE_MEMORY_H=1 -DHAVE_STRINGS_H=1 -DHAVE_INTTYPES_H=1 -DHAVE_STDINT_H=1 -DHAVE_UNISTD_H=1 -DHAVE_DLFCN_H=1 -DLT_OBJDIR=\".libs/\" -DHAVE_CXX11=1 -DHAVE_PTHREAD_PRIO_INHERIT=1 -DHAVE_PTHREAD=1 -DHAVE_OPENSSL_SSL_H=1 -DHAVE_FTS_H=1 -DHAVE_APR_POOLS_H=1 -DHAVE_LIBAPR_1=1 -DHAVE_LIBCURL=1 -DMESOS_HAS_JAVA=1 -DHAVE_LIBSASL2=1 -DHAVE_SVN_VERSION_H=1 -DHAVE_LIBSVN_SUBR_1=1 -DHAVE_SVN_DELTA_H=1 -DHAVE_LIBSVN_DELTA_1=1 -DHAVE_ZLIB_H=1 -DHAVE_LIBZ=1 -DHAVE_PYTHON=\"2.7\" -DMESOS_HAS_PYTHON=1 -I. -I../../../3rdparty/stout  -I../../../3rdparty/stout/include -I../boost-1.65.0 -I../elfio-3.2 -I../glog-0.4.0/src -I../googletest-release-1.8.0/googlemock/include -I../googletest-release-1.8.0/googletest/inc
 lude -I../libarchive-3.3.2/libarchive -D__STDC_FORMAT_MACROS -I../picojson-1.3.0 -I../protobuf-3.5.0/src -I../rapidjson-1.1.0/include  -I/usr/include/subversion-1 -I/usr/include/apr-1 -I/usr/include/apr-1.0	       -Wall -Wsign-compare -Wformat-security -fstack-protector -fPIC -fPIE -g1 -O0 -Wno-unused-local-typedefs -std=c++11 -c -o stout_tests-svn_tests.o `test -f 'tests/svn_tests.cpp' || echo '../../../3rdparty/stout/'`tests/svn_tests.cpp
g++ -DPACKAGE_NAME=\"mesos\" -DPACKAGE_TARNAME=\"mesos\" -DPACKAGE_VERSION=\"1.9.0\" -DPACKAGE_STRING=\"mesos\ 1.9.0\" -DPACKAGE_BUGREPORT=\"\" -DPACKAGE_URL=\"\" -DPACKAGE=\"mesos\" -DVERSION=\"1.9.0\" -DSTDC_HEADERS=1 -DHAVE_SYS_TYPES_H=1 -DHAVE_SYS_STAT_H=1 -DHAVE_STDLIB_H=1 -DHAVE_STRING_H=1 -DHAVE_MEMORY_H=1 -DHAVE_STRINGS_H=1 -DHAVE_INTTYPES_H=1 -DHAVE_STDINT_H=1 -DHAVE_UNISTD_H=1 -DHAVE_DLFCN_H=1 -DLT_OBJDIR=\".libs/\" -DHAVE_CXX11=1 -DHAVE_PTHREAD_PRIO_INHERIT=1 -DHAVE_PTHREAD=1 -DHAVE_OPENSSL_SSL_H=1 -DHAVE_FTS_H=1 -DHAVE_APR_POOLS_H=1 -DHAVE_LIBAPR_1=1 -DHAVE_LIBCURL=1 -DMESOS_HAS_JAVA=1 -DHAVE_LIBSASL2=1 -DHAVE_SVN_VERSION_H=1 -DHAVE_LIBSVN_SUBR_1=1 -DHAVE_SVN_DELTA_H=1 -DHAVE_LIBSVN_DELTA_1=1 -DHAVE_ZLIB_H=1 -DHAVE_LIBZ=1 -DHAVE_PYTHON=\"2.7\" -DMESOS_HAS_PYTHON=1 -I. -I../../../3rdparty/stout  -I../../../3rdparty/stout/include -I../boost-1.65.0 -I../elfio-3.2 -I../glog-0.4.0/src -I../googletest-release-1.8.0/googlemock/include -I../googletest-release-1.8.0/googletest/inc
 lude -I../libarchive-3.3.2/libarchive -D__STDC_FORMAT_MACROS -I../picojson-1.3.0 -I../protobuf-3.5.0/src -I../rapidjson-1.1.0/include  -I/usr/include/subversion-1 -I/usr/include/apr-1 -I/usr/include/apr-1.0	       -Wall -Wsign-compare -Wformat-security -fstack-protector -fPIC -fPIE -g1 -O0 -Wno-unused-local-typedefs -std=c++11 -c -o stout_tests-try_tests.o `test -f 'tests/try_tests.cpp' || echo '../../../3rdparty/stout/'`tests/try_tests.cpp
g++ -DPACKAGE_NAME=\"mesos\" -DPACKAGE_TARNAME=\"mesos\" -DPACKAGE_VERSION=\"1.9.0\" -DPACKAGE_STRING=\"mesos\ 1.9.0\" -DPACKAGE_BUGREPORT=\"\" -DPACKAGE_URL=\"\" -DPACKAGE=\"mesos\" -DVERSION=\"1.9.0\" -DSTDC_HEADERS=1 -DHAVE_SYS_TYPES_H=1 -DHAVE_SYS_STAT_H=1 -DHAVE_STDLIB_H=1 -DHAVE_STRING_H=1 -DHAVE_MEMORY_H=1 -DHAVE_STRINGS_H=1 -DHAVE_INTTYPES_H=1 -DHAVE_STDINT_H=1 -DHAVE_UNISTD_H=1 -DHAVE_DLFCN_H=1 -DLT_OBJDIR=\".libs/\" -DHAVE_CXX11=1 -DHAVE_PTHREAD_PRIO_INHERIT=1 -DHAVE_PTHREAD=1 -DHAVE_OPENSSL_SSL_H=1 -DHAVE_FTS_H=1 -DHAVE_APR_POOLS_H=1 -DHAVE_LIBAPR_1=1 -DHAVE_LIBCURL=1 -DMESOS_HAS_JAVA=1 -DHAVE_LIBSASL2=1 -DHAVE_SVN_VERSION_H=1 -DHAVE_LIBSVN_SUBR_1=1 -DHAVE_SVN_DELTA_H=1 -DHAVE_LIBSVN_DELTA_1=1 -DHAVE_ZLIB_H=1 -DHAVE_LIBZ=1 -DHAVE_PYTHON=\"2.7\" -DMESOS_HAS_PYTHON=1 -I. -I../../../3rdparty/stout  -I../../../3rdparty/stout/include -I../boost-1.65.0 -I../elfio-3.2 -I../glog-0.4.0/src -I../googletest-release-1.8.0/googlemock/include -I../googletest-release-1.8.0/googletest/inc
 lude -I../libarchive-3.3.2/libarchive -D__STDC_FORMAT_MACROS -I../picojson-1.3.0 -I../protobuf-3.5.0/src -I../rapidjson-1.1.0/include  -I/usr/include/subversion-1 -I/usr/include/apr-1 -I/usr/include/apr-1.0	       -Wall -Wsign-compare -Wformat-security -fstack-protector -fPIC -fPIE -g1 -O0 -Wno-unused-local-typedefs -std=c++11 -c -o stout_tests-uri_tests.o `test -f 'tests/uri_tests.cpp' || echo '../../../3rdparty/stout/'`tests/uri_tests.cpp
g++ -DPACKAGE_NAME=\"mesos\" -DPACKAGE_TARNAME=\"mesos\" -DPACKAGE_VERSION=\"1.9.0\" -DPACKAGE_STRING=\"mesos\ 1.9.0\" -DPACKAGE_BUGREPORT=\"\" -DPACKAGE_URL=\"\" -DPACKAGE=\"mesos\" -DVERSION=\"1.9.0\" -DSTDC_HEADERS=1 -DHAVE_SYS_TYPES_H=1 -DHAVE_SYS_STAT_H=1 -DHAVE_STDLIB_H=1 -DHAVE_STRING_H=1 -DHAVE_MEMORY_H=1 -DHAVE_STRINGS_H=1 -DHAVE_INTTYPES_H=1 -DHAVE_STDINT_H=1 -DHAVE_UNISTD_H=1 -DHAVE_DLFCN_H=1 -DLT_OBJDIR=\".libs/\" -DHAVE_CXX11=1 -DHAVE_PTHREAD_PRIO_INHERIT=1 -DHAVE_PTHREAD=1 -DHAVE_OPENSSL_SSL_H=1 -DHAVE_FTS_H=1 -DHAVE_APR_POOLS_H=1 -DHAVE_LIBAPR_1=1 -DHAVE_LIBCURL=1 -DMESOS_HAS_JAVA=1 -DHAVE_LIBSASL2=1 -DHAVE_SVN_VERSION_H=1 -DHAVE_LIBSVN_SUBR_1=1 -DHAVE_SVN_DELTA_H=1 -DHAVE_LIBSVN_DELTA_1=1 -DHAVE_ZLIB_H=1 -DHAVE_LIBZ=1 -DHAVE_PYTHON=\"2.7\" -DMESOS_HAS_PYTHON=1 -I. -I../../../3rdparty/stout  -I../../../3rdparty/stout/include -I../boost-1.65.0 -I../elfio-3.2 -I../glog-0.4.0/src -I../googletest-release-1.8.0/googlemock/include -I../googletest-release-1.8.0/googletest/inc
 lude -I../libarchive-3.3.2/libarchive -D__STDC_FORMAT_MACROS -I../picojson-1.3.0 -I../protobuf-3.5.0/src -I../rapidjson-1.1.0/include  -I/usr/include/subversion-1 -I/usr/include/apr-1 -I/usr/include/apr-1.0	       -Wall -Wsign-compare -Wformat-security -fstack-protector -fPIC -fPIE -g1 -O0 -Wno-unused-local-typedefs -std=c++11 -c -o stout_tests-uuid_tests.o `test -f 'tests/uuid_tests.cpp' || echo '../../../3rdparty/stout/'`tests/uuid_tests.cpp
g++ -DPACKAGE_NAME=\"mesos\" -DPACKAGE_TARNAME=\"mesos\" -DPACKAGE_VERSION=\"1.9.0\" -DPACKAGE_STRING=\"mesos\ 1.9.0\" -DPACKAGE_BUGREPORT=\"\" -DPACKAGE_URL=\"\" -DPACKAGE=\"mesos\" -DVERSION=\"1.9.0\" -DSTDC_HEADERS=1 -DHAVE_SYS_TYPES_H=1 -DHAVE_SYS_STAT_H=1 -DHAVE_STDLIB_H=1 -DHAVE_STRING_H=1 -DHAVE_MEMORY_H=1 -DHAVE_STRINGS_H=1 -DHAVE_INTTYPES_H=1 -DHAVE_STDINT_H=1 -DHAVE_UNISTD_H=1 -DHAVE_DLFCN_H=1 -DLT_OBJDIR=\".libs/\" -DHAVE_CXX11=1 -DHAVE_PTHREAD_PRIO_INHERIT=1 -DHAVE_PTHREAD=1 -DHAVE_OPENSSL_SSL_H=1 -DHAVE_FTS_H=1 -DHAVE_APR_POOLS_H=1 -DHAVE_LIBAPR_1=1 -DHAVE_LIBCURL=1 -DMESOS_HAS_JAVA=1 -DHAVE_LIBSASL2=1 -DHAVE_SVN_VERSION_H=1 -DHAVE_LIBSVN_SUBR_1=1 -DHAVE_SVN_DELTA_H=1 -DHAVE_LIBSVN_DELTA_1=1 -DHAVE_ZLIB_H=1 -DHAVE_LIBZ=1 -DHAVE_PYTHON=\"2.7\" -DMESOS_HAS_PYTHON=1 -I. -I../../../3rdparty/stout  -I../../../3rdparty/stout/include -I../boost-1.65.0 -I../elfio-3.2 -I../glog-0.4.0/src -I../googletest-release-1.8.0/googlemock/include -I../googletest-release-1.8.0/googletest/inc
 lude -I../libarchive-3.3.2/libarchive -D__STDC_FORMAT_MACROS -I../picojson-1.3.0 -I../protobuf-3.5.0/src -I../rapidjson-1.1.0/include  -I/usr/include/subversion-1 -I/usr/include/apr-1 -I/usr/include/apr-1.0	       -Wall -Wsign-compare -Wformat-security -fstack-protector -fPIC -fPIE -g1 -O0 -Wno-unused-local-typedefs -std=c++11 -c -o stout_tests-variant_tests.o `test -f 'tests/variant_tests.cpp' || echo '../../../3rdparty/stout/'`tests/variant_tests.cpp
g++ -DPACKAGE_NAME=\"mesos\" -DPACKAGE_TARNAME=\"mesos\" -DPACKAGE_VERSION=\"1.9.0\" -DPACKAGE_STRING=\"mesos\ 1.9.0\" -DPACKAGE_BUGREPORT=\"\" -DPACKAGE_URL=\"\" -DPACKAGE=\"mesos\" -DVERSION=\"1.9.0\" -DSTDC_HEADERS=1 -DHAVE_SYS_TYPES_H=1 -DHAVE_SYS_STAT_H=1 -DHAVE_STDLIB_H=1 -DHAVE_STRING_H=1 -DHAVE_MEMORY_H=1 -DHAVE_STRINGS_H=1 -DHAVE_INTTYPES_H=1 -DHAVE_STDINT_H=1 -DHAVE_UNISTD_H=1 -DHAVE_DLFCN_H=1 -DLT_OBJDIR=\".libs/\" -DHAVE_CXX11=1 -DHAVE_PTHREAD_PRIO_INHERIT=1 -DHAVE_PTHREAD=1 -DHAVE_OPENSSL_SSL_H=1 -DHAVE_FTS_H=1 -DHAVE_APR_POOLS_H=1 -DHAVE_LIBAPR_1=1 -DHAVE_LIBCURL=1 -DMESOS_HAS_JAVA=1 -DHAVE_LIBSASL2=1 -DHAVE_SVN_VERSION_H=1 -DHAVE_LIBSVN_SUBR_1=1 -DHAVE_SVN_DELTA_H=1 -DHAVE_LIBSVN_DELTA_1=1 -DHAVE_ZLIB_H=1 -DHAVE_LIBZ=1 -DHAVE_PYTHON=\"2.7\" -DMESOS_HAS_PYTHON=1 -I. -I../../../3rdparty/stout  -I../../../3rdparty/stout/include -I../boost-1.65.0 -I../elfio-3.2 -I../glog-0.4.0/src -I../googletest-release-1.8.0/googlemock/include -I../googletest-release-1.8.0/googletest/inc
 lude -I../libarchive-3.3.2/libarchive -D__STDC_FORMAT_MACROS -I../picojson-1.3.0 -I../protobuf-3.5.0/src -I../rapidjson-1.1.0/include  -I/usr/include/subversion-1 -I/usr/include/apr-1 -I/usr/include/apr-1.0	       -Wall -Wsign-compare -Wformat-security -fstack-protector -fPIC -fPIE -g1 -O0 -Wno-unused-local-typedefs -std=c++11 -c -o stout_tests-version_tests.o `test -f 'tests/version_tests.cpp' || echo '../../../3rdparty/stout/'`tests/version_tests.cpp
g++ -DPACKAGE_NAME=\"mesos\" -DPACKAGE_TARNAME=\"mesos\" -DPACKAGE_VERSION=\"1.9.0\" -DPACKAGE_STRING=\"mesos\ 1.9.0\" -DPACKAGE_BUGREPORT=\"\" -DPACKAGE_URL=\"\" -DPACKAGE=\"mesos\" -DVERSION=\"1.9.0\" -DSTDC_HEADERS=1 -DHAVE_SYS_TYPES_H=1 -DHAVE_SYS_STAT_H=1 -DHAVE_STDLIB_H=1 -DHAVE_STRING_H=1 -DHAVE_MEMORY_H=1 -DHAVE_STRINGS_H=1 -DHAVE_INTTYPES_H=1 -DHAVE_STDINT_H=1 -DHAVE_UNISTD_H=1 -DHAVE_DLFCN_H=1 -DLT_OBJDIR=\".libs/\" -DHAVE_CXX11=1 -DHAVE_PTHREAD_PRIO_INHERIT=1 -DHAVE_PTHREAD=1 -DHAVE_OPENSSL_SSL_H=1 -DHAVE_FTS_H=1 -DHAVE_APR_POOLS_H=1 -DHAVE_LIBAPR_1=1 -DHAVE_LIBCURL=1 -DMESOS_HAS_JAVA=1 -DHAVE_LIBSASL2=1 -DHAVE_SVN_VERSION_H=1 -DHAVE_LIBSVN_SUBR_1=1 -DHAVE_SVN_DELTA_H=1 -DHAVE_LIBSVN_DELTA_1=1 -DHAVE_ZLIB_H=1 -DHAVE_LIBZ=1 -DHAVE_PYTHON=\"2.7\" -DMESOS_HAS_PYTHON=1 -I. -I../../../3rdparty/stout  -I../../../3rdparty/stout/include -I../boost-1.65.0 -I../elfio-3.2 -I../glog-0.4.0/src -I../googletest-release-1.8.0/googlemock/include -I../googletest-release-1.8.0/googletest/inc
 lude -I../libarchive-3.3.2/libarchive -D__STDC_FORMAT_MACROS -I../picojson-1.3.0 -I../protobuf-3.5.0/src -I../rapidjson-1.1.0/include  -I/usr/include/subversion-1 -I/usr/include/apr-1 -I/usr/include/apr-1.0	       -Wall -Wsign-compare -Wformat-security -fstack-protector -fPIC -fPIE -g1 -O0 -Wno-unused-local-typedefs -std=c++11 -c -o stout_tests-proc_tests.o `test -f 'tests/proc_tests.cpp' || echo '../../../3rdparty/stout/'`tests/proc_tests.cpp
g++ -DPACKAGE_NAME=\"mesos\" -DPACKAGE_TARNAME=\"mesos\" -DPACKAGE_VERSION=\"1.9.0\" -DPACKAGE_STRING=\"mesos\ 1.9.0\" -DPACKAGE_BUGREPORT=\"\" -DPACKAGE_URL=\"\" -DPACKAGE=\"mesos\" -DVERSION=\"1.9.0\" -DSTDC_HEADERS=1 -DHAVE_SYS_TYPES_H=1 -DHAVE_SYS_STAT_H=1 -DHAVE_STDLIB_H=1 -DHAVE_STRING_H=1 -DHAVE_MEMORY_H=1 -DHAVE_STRINGS_H=1 -DHAVE_INTTYPES_H=1 -DHAVE_STDINT_H=1 -DHAVE_UNISTD_H=1 -DHAVE_DLFCN_H=1 -DLT_OBJDIR=\".libs/\" -DHAVE_CXX11=1 -DHAVE_PTHREAD_PRIO_INHERIT=1 -DHAVE_PTHREAD=1 -DHAVE_OPENSSL_SSL_H=1 -DHAVE_FTS_H=1 -DHAVE_APR_POOLS_H=1 -DHAVE_LIBAPR_1=1 -DHAVE_LIBCURL=1 -DMESOS_HAS_JAVA=1 -DHAVE_LIBSASL2=1 -DHAVE_SVN_VERSION_H=1 -DHAVE_LIBSVN_SUBR_1=1 -DHAVE_SVN_DELTA_H=1 -DHAVE_LIBSVN_DELTA_1=1 -DHAVE_ZLIB_H=1 -DHAVE_LIBZ=1 -DHAVE_PYTHON=\"2.7\" -DMESOS_HAS_PYTHON=1 -I. -I../../../3rdparty/stout  -I../../../3rdparty/stout/include -I../boost-1.65.0 -I../elfio-3.2 -I../glog-0.4.0/src -I../googletest-release-1.8.0/googlemock/include -I../googletest-release-1.8.0/googletest/inc
 lude -I../libarchive-3.3.2/libarchive -D__STDC_FORMAT_MACROS -I../picojson-1.3.0 -I../protobuf-3.5.0/src -I../rapidjson-1.1.0/include  -I/usr/include/subversion-1 -I/usr/include/apr-1 -I/usr/include/apr-1.0	       -Wall -Wsign-compare -Wformat-security -fstack-protector -fPIC -fPIE -g1 -O0 -Wno-unused-local-typedefs -std=c++11 -c -o stout_tests-protobuf_tests.pb.o `test -f 'protobuf_tests.pb.cc' || echo '../../../3rdparty/stout/'`protobuf_tests.pb.cc
/bin/bash ../../libtool  --tag=CXX   --mode=link g++ -Wall -Wsign-compare -Wformat-security -fstack-protector -fPIC -fPIE -g1 -O0 -Wno-unused-local-typedefs -std=c++11   -o stout-tests stout_tests-adaptor_tests.o stout_tests-archiver_tests.o stout_tests-base64_tests.o stout_tests-bits_tests.o stout_tests-boundedhashmap_tests.o stout_tests-bytes_tests.o stout_tests-cache_tests.o stout_tests-cpp17_tests.o stout_tests-duration_tests.o stout_tests-dynamiclibrary_tests.o stout_tests-error_tests.o stout_tests-flags_tests.o stout_tests-gzip_tests.o stout_tests-hashmap_tests.o stout_tests-hashset_tests.o stout_tests-interval_tests.o stout_tests-ip_tests.o stout_tests-json_tests.o stout_tests-jsonify_tests.o stout_tests-lambda_tests.o stout_tests-linkedhashmap_tests.o stout_tests-mac_tests.o stout_tests-main.o stout_tests-multimap_tests.o stout_tests-none_tests.o stout_tests-numify_tests.o stout_tests-option_tests.o stout_tests-os_tests.o stout_tests-copyfile_tests.o stout_tests-env_tests.o s
 tout_tests-filesystem_tests.o stout_tests-process_tests.o stout_tests-rmdir_tests.o stout_tests-sendfile_tests.o stout_tests-signals_tests.o stout_tests-socket_tests.o stout_tests-strerror_tests.o stout_tests-systems_tests.o stout_tests-path_tests.o stout_tests-protobuf_tests.o stout_tests-recordio_tests.o stout_tests-result_tests.o stout_tests-some_tests.o stout_tests-strings_tests.o stout_tests-subcommand_tests.o stout_tests-svn_tests.o stout_tests-try_tests.o stout_tests-uri_tests.o stout_tests-uuid_tests.o stout_tests-variant_tests.o stout_tests-version_tests.o stout_tests-proc_tests.o stout_tests-protobuf_tests.pb.o ../libgmock.la ../glog-0.4.0/libglog.la ../libarchive-3.3.2/.libs/libarchive.la ../protobuf-3.5.0/src/libprotobuf.la -lsvn_subr-1 -lsvn_delta-1 -lapr-1 -ldl -lz -lsvn_delta-1 -lsvn_subr-1 -lsasl2 -lcurl -lapr-1  -lrt
libtool: link: g++ -Wall -Wsign-compare -Wformat-security -fstack-protector -fPIC -fPIE -g1 -O0 -Wno-unused-local-typedefs -std=c++11 -o stout-tests stout_tests-adaptor_tests.o stout_tests-archiver_tests.o stout_tests-base64_tests.o stout_tests-bits_tests.o stout_tests-boundedhashmap_tests.o stout_tests-bytes_tests.o stout_tests-cache_tests.o stout_tests-cpp17_tests.o stout_tests-duration_tests.o stout_tests-dynamiclibrary_tests.o stout_tests-error_tests.o stout_tests-flags_tests.o stout_tests-gzip_tests.o stout_tests-hashmap_tests.o stout_tests-hashset_tests.o stout_tests-interval_tests.o stout_tests-ip_tests.o stout_tests-json_tests.o stout_tests-jsonify_tests.o stout_tests-lambda_tests.o stout_tests-linkedhashmap_tests.o stout_tests-mac_tests.o stout_tests-main.o stout_tests-multimap_tests.o stout_tests-none_tests.o stout_tests-numify_tests.o stout_tests-option_tests.o stout_tests-os_tests.o stout_tests-copyfile_tests.o stout_tests-env_tests.o stout_tests-filesystem_tests.o stout_
 tests-process_tests.o stout_tests-rmdir_tests.o stout_tests-sendfile_tests.o stout_tests-signals_tests.o stout_tests-socket_tests.o stout_tests-strerror_tests.o stout_tests-systems_tests.o stout_tests-path_tests.o stout_tests-protobuf_tests.o stout_tests-recordio_tests.o stout_tests-result_tests.o stout_tests-some_tests.o stout_tests-strings_tests.o stout_tests-subcommand_tests.o stout_tests-svn_tests.o stout_tests-try_tests.o stout_tests-uri_tests.o stout_tests-uuid_tests.o stout_tests-variant_tests.o stout_tests-version_tests.o stout_tests-proc_tests.o stout_tests-protobuf_tests.pb.o  ../.libs/libgmock.a ../glog-0.4.0/.libs/libglog.a ../libarchive-3.3.2/.libs/libarchive.a ../protobuf-3.5.0/src/.libs/libprotobuf.a -lpthread -ldl -lz /usr/lib/x86_64-linux-gnu/libsvn_delta-1.so /usr/lib/x86_64-linux-gnu/libsvn_subr-1.so -lsasl2 /usr/lib/x86_64-linux-gnu/libcurl-nss.so /usr/lib/x86_64-linux-gnu/libapr-1.so -lrt -pthread
make[7]: Leaving directory `/mesos/mesos-1.9.0/_build/3rdparty/stout'
make  check-local
make[7]: Entering directory `/mesos/mesos-1.9.0/_build/3rdparty/stout'
make  stout-tests
make[8]: Entering directory `/mesos/mesos-1.9.0/_build/3rdparty/stout'
make[8]: `stout-tests' is up to date.
make[8]: Leaving directory `/mesos/mesos-1.9.0/_build/3rdparty/stout'
./stout-tests
Note: Google Test filter = *-
[==========] Running 361 tests from 56 test cases.
[----------] Global test environment set-up.
[----------] 1 test from AdaptorTest
[ RUN      ] AdaptorTest.Reversed
[       OK ] AdaptorTest.Reversed (0 ms)
[----------] 1 test from AdaptorTest (0 ms total)

[----------] 17 tests from ArchiverTest
[ RUN      ] ArchiverTest.ExtractEmptyInputFile
[       OK ] ArchiverTest.ExtractEmptyInputFile (0 ms)
[ RUN      ] ArchiverTest.ExtractInputFileNotFound
[       OK ] ArchiverTest.ExtractInputFileNotFound (1 ms)
[ RUN      ] ArchiverTest.ExtractTarGzFile
[       OK ] ArchiverTest.ExtractTarGzFile (1 ms)
[ RUN      ] ArchiverTest.ExtractTarFile
[       OK ] ArchiverTest.ExtractTarFile (1 ms)
[ RUN      ] ArchiverTest.ExtractZipFile
[       OK ] ArchiverTest.ExtractZipFile (1 ms)
[ RUN      ] ArchiverTest.ExtractInvalidZipFile
[       OK ] ArchiverTest.ExtractInvalidZipFile (1 ms)
[ RUN      ] ArchiverTest.ExtractZipFileWithDuplicatedEntries
[       OK ] ArchiverTest.ExtractZipFileWithDuplicatedEntries (0 ms)
[ RUN      ] ArchiverTest.ExtractTarXZFile
[       OK ] ArchiverTest.ExtractTarXZFile (3 ms)
[ RUN      ] ArchiverTest.ExtractTarBZ2File
[       OK ] ArchiverTest.ExtractTarBZ2File (14 ms)
[ RUN      ] ArchiverTest.ExtractTarBz2GzFile
[       OK ] ArchiverTest.ExtractTarBz2GzFile (3 ms)
[ RUN      ] ArchiverTest.ExtractBz2FileFails
[       OK ] ArchiverTest.ExtractBz2FileFails (2 ms)
[ RUN      ] ArchiverTest.ExtractGzFileFails
[       OK ] ArchiverTest.ExtractGzFileFails (0 ms)
[ RUN      ] ArchiverTest.SYMLINK_ExtractTarGzFileWithLinks
[       OK ] ArchiverTest.SYMLINK_ExtractTarGzFileWithLinks (1 ms)
[ RUN      ] ArchiverTest.ExtractTarGzFileWithDestinationDir
[       OK ] ArchiverTest.ExtractTarGzFileWithDestinationDir (1 ms)
[ RUN      ] ArchiverTest.ExtractZipFileWithDestinationDir
[       OK ] ArchiverTest.ExtractZipFileWithDestinationDir (1 ms)
[ RUN      ] ArchiverTest.ExtractZipFileWithLongDestinationDir
[       OK ] ArchiverTest.ExtractZipFileWithLongDestinationDir (3 ms)
[ RUN      ] ArchiverTest.ExtractZipWithDotDot
[       OK ] ArchiverTest.ExtractZipWithDotDot (1 ms)
[----------] 17 tests from ArchiverTest (35 ms total)

[----------] 4 tests from Base64Test
[ RUN      ] Base64Test.Encode
[       OK ] Base64Test.Encode (0 ms)
[ RUN      ] Base64Test.Decode
[       OK ] Base64Test.Decode (1 ms)
[ RUN      ] Base64Test.EncodeURLSafe
[       OK ] Base64Test.EncodeURLSafe (0 ms)
[ RUN      ] Base64Test.DecodeURLSafe
[       OK ] Base64Test.DecodeURLSafe (0 ms)
[----------] 4 tests from Base64Test (1 ms total)

[----------] 1 test from BitsTest
[ RUN      ] BitsTest.CountSetBits
[       OK ] BitsTest.CountSetBits (0 ms)
[----------] 1 test from BitsTest (0 ms total)

[----------] 5 tests from BoundedHashMapTest
[ RUN      ] BoundedHashMapTest.Set
[       OK ] BoundedHashMapTest.Set (0 ms)
[ RUN      ] BoundedHashMapTest.EmptyMap
[       OK ] BoundedHashMapTest.EmptyMap (0 ms)
[ RUN      ] BoundedHashMapTest.Foreach
[       OK ] BoundedHashMapTest.Foreach (0 ms)
[ RUN      ] BoundedHashMapTest.ForeachConst
[       OK ] BoundedHashMapTest.ForeachConst (0 ms)
[ RUN      ] BoundedHashMapTest.ForeachMutate
[       OK ] BoundedHashMapTest.ForeachMutate (0 ms)
[----------] 5 tests from BoundedHashMapTest (0 ms total)

[----------] 4 tests from BoundedHashmapTest
[ RUN      ] BoundedHashmapTest.Contains
[       OK ] BoundedHashmapTest.Contains (0 ms)
[ RUN      ] BoundedHashmapTest.Erase
[       OK ] BoundedHashmapTest.Erase (0 ms)
[ RUN      ] BoundedHashmapTest.Keys
[       OK ] BoundedHashmapTest.Keys (0 ms)
[ RUN      ] BoundedHashmapTest.Values
[       OK ] BoundedHashmapTest.Values (0 ms)
[----------] 4 tests from BoundedHashmapTest (0 ms total)

[----------] 4 tests from BytesTest
[ RUN      ] BytesTest.Parse
[       OK ] BytesTest.Parse (1 ms)
[ RUN      ] BytesTest.Arithmetic
[       OK ] BytesTest.Arithmetic (0 ms)
[ RUN      ] BytesTest.Comparison
[       OK ] BytesTest.Comparison (0 ms)
[ RUN      ] BytesTest.Stringify
[       OK ] BytesTest.Stringify (0 ms)
[----------] 4 tests from BytesTest (1 ms total)

[----------] 4 tests from CacheTest
[ RUN      ] CacheTest.Insert
[       OK ] CacheTest.Insert (0 ms)
[ RUN      ] CacheTest.Update
[       OK ] CacheTest.Update (0 ms)
[ RUN      ] CacheTest.Erase
[       OK ] CacheTest.Erase (0 ms)
[ RUN      ] CacheTest.LRUEviction
[       OK ] CacheTest.LRUEviction (0 ms)
[----------] 4 tests from CacheTest (0 ms total)

[----------] 4 tests from Invoke
[ RUN      ] Invoke.Free
[       OK ] Invoke.Free (0 ms)
[ RUN      ] Invoke.Lambda
[       OK ] Invoke.Lambda (0 ms)
[ RUN      ] Invoke.Member
[       OK ] Invoke.Member (0 ms)
[ RUN      ] Invoke.FunctionObject
[       OK ] Invoke.FunctionObject (0 ms)
[----------] 4 tests from Invoke (0 ms total)

[----------] 5 tests from DurationTest
[ RUN      ] DurationTest.Comparison
[       OK ] DurationTest.Comparison (0 ms)
[ RUN      ] DurationTest.ParseAndTry
[       OK ] DurationTest.ParseAndTry (0 ms)
[ RUN      ] DurationTest.Arithmetic
[       OK ] DurationTest.Arithmetic (0 ms)
[ RUN      ] DurationTest.OutputFormat
[       OK ] DurationTest.OutputFormat (0 ms)
[ RUN      ] DurationTest.Timeval
[       OK ] DurationTest.Timeval (0 ms)
[----------] 5 tests from DurationTest (0 ms total)

[----------] 8 tests from DynamicLibraryTest
[ RUN      ] DynamicLibraryTest.LoadKnownSymbol
[       OK ] DynamicLibraryTest.LoadKnownSymbol (1 ms)
[ RUN      ] DynamicLibraryTest.FailToLoadInvalidSymbol
[       OK ] DynamicLibraryTest.FailToLoadInvalidSymbol (0 ms)
[ RUN      ] DynamicLibraryTest.CloseAndLoadSymbolFailWithoutOpeningLib
[       OK ] DynamicLibraryTest.CloseAndLoadSymbolFailWithoutOpeningLib (0 ms)
[ RUN      ] DynamicLibraryTest.VerifyClose
[       OK ] DynamicLibraryTest.VerifyClose (0 ms)
[ RUN      ] DynamicLibraryTest.FailToLoadInvalidLibPath
[       OK ] DynamicLibraryTest.FailToLoadInvalidLibPath (0 ms)
[ RUN      ] DynamicLibraryTest.DoubleFailOpen
[       OK ] DynamicLibraryTest.DoubleFailOpen (1 ms)
[ RUN      ] DynamicLibraryTest.OpenSuccessThenOpenFail
[       OK ] DynamicLibraryTest.OpenSuccessThenOpenFail (0 ms)
[ RUN      ] DynamicLibraryTest.OpenFailThenOpenSuccess
[       OK ] DynamicLibraryTest.OpenFailThenOpenSuccess (0 ms)
[----------] 8 tests from DynamicLibraryTest (2 ms total)

[----------] 2 tests from ErrorTest
[ RUN      ] ErrorTest.Test
[       OK ] ErrorTest.Test (0 ms)
[ RUN      ] ErrorTest.Errno
[       OK ] ErrorTest.Errno (0 ms)
[----------] 2 tests from ErrorTest (0 ms total)

[----------] 26 tests from FlagsTest
[ RUN      ] FlagsTest.Load
[       OK ] FlagsTest.Load (0 ms)
[ RUN      ] FlagsTest.Add
[       OK ] FlagsTest.Add (0 ms)
[ RUN      ] FlagsTest.Alias
[       OK ] FlagsTest.Alias (0 ms)
[ RUN      ] FlagsTest.Flags
[       OK ] FlagsTest.Flags (0 ms)
[ RUN      ] FlagsTest.LoadFromEnvironment
[       OK ] FlagsTest.LoadFromEnvironment (1 ms)
[ RUN      ] FlagsTest.LoadFromCommandLine
[       OK ] FlagsTest.LoadFromCommandLine (0 ms)
[ RUN      ] FlagsTest.LoadFromCommandLineWithNonFlags
[       OK ] FlagsTest.LoadFromCommandLineWithNonFlags (0 ms)
[ RUN      ] FlagsTest.LoadFromCommandLineWithDashDash
[       OK ] FlagsTest.LoadFromCommandLineWithDashDash (0 ms)
[ RUN      ] FlagsTest.LoadFromCommandLineAndUpdateArgcArgv
[       OK ] FlagsTest.LoadFromCommandLineAndUpdateArgcArgv (0 ms)
[ RUN      ] FlagsTest.Stringification
[       OK ] FlagsTest.Stringification (1 ms)
[ RUN      ] FlagsTest.EffectiveName
[       OK ] FlagsTest.EffectiveName (0 ms)
[ RUN      ] FlagsTest.DeprecationWarning
[       OK ] FlagsTest.DeprecationWarning (0 ms)
[ RUN      ] FlagsTest.DuplicatesFromEnvironment
[       OK ] FlagsTest.DuplicatesFromEnvironment (0 ms)
[ RUN      ] FlagsTest.DuplicatesFromCommandLine
[       OK ] FlagsTest.DuplicatesFromCommandLine (0 ms)
[ RUN      ] FlagsTest.AliasDuplicateFromCommandLine
[       OK ] FlagsTest.AliasDuplicateFromCommandLine (0 ms)
[ RUN      ] FlagsTest.Errors
[       OK ] FlagsTest.Errors (1 ms)
[ RUN      ] FlagsTest.MissingRequiredFlag
[       OK ] FlagsTest.MissingRequiredFlag (0 ms)
[ RUN      ] FlagsTest.Validate
[       OK ] FlagsTest.Validate (0 ms)
[ RUN      ] FlagsTest.Usage
[       OK ] FlagsTest.Usage (0 ms)
[ RUN      ] FlagsTest.UsageMessage
[       OK ] FlagsTest.UsageMessage (0 ms)
[ RUN      ] FlagsTest.EmptyUsage
[       OK ] FlagsTest.EmptyUsage (0 ms)
[ RUN      ] FlagsTest.ProgramName
[       OK ] FlagsTest.ProgramName (0 ms)
[ RUN      ] FlagsTest.OptionalMessage
[       OK ] FlagsTest.OptionalMessage (0 ms)
[ RUN      ] FlagsTest.BuildEnvironment
[       OK ] FlagsTest.BuildEnvironment (0 ms)
[ RUN      ] FlagsTest.Duration
[       OK ] FlagsTest.Duration (0 ms)
[ RUN      ] FlagsTest.JSON
[       OK ] FlagsTest.JSON (0 ms)
[----------] 26 tests from FlagsTest (4 ms total)

[----------] 2 tests from FlagsFileTest
[ RUN      ] FlagsFileTest.JSONFile
WARNING: Logging before InitGoogleLogging() is written to STDERR
W0726 03:04:04.236941 13372 parse.hpp:116] Specifying an absolute filename to read a command line option out of without using 'file:// is deprecated and will be removed in a future release. Simply adding 'file://' to the beginning of the path should eliminate this warning.
[       OK ] FlagsFileTest.JSONFile (1 ms)
[ RUN      ] FlagsFileTest.FilePrefix
[       OK ] FlagsFileTest.FilePrefix (0 ms)
[----------] 2 tests from FlagsFileTest (1 ms total)

[----------] 2 tests from GzipTest
[ RUN      ] GzipTest.CompressDecompressString
[       OK ] GzipTest.CompressDecompressString (159 ms)
[ RUN      ] GzipTest.Decompressor
[       OK ] GzipTest.Decompressor (0 ms)
[----------] 2 tests from GzipTest (159 ms total)

[----------] 6 tests from HashMapTest
[ RUN      ] HashMapTest.InitializerList
[       OK ] HashMapTest.InitializerList (0 ms)
[ RUN      ] HashMapTest.FromStdMap
[       OK ] HashMapTest.FromStdMap (0 ms)
[ RUN      ] HashMapTest.FromRValueStdMap
[       OK ] HashMapTest.FromRValueStdMap (0 ms)
[ RUN      ] HashMapTest.Insert
[       OK ] HashMapTest.Insert (0 ms)
[ RUN      ] HashMapTest.Contains
[       OK ] HashMapTest.Contains (0 ms)
[ RUN      ] HashMapTest.CustomHashAndEqual
[       OK ] HashMapTest.CustomHashAndEqual (0 ms)
[----------] 6 tests from HashMapTest (0 ms total)

[----------] 7 tests from HashsetTest
[ RUN      ] HashsetTest.InitializerList
[       OK ] HashsetTest.InitializerList (0 ms)
[ RUN      ] HashsetTest.FromStdSet
[       OK ] HashsetTest.FromStdSet (0 ms)
[ RUN      ] HashsetTest.FromRValueStdSet
[       OK ] HashsetTest.FromRValueStdSet (0 ms)
[ RUN      ] HashsetTest.CustomHashAndEqual
[       OK ] HashsetTest.CustomHashAndEqual (0 ms)
[ RUN      ] HashsetTest.Insert
[       OK ] HashsetTest.Insert (0 ms)
[ RUN      ] HashsetTest.Union
[       OK ] HashsetTest.Union (0 ms)
[ RUN      ] HashsetTest.Difference
[       OK ] HashsetTest.Difference (0 ms)
[----------] 7 tests from HashsetTest (0 ms total)

[----------] 13 tests from IntervalTest
[ RUN      ] IntervalTest.Interval
[       OK ] IntervalTest.Interval (0 ms)
[ RUN      ] IntervalTest.EmptyInterval
[       OK ] IntervalTest.EmptyInterval (0 ms)
[ RUN      ] IntervalTest.IntervalEqual
[       OK ] IntervalTest.IntervalEqual (0 ms)
[ RUN      ] IntervalTest.Constructor
[       OK ] IntervalTest.Constructor (0 ms)
[ RUN      ] IntervalTest.Contains
[       OK ] IntervalTest.Contains (0 ms)
[ RUN      ] IntervalTest.Addition
[       OK ] IntervalTest.Addition (0 ms)
[ RUN      ] IntervalTest.Subtraction
[       OK ] IntervalTest.Subtraction (0 ms)
[ RUN      ] IntervalTest.Intersection
[       OK ] IntervalTest.Intersection (0 ms)
[ RUN      ] IntervalTest.IntersectionTest
[       OK ] IntervalTest.IntersectionTest (0 ms)
[ RUN      ] IntervalTest.LargeInterval
[       OK ] IntervalTest.LargeInterval (0 ms)
[ RUN      ] IntervalTest.IntervalIteration
[       OK ] IntervalTest.IntervalIteration (0 ms)
[ RUN      ] IntervalTest.Stream
[       OK ] IntervalTest.Stream (1 ms)
[ RUN      ] IntervalTest.InfixOperator
[       OK ] IntervalTest.InfixOperator (0 ms)
[----------] 13 tests from IntervalTest (1 ms total)

[----------] 9 tests from NetTest
[ RUN      ] NetTest.LinkDevice
[       OK ] NetTest.LinkDevice (0 ms)
[ RUN      ] NetTest.ConstructIPv4
[       OK ] NetTest.ConstructIPv4 (0 ms)
[ RUN      ] NetTest.ConstructIPv6
[       OK ] NetTest.ConstructIPv6 (0 ms)
[ RUN      ] NetTest.ConstructIPv4Network
[       OK ] NetTest.ConstructIPv4Network (0 ms)
[ RUN      ] NetTest.ConstructIPv6Network
[       OK ] NetTest.ConstructIPv6Network (0 ms)
[ RUN      ] NetTest.CopyIPNetwork
[       OK ] NetTest.CopyIPNetwork (1 ms)
[ RUN      ] NetTest.Mac
[       OK ] NetTest.Mac (0 ms)
[ RUN      ] NetTest.ConstructMAC
[       OK ] NetTest.ConstructMAC (0 ms)
[ RUN      ] NetTest.ParseMAC
[       OK ] NetTest.ParseMAC (0 ms)
[----------] 9 tests from NetTest (1 ms total)

[----------] 20 tests from JsonTest
[ RUN      ] JsonTest.DefaultValueIsNull
[       OK ] JsonTest.DefaultValueIsNull (0 ms)
[ RUN      ] JsonTest.UTF8
[       OK ] JsonTest.UTF8 (0 ms)
[ RUN      ] JsonTest.InvalidUTF8
[       OK ] JsonTest.InvalidUTF8 (0 ms)
[ RUN      ] JsonTest.NumberFormat
[       OK ] JsonTest.NumberFormat (0 ms)
[ RUN      ] JsonTest.NumberComparisons
[       OK ] JsonTest.NumberComparisons (0 ms)
[ RUN      ] JsonTest.BooleanFormat
[       OK ] JsonTest.BooleanFormat (0 ms)
[ RUN      ] JsonTest.BooleanAssignement
[       OK ] JsonTest.BooleanAssignement (0 ms)
[ RUN      ] JsonTest.CStringAssignment
[       OK ] JsonTest.CStringAssignment (0 ms)
[ RUN      ] JsonTest.NumericAssignment
[       OK ] JsonTest.NumericAssignment (0 ms)
[ RUN      ] JsonTest.Parse
[       OK ] JsonTest.Parse (1 ms)
[ RUN      ] JsonTest.ParseError
[       OK ] JsonTest.ParseError (0 ms)
[ RUN      ] JsonTest.Find
[       OK ] JsonTest.Find (1 ms)
[ RUN      ] JsonTest.At
[       OK ] JsonTest.At (0 ms)
[ RUN      ] JsonTest.Equals
[       OK ] JsonTest.Equals (1 ms)
[ RUN      ] JsonTest.ContainsArray
[       OK ] JsonTest.ContainsArray (0 ms)
[ RUN      ] JsonTest.ContainsBoolean
[       OK ] JsonTest.ContainsBoolean (0 ms)
[ RUN      ] JsonTest.ContainsNull
[       OK ] JsonTest.ContainsNull (0 ms)
[ RUN      ] JsonTest.ContainsString
[       OK ] JsonTest.ContainsString (1 ms)
[ RUN      ] JsonTest.ContainsObject
[       OK ] JsonTest.ContainsObject (0 ms)
[ RUN      ] JsonTest.NestingDepth
[       OK ] JsonTest.NestingDepth (38 ms)
[----------] 20 tests from JsonTest (42 ms total)

[----------] 17 tests from JsonifyTest
[ RUN      ] JsonifyTest.Boolean
[       OK ] JsonifyTest.Boolean (0 ms)
[ RUN      ] JsonifyTest.JSONBoolean
[       OK ] JsonifyTest.JSONBoolean (0 ms)
[ RUN      ] JsonifyTest.JSONBooleanValue
[       OK ] JsonifyTest.JSONBooleanValue (0 ms)
[ RUN      ] JsonifyTest.Number
[       OK ] JsonifyTest.Number (0 ms)
[ RUN      ] JsonifyTest.JSONNumber
[       OK ] JsonifyTest.JSONNumber (0 ms)
[ RUN      ] JsonifyTest.JSONNumberValue
[       OK ] JsonifyTest.JSONNumberValue (0 ms)
[ RUN      ] JsonifyTest.String
[       OK ] JsonifyTest.String (0 ms)
[ RUN      ] JsonifyTest.JSONString
[       OK ] JsonifyTest.JSONString (0 ms)
[ RUN      ] JsonifyTest.JSONStringValue
[       OK ] JsonifyTest.JSONStringValue (0 ms)
[ RUN      ] JsonifyTest.Object
[       OK ] JsonifyTest.Object (1 ms)
[ RUN      ] JsonifyTest.JSONObject
[       OK ] JsonifyTest.JSONObject (0 ms)
[ RUN      ] JsonifyTest.JSONObjectValue
[       OK ] JsonifyTest.JSONObjectValue (0 ms)
[ RUN      ] JsonifyTest.Array
[       OK ] JsonifyTest.Array (0 ms)
[ RUN      ] JsonifyTest.JSONArray
[       OK ] JsonifyTest.JSONArray (0 ms)
[ RUN      ] JsonifyTest.JSONArrayValue
[       OK ] JsonifyTest.JSONArrayValue (0 ms)
[ RUN      ] JsonifyTest.Dictionary
[       OK ] JsonifyTest.Dictionary (0 ms)
[ RUN      ] JsonifyTest.JSONNull
[       OK ] JsonifyTest.JSONNull (0 ms)
[----------] 17 tests from JsonifyTest (1 ms total)

[----------] 2 tests from LambdaTest
[ RUN      ] LambdaTest.Map
[       OK ] LambdaTest.Map (0 ms)
[ RUN      ] LambdaTest.Zip
[       OK ] LambdaTest.Zip (0 ms)
[----------] 2 tests from LambdaTest (0 ms total)

[----------] 1 test from PartialTest
[ RUN      ] PartialTest.Test
[       OK ] PartialTest.Test (0 ms)
[----------] 1 test from PartialTest (0 ms total)

[----------] 5 tests from LinkedHashmapTest
[ RUN      ] LinkedHashmapTest.Put
[       OK ] LinkedHashmapTest.Put (0 ms)
[ RUN      ] LinkedHashmapTest.Contains
[       OK ] LinkedHashmapTest.Contains (0 ms)
[ RUN      ] LinkedHashmapTest.Erase
[       OK ] LinkedHashmapTest.Erase (0 ms)
[ RUN      ] LinkedHashmapTest.Keys
[       OK ] LinkedHashmapTest.Keys (0 ms)
[ RUN      ] LinkedHashmapTest.Values
[       OK ] LinkedHashmapTest.Values (0 ms)
[----------] 5 tests from LinkedHashmapTest (0 ms total)

[----------] 5 tests from LinkedHashMapTest
[ RUN      ] LinkedHashMapTest.Foreach
[       OK ] LinkedHashMapTest.Foreach (0 ms)
[ RUN      ] LinkedHashMapTest.ForeachConst
[       OK ] LinkedHashMapTest.ForeachConst (0 ms)
[ RUN      ] LinkedHashMapTest.ForeachMutate
[       OK ] LinkedHashMapTest.ForeachMutate (0 ms)
[ RUN      ] LinkedHashMapTest.CopyConstruction
[       OK ] LinkedHashMapTest.CopyConstruction (0 ms)
[ RUN      ] LinkedHashMapTest.Assignment
[       OK ] LinkedHashMapTest.Assignment (0 ms)
[----------] 5 tests from LinkedHashMapTest (0 ms total)

[----------] 8 tests from MultimapTest/0, where TypeParam = Multimap<std::string, unsigned short>
[ RUN      ] MultimapTest/0.InitializerList
[       OK ] MultimapTest/0.InitializerList (0 ms)
[ RUN      ] MultimapTest/0.FromMultimap
[       OK ] MultimapTest/0.FromMultimap (0 ms)
[ RUN      ] MultimapTest/0.FromRValueMultimap
[       OK ] MultimapTest/0.FromRValueMultimap (1 ms)
[ RUN      ] MultimapTest/0.Put
[       OK ] MultimapTest/0.Put (0 ms)
[ RUN      ] MultimapTest/0.Remove
[       OK ] MultimapTest/0.Remove (0 ms)
[ RUN      ] MultimapTest/0.Size
[       OK ] MultimapTest/0.Size (0 ms)
[ RUN      ] MultimapTest/0.Keys
[       OK ] MultimapTest/0.Keys (0 ms)
[ RUN      ] MultimapTest/0.Foreach
[       OK ] MultimapTest/0.Foreach (0 ms)
[----------] 8 tests from MultimapTest/0 (1 ms total)

[----------] 8 tests from MultimapTest/1, where TypeParam = multihashmap<std::string, unsigned short, std::hash<std::string>, std::equal_to<std::string> >
[ RUN      ] MultimapTest/1.InitializerList
[       OK ] MultimapTest/1.InitializerList (0 ms)
[ RUN      ] MultimapTest/1.FromMultimap
[       OK ] MultimapTest/1.FromMultimap (0 ms)
[ RUN      ] MultimapTest/1.FromRValueMultimap
[       OK ] MultimapTest/1.FromRValueMultimap (0 ms)
[ RUN      ] MultimapTest/1.Put
[       OK ] MultimapTest/1.Put (0 ms)
[ RUN      ] MultimapTest/1.Remove
[       OK ] MultimapTest/1.Remove (0 ms)
[ RUN      ] MultimapTest/1.Size
[       OK ] MultimapTest/1.Size (0 ms)
[ RUN      ] MultimapTest/1.Keys
[       OK ] MultimapTest/1.Keys (0 ms)
[ RUN      ] MultimapTest/1.Foreach
[       OK ] MultimapTest/1.Foreach (0 ms)
[----------] 8 tests from MultimapTest/1 (0 ms total)

[----------] 1 test from NoneTest
[ RUN      ] NoneTest.Test
[       OK ] NoneTest.Test (0 ms)
[----------] 1 test from NoneTest (0 ms total)

[----------] 2 tests from NumifyTest
[ RUN      ] NumifyTest.DecNumberTest
[       OK ] NumifyTest.DecNumberTest (0 ms)
[ RUN      ] NumifyTest.HexNumberTest
[       OK ] NumifyTest.HexNumberTest (0 ms)
[----------] 2 tests from NumifyTest (0 ms total)

[----------] 9 tests from OptionTest
[ RUN      ] OptionTest.Min
[       OK ] OptionTest.Min (0 ms)
[ RUN      ] OptionTest.Max
[       OK ] OptionTest.Max (0 ms)
[ RUN      ] OptionTest.Comparison
[       OK ] OptionTest.Comparison (0 ms)
[ RUN      ] OptionTest.NonConstReference
[       OK ] OptionTest.NonConstReference (0 ms)
[ RUN      ] OptionTest.ArrowOperator
[       OK ] OptionTest.ArrowOperator (0 ms)
[ RUN      ] OptionTest.StarOperator
[       OK ] OptionTest.StarOperator (0 ms)
[ RUN      ] OptionTest.NonCopyable
[       OK ] OptionTest.NonCopyable (0 ms)
[ RUN      ] OptionTest.GetOrElse
[       OK ] OptionTest.GetOrElse (0 ms)
[ RUN      ] OptionTest.Hash
[       OK ] OptionTest.Hash (0 ms)
[----------] 9 tests from OptionTest (0 ms total)

[----------] 22 tests from OsTest
[ RUN      ] OsTest.Environment
[       OK ] OsTest.Environment (1 ms)
[ RUN      ] OsTest.TrivialEnvironment
[       OK ] OsTest.TrivialEnvironment (0 ms)
[ RUN      ] OsTest.Argv
[       OK ] OsTest.Argv (0 ms)
[ RUN      ] OsTest.System
sh: 1: invalid.command: not found
[       OK ] OsTest.System (12 ms)
[ RUN      ] OsTest.Cloexec
[       OK ] OsTest.Cloexec (1 ms)
[ RUN      ] OsTest.Nonblock
[       OK ] OsTest.Nonblock (0 ms)
[ RUN      ] OsTest.SYMLINK_Size
[       OK ] OsTest.SYMLINK_Size (1 ms)
[ RUN      ] OsTest.BootId
[       OK ] OsTest.BootId (0 ms)
[ RUN      ] OsTest.Sleep
[       OK ] OsTest.Sleep (10 ms)
[ RUN      ] OsTest.Children
[       OK ] OsTest.Children (9 ms)
[ RUN      ] OsTest.Killtree
[       OK ] OsTest.Killtree (31 ms)
[ RUN      ] OsTest.KilltreeNoRoot
[       OK ] OsTest.KilltreeNoRoot (25 ms)
[ RUN      ] OsTest.ProcessExists
[       OK ] OsTest.ProcessExists (6 ms)
[ RUN      ] OsTest.User
[       OK ] OsTest.User (13 ms)
[ RUN      ] OsTest.SYMLINK_Chown
[       OK ] OsTest.SYMLINK_Chown (0 ms)
[ RUN      ] OsTest.ChownNoAccess
[       OK ] OsTest.ChownNoAccess (0 ms)
[ RUN      ] OsTest.TrivialUser
[       OK ] OsTest.TrivialUser (1 ms)
[ RUN      ] OsTest.Libraries
[       OK ] OsTest.Libraries (0 ms)
[ RUN      ] OsTest.Shell
sh: 1: foobar: not found
E0726 03:04:04.557327 13372 shell.hpp:109] Command 'foobar' failed; this is the output:
[       OK ] OsTest.Shell (13 ms)
[ RUN      ] OsTest.Mknod
[       OK ] OsTest.Mknod (1 ms)
[ RUN      ] OsTest.SYMLINK_Realpath
[       OK ] OsTest.SYMLINK_Realpath (1 ms)
[ RUN      ] OsTest.Which
[       OK ] OsTest.Which (0 ms)
[----------] 22 tests from OsTest (126 ms total)

[----------] 4 tests from CopyFileTest
[ RUN      ] CopyFileTest.CopyWithAbsolutePath
[       OK ] CopyFileTest.CopyWithAbsolutePath (4 ms)
[ RUN      ] CopyFileTest.CopyToDirectoryDestinationFails
[       OK ] CopyFileTest.CopyToDirectoryDestinationFails (0 ms)
[ RUN      ] CopyFileTest.DestinationEndsInSlashFails
[       OK ] CopyFileTest.DestinationEndsInSlashFails (1 ms)
[ RUN      ] CopyFileTest.CopyToRelativeFilenameFails
[       OK ] CopyFileTest.CopyToRelativeFilenameFails (0 ms)
[----------] 4 tests from CopyFileTest (5 ms total)

[----------] 2 tests from EnvTest
[ RUN      ] EnvTest.SimpleEnvTest
[       OK ] EnvTest.SimpleEnvTest (1 ms)
[ RUN      ] EnvTest.EraseEnv
[       OK ] EnvTest.EraseEnv (0 ms)
[----------] 2 tests from EnvTest (1 ms total)

[----------] 17 tests from FsTest
[ RUN      ] FsTest.Find
[       OK ] FsTest.Find (1 ms)
[ RUN      ] FsTest.ReadWriteString
[       OK ] FsTest.ReadWriteString (0 ms)
[ RUN      ] FsTest.Mkdir
[       OK ] FsTest.Mkdir (1 ms)
[ RUN      ] FsTest.Exists
[       OK ] FsTest.Exists (0 ms)
[ RUN      ] FsTest.Touch
[       OK ] FsTest.Touch (1 ms)
[ RUN      ] FsTest.CreateDirectoryAtMaxPath
[       OK ] FsTest.CreateDirectoryAtMaxPath (0 ms)
[ RUN      ] FsTest.CreateDirectoryLongerThanMaxPath
[       OK ] FsTest.CreateDirectoryLongerThanMaxPath (2 ms)
[ RUN      ] FsTest.RealpathValidationOnOpenFile
[       OK ] FsTest.RealpathValidationOnOpenFile (0 ms)
[ RUN      ] FsTest.SYMLINK_Symlink
[       OK ] FsTest.SYMLINK_Symlink (0 ms)
[ RUN      ] FsTest.SYMLINK_Rm
[       OK ] FsTest.SYMLINK_Rm (1 ms)
[ RUN      ] FsTest.List
[       OK ] FsTest.List (1 ms)
[ RUN      ] FsTest.Rename
[       OK ] FsTest.Rename (1 ms)
[ RUN      ] FsTest.Open
[       OK ] FsTest.Open (1 ms)
[ RUN      ] FsTest.Close
[       OK ] FsTest.Close (0 ms)
[ RUN      ] FsTest.Xattr
[       OK ] FsTest.Xattr (0 ms)
[ RUN      ] FsTest.Used
[       OK ] FsTest.Used (1 ms)
[ RUN      ] FsTest.Lsof
[       OK ] FsTest.Lsof (0 ms)
[----------] 17 tests from FsTest (11 ms total)

[----------] 4 tests from ProcessTest
[ RUN      ] ProcessTest.Process
[       OK ] ProcessTest.Process (0 ms)
[ RUN      ] ProcessTest.Processes
[       OK ] ProcessTest.Processes (2 ms)
[ RUN      ] ProcessTest.Pids
[       OK ] ProcessTest.Pids (5 ms)
[ RUN      ] ProcessTest.Pstree
[       OK ] ProcessTest.Pstree (6 ms)
[----------] 4 tests from ProcessTest (14 ms total)

[----------] 12 tests from RmdirTest
[ RUN      ] RmdirTest.TrivialRemoveEmptyDirectoryAbsolutePath
[       OK ] RmdirTest.TrivialRemoveEmptyDirectoryAbsolutePath (1 ms)
[ RUN      ] RmdirTest.TrivialRemoveEmptyDirectoryRelativePath
[       OK ] RmdirTest.TrivialRemoveEmptyDirectoryRelativePath (0 ms)
[ RUN      ] RmdirTest.RemoveFile
[       OK ] RmdirTest.RemoveFile (1 ms)
[ RUN      ] RmdirTest.RemoveRecursiveByDefault
[       OK ] RmdirTest.RemoveRecursiveByDefault (0 ms)
[ RUN      ] RmdirTest.TrivialFailToRemoveInvalidPath
[       OK ] RmdirTest.TrivialFailToRemoveInvalidPath (1 ms)
[ RUN      ] RmdirTest.FailToRemoveNestedInvalidPath
[       OK ] RmdirTest.FailToRemoveNestedInvalidPath (0 ms)
[ RUN      ] RmdirTest.RemoveDirectoryWithDeviceFile
[       OK ] RmdirTest.RemoveDirectoryWithDeviceFile (1 ms)
[ RUN      ] RmdirTest.SYMLINK_RmDirNoTargetSymbolicLink
[       OK ] RmdirTest.SYMLINK_RmDirNoTargetSymbolicLink (0 ms)
[ RUN      ] RmdirTest.SYMLINK_RemoveDirectoryHangingSymlink
[       OK ] RmdirTest.SYMLINK_RemoveDirectoryHangingSymlink (0 ms)
[ RUN      ] RmdirTest.SYMLINK_RemoveDirectoryWithSymbolicLinkTargetDirectory
[       OK ] RmdirTest.SYMLINK_RemoveDirectoryWithSymbolicLinkTargetDirectory (1 ms)
[ RUN      ] RmdirTest.SYMLINK_RemoveDirectoryWithSymbolicLinkTargetFile
[       OK ] RmdirTest.SYMLINK_RemoveDirectoryWithSymbolicLinkTargetFile (0 ms)
[ RUN      ] RmdirTest.RemoveDirectoryButPreserveRoot
[       OK ] RmdirTest.RemoveDirectoryButPreserveRoot (1 ms)
[----------] 12 tests from RmdirTest (6 ms total)

[----------] 1 test from RmdirContinueOnErrorTest
[ RUN      ] RmdirContinueOnErrorTest.RemoveWithContinueOnError
[       OK ] RmdirContinueOnErrorTest.RemoveWithContinueOnError (0 ms)
[----------] 1 test from RmdirContinueOnErrorTest (0 ms total)

[----------] 1 test from OsSendfileTest
[ RUN      ] OsSendfileTest.Sendfile
[       OK ] OsSendfileTest.Sendfile (1 ms)
[----------] 1 test from OsSendfileTest (1 ms total)

[----------] 1 test from OsSignalsTest
[ RUN      ] OsSignalsTest.Suppress
[       OK ] OsSignalsTest.Suppress (0 ms)
[----------] 1 test from OsSignalsTest (0 ms total)

[----------] 3 tests from StrerrorTest
[ RUN      ] StrerrorTest.ValidErrno
[       OK ] StrerrorTest.ValidErrno (0 ms)
[ RUN      ] StrerrorTest.InvalidErrno
[       OK ] StrerrorTest.InvalidErrno (0 ms)
[ RUN      ] StrerrorTest.ValidHerrno
[       OK ] StrerrorTest.ValidHerrno (0 ms)
[----------] 3 tests from StrerrorTest (0 ms total)

[----------] 3 tests from SystemsTests
[ RUN      ] SystemsTests.Uname
[       OK ] SystemsTests.Uname (0 ms)
[ RUN      ] SystemsTests.Sysname
[       OK ] SystemsTests.Sysname (0 ms)
[ RUN      ] SystemsTests.Release
[       OK ] SystemsTests.Release (1 ms)
[----------] 3 tests from SystemsTests (1 ms total)

[----------] 8 tests from PathTest
[ RUN      ] PathTest.Basename
[       OK ] PathTest.Basename (0 ms)
[ RUN      ] PathTest.Dirname
[       OK ] PathTest.Dirname (0 ms)
[ RUN      ] PathTest.Extension
[       OK ] PathTest.Extension (0 ms)
[ RUN      ] PathTest.Normalize
[       OK ] PathTest.Normalize (0 ms)
[ RUN      ] PathTest.Join
[       OK ] PathTest.Join (0 ms)
[ RUN      ] PathTest.Absolute
[       OK ] PathTest.Absolute (0 ms)
[ RUN      ] PathTest.Comparison
[       OK ] PathTest.Comparison (0 ms)
[ RUN      ] PathTest.FromURI
[       OK ] PathTest.FromURI (0 ms)
[----------] 8 tests from PathTest (0 ms total)

[----------] 1 test from PathFileTest
[ RUN      ] PathFileTest.ImplicitConversion
[       OK ] PathFileTest.ImplicitConversion (1 ms)
[----------] 1 test from PathFileTest (1 ms total)

[----------] 12 tests from ProtobufTest
[ RUN      ] ProtobufTest.JSON
[       OK ] ProtobufTest.JSON (3 ms)
[ RUN      ] ProtobufTest.JSONArray
[       OK ] ProtobufTest.JSONArray (0 ms)
[ RUN      ] ProtobufTest.JsonLargeIntegers
[       OK ] ProtobufTest.JsonLargeIntegers (0 ms)
[ RUN      ] ProtobufTest.SimpleMessageEquals
[       OK ] ProtobufTest.SimpleMessageEquals (0 ms)
[ RUN      ] ProtobufTest.ParseJSONArray
[       OK ] ProtobufTest.ParseJSONArray (0 ms)
[ RUN      ] ProtobufTest.ParseJSONNull
[       OK ] ProtobufTest.ParseJSONNull (0 ms)
[ RUN      ] ProtobufTest.ParseJSONNestedError
[       OK ] ProtobufTest.ParseJSONNestedError (0 ms)
[ RUN      ] ProtobufTest.ParseJSONUnrecognizedEnum
[       OK ] ProtobufTest.ParseJSONUnrecognizedEnum (1 ms)
[ RUN      ] ProtobufTest.Jsonify
[       OK ] ProtobufTest.Jsonify (0 ms)
[ RUN      ] ProtobufTest.JsonifyArray
[       OK ] ProtobufTest.JsonifyArray (0 ms)
[ RUN      ] ProtobufTest.JsonifyLargeIntegers
[       OK ] ProtobufTest.JsonifyLargeIntegers (0 ms)
[ RUN      ] ProtobufTest.JsonifyMap
../../../3rdparty/stout/tests/protobuf_tests.cpp:841: Failure
      Expected: expected
      Which is: "{\"string_to_string\":{\"key1\":\"value1\",\"key2\":\"value2\"},\"string_to_bool\":{\"key1\":true,\"key2\":false},\"string_to_bytes\":{\"key\":\"Ynl0ZXM=\"},\"string_to_int32\":{\"key\":-2147483647},\"string_to_int64\":{\"key\":-9223372036854775807},\"string_to_uint32\":{\"key\":4294967295},\"string_to_uint64\":{\"key\":9223372036854775807},\"string_to_sint32\":{\"key\":-1234567890},\"string_to_sint64\":{\"key\":-1234567890123456789},\"string_to_float\":{\"key\":1.0},\"string_to_double\":{\"key\":1.0},\"string_to_enum\":{\"key\":\"ONE\"},\"string_to_nested\":{\"key\":{\"str\":\"nested\"}},\"bool_to_string\":{\"false\":\"value2\",\"true\":\"value1\"},\"int32_to_string\":{\"-2147483647\":\"value\"},\"int64_to_string\":{\"-9223372036854775807\":\"value\"},\"uint32_to_string\":{\"4294967295\":\"value\"},\"uint64_to_string\":{\"9223372036854775807\":\"value\"},\"sint32_to_string\":{\"-1234567890\":\"value\"},\"sint64_to_string\":{\"-1234567890123456789\":\"value\"}}"
To be equal to: string(jsonify(JSON::Protobuf(message)))
      Which is: "{\"string_to_string\":{\"key2\":\"value2\",\"key1\":\"value1\"},\"string_to_bool\":{\"key2\":false,\"key1\":true},\"string_to_bytes\":{\"key\":\"Ynl0ZXM=\"},\"string_to_int32\":{\"key\":-2147483647},\"string_to_int64\":{\"key\":-9223372036854775807},\"string_to_uint32\":{\"key\":4294967295},\"string_to_uint64\":{\"key\":9223372036854775807},\"string_to_sint32\":{\"key\":-1234567890},\"string_to_sint64\":{\"key\":-1234567890123456789},\"string_to_float\":{\"key\":1.0},\"string_to_double\":{\"key\":1.0},\"string_to_enum\":{\"key\":\"ONE\"},\"string_to_nested\":{\"key\":{\"str\":\"nested\"}},\"bool_to_string\":{\"false\":\"value2\",\"true\":\"value1\"},\"int32_to_string\":{\"-2147483647\":\"value\"},\"int64_to_string\":{\"-9223372036854775807\":\"value\"},\"uint32_to_string\":{\"4294967295\":\"value\"},\"uint64_to_string\":{\"9223372036854775807\":\"value\"},\"sint32_to_string\":{\"-1234567890\":\"value\"},\"sint64_to_string\":{\"-1234567890123456789\":\"value\"}}"
[  FAILED  ] ProtobufTest.JsonifyMap (2 ms)
[----------] 12 tests from ProtobufTest (6 ms total)

[----------] 2 tests from RecordIOTest
[ RUN      ] RecordIOTest.Encoder
[       OK ] RecordIOTest.Encoder (0 ms)
[ RUN      ] RecordIOTest.Decoder
[       OK ] RecordIOTest.Decoder (0 ms)
[----------] 2 tests from RecordIOTest (0 ms total)

[----------] 3 tests from ResultTest
[ RUN      ] ResultTest.TryToResultConversion
[       OK ] ResultTest.TryToResultConversion (0 ms)
[ RUN      ] ResultTest.ArrowOperator
[       OK ] ResultTest.ArrowOperator (0 ms)
[ RUN      ] ResultTest.StarOperator
[       OK ] ResultTest.StarOperator (0 ms)
[----------] 3 tests from ResultTest (0 ms total)

[----------] 1 test from SomeTest
[ RUN      ] SomeTest.Some
[       OK ] SomeTest.Some (0 ms)
[----------] 1 test from SomeTest (0 ms total)

[----------] 40 tests from StringsTest
[ RUN      ] StringsTest.Format
[       OK ] StringsTest.Format (0 ms)
[ RUN      ] StringsTest.Remove
[       OK ] StringsTest.Remove (0 ms)
[ RUN      ] StringsTest.Replace
[       OK ] StringsTest.Replace (0 ms)
[ RUN      ] StringsTest.Trim
[       OK ] StringsTest.Trim (0 ms)
[ RUN      ] StringsTest.Tokenize
[       OK ] StringsTest.Tokenize (0 ms)
[ RUN      ] StringsTest.TokenizeStringWithDelimsAtStart
[       OK ] StringsTest.TokenizeStringWithDelimsAtStart (0 ms)
[ RUN      ] StringsTest.TokenizeStringWithDelimsAtEnd
[       OK ] StringsTest.TokenizeStringWithDelimsAtEnd (0 ms)
[ RUN      ] StringsTest.TokenizeStringWithDelimsAtStartAndEnd
[       OK ] StringsTest.TokenizeStringWithDelimsAtStartAndEnd (0 ms)
[ RUN      ] StringsTest.TokenizeWithMultipleDelims
[       OK ] StringsTest.TokenizeWithMultipleDelims (0 ms)
[ RUN      ] StringsTest.TokenizeEmptyString
[       OK ] StringsTest.TokenizeEmptyString (0 ms)
[ RUN      ] StringsTest.TokenizeDelimOnlyString
[       OK ] StringsTest.TokenizeDelimOnlyString (0 ms)
[ RUN      ] StringsTest.TokenizeNullByteDelim
[       OK ] StringsTest.TokenizeNullByteDelim (0 ms)
[ RUN      ] StringsTest.TokenizeNZero
[       OK ] StringsTest.TokenizeNZero (0 ms)
[ RUN      ] StringsTest.TokenizeNOne
[       OK ] StringsTest.TokenizeNOne (0 ms)
[ RUN      ] StringsTest.TokenizeNDelimOnlyString
[       OK ] StringsTest.TokenizeNDelimOnlyString (0 ms)
[ RUN      ] StringsTest.TokenizeN
[       OK ] StringsTest.TokenizeN (0 ms)
[ RUN      ] StringsTest.TokenizeNStringWithDelimsAtStart
[       OK ] StringsTest.TokenizeNStringWithDelimsAtStart (0 ms)
[ RUN      ] StringsTest.TokenizeNStringWithDelimsAtEnd
[       OK ] StringsTest.TokenizeNStringWithDelimsAtEnd (0 ms)
[ RUN      ] StringsTest.TokenizeNStringWithDelimsAtStartAndEnd
[       OK ] StringsTest.TokenizeNStringWithDelimsAtStartAndEnd (0 ms)
[ RUN      ] StringsTest.TokenizeNWithMultipleDelims
[       OK ] StringsTest.TokenizeNWithMultipleDelims (0 ms)
[ RUN      ] StringsTest.SplitEmptyString
[       OK ] StringsTest.SplitEmptyString (0 ms)
[ RUN      ] StringsTest.SplitDelimOnlyString
[       OK ] StringsTest.SplitDelimOnlyString (0 ms)
[ RUN      ] StringsTest.Split
[       OK ] StringsTest.Split (0 ms)
[ RUN      ] StringsTest.SplitStringWithDelimsAtStart
[       OK ] StringsTest.SplitStringWithDelimsAtStart (0 ms)
[ RUN      ] StringsTest.SplitStringWithDelimsAtEnd
[       OK ] StringsTest.SplitStringWithDelimsAtEnd (0 ms)
[ RUN      ] StringsTest.SplitStringWithDelimsAtStartAndEnd
[       OK ] StringsTest.SplitStringWithDelimsAtStartAndEnd (0 ms)
[ RUN      ] StringsTest.SplitWithMultipleDelims
[       OK ] StringsTest.SplitWithMultipleDelims (0 ms)
[ RUN      ] StringsTest.SplitNZero
[       OK ] StringsTest.SplitNZero (0 ms)
[ RUN      ] StringsTest.SplitNOne
[       OK ] StringsTest.SplitNOne (0 ms)
[ RUN      ] StringsTest.SplitNDelimOnlyString
[       OK ] StringsTest.SplitNDelimOnlyString (0 ms)
[ RUN      ] StringsTest.SplitN
[       OK ] StringsTest.SplitN (0 ms)
[ RUN      ] StringsTest.SplitNStringWithDelimsAtStart
[       OK ] StringsTest.SplitNStringWithDelimsAtStart (0 ms)
[ RUN      ] StringsTest.SplitNStringWithDelimsAtEnd
[       OK ] StringsTest.SplitNStringWithDelimsAtEnd (0 ms)
[ RUN      ] StringsTest.SplitNStringWithDelimsAtStartAndEnd
[       OK ] StringsTest.SplitNStringWithDelimsAtStartAndEnd (0 ms)
[ RUN      ] StringsTest.SplitNWithMultipleDelims
[       OK ] StringsTest.SplitNWithMultipleDelims (0 ms)
[ RUN      ] StringsTest.Pairs
[       OK ] StringsTest.Pairs (0 ms)
[ RUN      ] StringsTest.Join
[       OK ] StringsTest.Join (0 ms)
[ RUN      ] StringsTest.StartsWith
[       OK ] StringsTest.StartsWith (0 ms)
[ RUN      ] StringsTest.EndsWith
[       OK ] StringsTest.EndsWith (0 ms)
[ RUN      ] StringsTest.Contains
[       OK ] StringsTest.Contains (0 ms)
[----------] 40 tests from StringsTest (1 ms total)

[----------] 2 tests from SubcommandTest
[ RUN      ] SubcommandTest.Flags
[       OK ] SubcommandTest.Flags (1 ms)
[ RUN      ] SubcommandTest.Dispatch
Subcommand 'subcommand' is not available
Usage: command <subcommand> [OPTIONS]

Available subcommands:
    help
    subcommand2

Multiple subcommands have name 'subcommand'
[       OK ] SubcommandTest.Dispatch (0 ms)
[----------] 2 tests from SubcommandTest (1 ms total)

[----------] 2 tests from SVNTest
[ RUN      ] SVNTest.DiffPatch
[       OK ] SVNTest.DiffPatch (41 ms)
[ RUN      ] SVNTest.EmptyDiffPatch
[       OK ] SVNTest.EmptyDiffPatch (40 ms)
[----------] 2 tests from SVNTest (81 ms total)

[----------] 2 tests from TryTest
[ RUN      ] TryTest.ArrowOperator
[       OK ] TryTest.ArrowOperator (0 ms)
[ RUN      ] TryTest.StarOperator
[       OK ] TryTest.StarOperator (0 ms)
[----------] 2 tests from TryTest (0 ms total)

[----------] 1 test from UriTest
[ RUN      ] UriTest.TestUriFromPath
[       OK ] UriTest.TestUriFromPath (0 ms)
[----------] 1 test from UriTest (0 ms total)

[----------] 3 tests from UUIDTest
[ RUN      ] UUIDTest.Test
[       OK ] UUIDTest.Test (0 ms)
[ RUN      ] UUIDTest.Metadata
[       OK ] UUIDTest.Metadata (0 ms)
[ RUN      ] UUIDTest.MalformedUUID
[       OK ] UUIDTest.MalformedUUID (0 ms)
[----------] 3 tests from UUIDTest (0 ms total)

[----------] 2 tests from VariantTest
[ RUN      ] VariantTest.Visit
[       OK ] VariantTest.Visit (0 ms)
[ RUN      ] VariantTest.Equality
[       OK ] VariantTest.Equality (0 ms)
[----------] 2 tests from VariantTest (0 ms total)

[----------] 4 tests from VersionTest
[ RUN      ] VersionTest.Comparison
[       OK ] VersionTest.Comparison (3 ms)
[ RUN      ] VersionTest.BuildMetadataComparison
[       OK ] VersionTest.BuildMetadataComparison (0 ms)
[ RUN      ] VersionTest.ParseValid
[       OK ] VersionTest.ParseValid (1 ms)
[ RUN      ] VersionTest.ParseInvalid
[       OK ] VersionTest.ParseInvalid (0 ms)
[----------] 4 tests from VersionTest (4 ms total)

[----------] 6 tests from ProcTest
[ RUN      ] ProcTest.Pids
[       OK ] ProcTest.Pids (1 ms)
[ RUN      ] ProcTest.Cpus
[       OK ] ProcTest.Cpus (1 ms)
[ RUN      ] ProcTest.SystemStatus
[       OK ] ProcTest.SystemStatus (0 ms)
[ RUN      ] ProcTest.ProcessStatus
[       OK ] ProcTest.ProcessStatus (1 ms)
[ RUN      ] ProcTest.SingleThread
[       OK ] ProcTest.SingleThread (0 ms)
[ RUN      ] ProcTest.MultipleThreads
[       OK ] ProcTest.MultipleThreads (0 ms)
[----------] 6 tests from ProcTest (3 ms total)

[----------] Global test environment tear-down
[==========] 361 tests from 56 test cases ran. (512 ms total)
[  PASSED  ] 360 tests.
[  FAILED  ] 1 test, listed below:
[  FAILED  ] ProtobufTest.JsonifyMap

 1 FAILED TEST
make[7]: *** [check-local] Error 1
make[7]: Leaving directory `/mesos/mesos-1.9.0/_build/3rdparty/stout'
make[6]: *** [check-am] Error 2
make[6]: Leaving directory `/mesos/mesos-1.9.0/_build/3rdparty/stout'
make[5]: *** [check-recursive] Error 1
make[5]: Leaving directory `/mesos/mesos-1.9.0/_build/3rdparty/stout'
make[4]: *** [check] Error 2
make[4]: Leaving directory `/mesos/mesos-1.9.0/_build/3rdparty/stout'
make[3]: *** [check-recursive] Error 1
make[3]: Leaving directory `/mesos/mesos-1.9.0/_build/3rdparty'
make[2]: *** [check] Error 2
make[2]: Leaving directory `/mesos/mesos-1.9.0/_build/3rdparty'
make[1]: *** [check-recursive] Error 1
make[1]: Leaving directory `/mesos/mesos-1.9.0/_build'
make: *** [distcheck] Error 1
+ docker rmi --force mesos-1564106838-29483
Untagged: mesos-1564106838-29483:latest
Deleted: sha256:ad057d23986fa9096be727ebf736ece08b4c958271907a0a306fde8c41d156fe
Deleted: sha256:69cea07644da491b9a41adb224fe750c6ce08f467bacaa0978f69cb0e054b692
Deleted: sha256:802c8bdda593832118c371a66ec7ec87e44e464d1b145add5acb7d27497b56d6
Deleted: sha256:b9e953c07bf76a232c435d4d365fe49cd090179b1d6dc977dc55ca4a5fe4e636
Deleted: sha256:8df6e3b4f7654f16c95fed0698372ee5401faf4e4e3a21bbe505e83f6e9793a9
Deleted: sha256:ee6bf223d5eb70d8ea672456598ef1b7fe2707f5d4a5f0dcc7bf6e173c7d7cfd
Deleted: sha256:18592aaa010e304d826cbfc6fc751e1a31d488cb8c31071afa10e8d97b881d8d
Deleted: sha256:3f1ec848809e0848a1b14be129cdc7f6124f0d3a199f88387dce165ad2505488
Deleted: sha256:5bef5d1fa5c1193e0b94b6271d084560ff5f6149a4b7cae53e6ab30a072f3c0e
Deleted: sha256:1b33f9707d01dfb3943edef9380789e7febe9fbd59927950131cfea1ac547d67
Deleted: sha256:5a85ff64dd0372a7334b00407d38a86e4a7537d484f75c1a729c1613c7eeb0f7
Deleted: sha256:3875ab6570699a3bfd3fd872d14b1f65e536809ff34eb70ceab39fdc3aa996cb
Deleted: sha256:da3427273d78867ad6a610df7e8e408e64c437458917f42bd4b8216ce709d5ac
Deleted: sha256:c7e450e820ad5a5304e9b50cfc49847d425e7ed872773d0dac176c78114c597b
Deleted: sha256:c8d27fc1a6bd3824ef819d9512261f03aa032a2b5d24a6f68427527620143dfd
Deleted: sha256:969a24f342cf7a6f91ab57abd38e198117c90fc00d44c79b2e35bbc98393a98e
Deleted: sha256:6e53d2b16f92f610b00b1310c9599b4c03ff5f40b307bc94ae39395e645e6dde
Deleted: sha256:6f9736348ae13b3cb8ac9a09eb3101267cded9e3dca9c8f89f6ada6b2f2a7252
Deleted: sha256:8768c803bf3dbe3fa2e9f34dd191d573802bb422d440b71086022b4bb111f47b
Deleted: sha256:c5b5909165588cddf1d2a6cc308c3442da0e33bac8de3c591b7936d22eab6f59
Deleted: sha256:3d96b35a70f7d1da077fdbd496c64e64fc153397566923b70965e5a363dea73c
Deleted: sha256:585128b7b5fb54b83a6a8f5c56759ccaffa22185926d941e5eace53fd0781b08
Deleted: sha256:0b329bef7686551cf0cdb24dd4063423c6f3f4603caed0dff260d6dad4cb45f7
Deleted: sha256:ce80178a523c5de5d48c1e2558c2a5beabba20010b3c822e0efbe7175a4fa6cc
Deleted: sha256:756d3098ebc8d068e5bb0779d1fd9572d668dcec5ab6bd9af12e3cc45a6a73fc
Deleted: sha256:94af0048e741850d9e52718a2313fb78b287849ba2723a1df65c24869061817d
Deleted: sha256:35230bdb69cc2cbb2ce99ba8557160d96c15eacccddde28ad776c0ef5be63881
Deleted: sha256:334d6f37d23830af3dbc72f909de22e71c34d2944ca4b6cf8776a2f1166d48fb
Deleted: sha256:3261b51ffcc597395f6f22f2f1da8371b2e8baeb3f451eb7d631a87ab0ec7692
Deleted: sha256:f8d78b048758448e33b5b557ebad8aff6f65d7795434eeb0da5c39405adb1cad

Full log: https://builds.apache.org/job/Mesos-Reviewbot-Linux/2770/console

- Mesos Reviewbot


On July 25, 2019, 1:55 a.m., Meng Zhu wrote:
> 
> -----------------------------------------------------------
> This is an automatically generated e-mail. To reply, visit:
> https://reviews.apache.org/r/71159/
> -----------------------------------------------------------
> 
> (Updated July 25, 2019, 1:55 a.m.)
> 
> 
> Review request for mesos, Andrei Sekretenko and Benjamin Mahler.
> 
> 
> Bugs: MESOS-9598 and MESOS-9599
>     https://issues.apache.org/jira/browse/MESOS-9598
>     https://issues.apache.org/jira/browse/MESOS-9599
> 
> 
> Repository: mesos
> 
> 
> Description
> -------
> 
> Added quota configuration information (that includes both
> guarantees and limits) in V1 GET_QUOTA call and V0 GET "/quota".
> 
> To keep backwards compatibility, the infos field which only
> includes the guarantees are continue to be filled. An additional
> field configs was added.
> 
> Also extended an existing test to cover the changes in
> the endpoints.
> 
> 
> Diffs
> -----
> 
>   src/master/quota_handler.cpp 15b02b08917201c824230d649fdae265957748af 
>   src/tests/master_quota_tests.cpp 7745fb0a903c4dc5603c12049f224b3d45273a4b 
> 
> 
> Diff: https://reviews.apache.org/r/71159/diff/1/
> 
> 
> Testing
> -------
> 
> make check
> 
> 
> Thanks,
> 
> Meng Zhu
> 
>


Mime
  • Unnamed multipart/alternative (inline, None, 0 bytes)
View raw message