mesos-reviews mailing list archives

Site index · List index
Message view « Date » · « Thread »
Top « Date » · « Thread »
From Mesos Reviewbot Windows <revi...@mesos.apache.org>
Subject Re: Review Request 70133: Removed unnecessary accept filters in SLRP tests.
Date Mon, 29 Apr 2019 00:21:15 GMT

-----------------------------------------------------------
This is an automatically generated e-mail. To reply, visit:
https://reviews.apache.org/r/70133/#review214933
-----------------------------------------------------------



FAIL: Some of the unit tests failed. Please check the relevant logs.

Reviews applied: `['70132', '70547', '70537', '70521', '70133']`

Failed command: `Start-MesosCITesting`

All the build artifacts available at: http://dcos-win.westus2.cloudapp.azure.com/artifacts/mesos-reviewbot-testing/3274/mesos-review-70133

Relevant logs:

- [mesos-tests.log](http://dcos-win.westus2.cloudapp.azure.com/artifacts/mesos-reviewbot-testing/3274/mesos-review-70133/logs/mesos-tests.log):

```
I0429 00:20:56.513547 79220 master.cpp:3312] Disconnecting agent 2f507c98-6e01-4555-a0ce-f8e708ac03ec-S0
at slave(514)@192.10.1.4:64773 (windows-01.chtsmhjxogyevckjfayqqcnjda.xx.internal.cloudapp.net)
I0429 00:20:56.513547 79220 master.cpp:3331] Deactivating agent 2f507c98-6e01-4555-a0ce-f8e708ac03ec-S0
at slave(514)@192.10.1.4:64773 (windows-01.chtsmhjxogyevckjfayqqcnjda.xx.internal.cloudapp.net)
I0429 00:20:56.513547 84968 hierarchical.cpp:392] Removed framework 2f507c98-6e01-4555-a0ce-f8e708ac03ec-0000
I0429 00:20:56.514546 84968 hierarchical.cpp:829] Agent 2f507c98-6e01-4555-a0ce-f8e708ac03ec-S0
deactivated
I0429 00:20:56.515547 81284 containerizer.cpp:2576] Destroying container 318d952c-52e8-4588-afed-f2d3fbd35803
in RUNNING state
I0429 00:20:56.515547 81284 containerizer.cpp:3278] Transitioning the state of container 318d952c-52e8-4588-afed-f2d3fbd35803
from RUNNING to DESTROYING
I0429 00:20:56.515547 81284 launcher.cpp:161] Asked to destroy container 318d952c-52e8-4588-afed-f2d3fbd35803
W0429 00:20:56.516544 84616 process.cpp:1423] Failed to recv on socket WindowsFD::Type::SOCKET=3448
to peer '192.10.1.4:50850': IO failed with error code: The specified network name is no longer
available.

W0429 00:20:56.516544 84616 process.cpp:838] Failed to recv on socket WindowsFD::Type::SOCKET=2060
to peer '192.10.1.4:50851': IO failed with error code: The specified network name is no longer
available.

I0429 00:20:56.528580 81156 containerizer.cpp:3117] Container 318d952c-52e8-4588-afed-f2d3fbd35803
has exited
I0429 00:20:56.557595 81156 master.cpp:1135] Master terminating
I0429 00:20:56.559[       OK ] IsolationFlag/MemoryIsolatorTest.ROOT_MemUsage/0 (684 ms)
[----------] 1 test from IsolationFlag/MemoryIsolatorTest (702 ms total)

[----------] Global test environment tear-down
[==========] 1176 tests from 109 test cases ran. (616375 ms total)
[  PASSED  ] 1173 tests.
[  FAILED  ] 3 tests, listed below:
[  FAILED  ] DockerFetcherPluginTest.INTERNET_CURL_FetchManifest
[  FAILED  ] DockerFetcherPluginTest.INTERNET_CURL_FetchImage
[  FAILED  ] DockerFetcherPluginTest.INTERNET_CURL_InvokeFetchByName

 3 FAILED TESTS
  YOU HAVE 233 DISABLED TESTS

551 81284 hierarchical.cpp:680] Removed agent 2f507c98-6e01-4555-a0ce-f8e708ac03ec-S0
I0429 00:20:57.823596 84616 process.cpp:927] Stopped the socket accept loop
```

- Mesos Reviewbot Windows


On April 9, 2019, 2:21 p.m., Chun-Hung Hsiao wrote:
> 
> -----------------------------------------------------------
> This is an automatically generated e-mail. To reply, visit:
> https://reviews.apache.org/r/70133/
> -----------------------------------------------------------
> 
> (Updated April 9, 2019, 2:21 p.m.)
> 
> 
> Review request for mesos, Benjamin Bannier and Meng Zhu.
> 
> 
> Repository: mesos
> 
> 
> Description
> -------
> 
> Removed unnecessary accept filters in SLRP tests.
> 
> 
> Diffs
> -----
> 
>   src/tests/storage_local_resource_provider_tests.cpp bd35150200a23ba57408f5d64a975f8a2f062018

> 
> 
> Diff: https://reviews.apache.org/r/70133/diff/2/
> 
> 
> Testing
> -------
> 
> `sudo make check`
> 
> Especially, tested that each of the three modified tests finishes in 5 seconds.
> 
> 
> Thanks,
> 
> Chun-Hung Hsiao
> 
>


Mime
  • Unnamed multipart/alternative (inline, None, 0 bytes)
View raw message