mesos-reviews mailing list archives

Site index · List index
Message view « Date » · « Thread »
Top « Date » · « Thread »
From Mesos Reviewbot Windows <revi...@mesos.apache.org>
Subject Re: Review Request 70133: Removed unnecessary accept filters in SLRP tests.
Date Thu, 25 Apr 2019 10:45:29 GMT

-----------------------------------------------------------
This is an automatically generated e-mail. To reply, visit:
https://reviews.apache.org/r/70133/#review214881
-----------------------------------------------------------



FAIL: Some of the unit tests failed. Please check the relevant logs.

Reviews applied: `['70132', '70537', '70521', '70133']`

Failed command: `Start-MesosCITesting`

All the build artifacts available at: http://dcos-win.westus2.cloudapp.azure.com/artifacts/mesos-reviewbot-testing/3261/mesos-review-70133

Relevant logs:

- [mesos-tests.log](http://dcos-win.westus2.cloudapp.azure.com/artifacts/mesos-reviewbot-testing/3261/mesos-review-70133/logs/mesos-tests.log):

```
I0425 10:45:10.686038 77624 master.cpp:3312] Disconnecting agent 91daf399-45a6-445b-a2c0-b05903a27297-S0
at slave(514)@192.10.1.4:64503 (windows-01.chtsmhjxogyevckjfayqqcnjda.xx.internal.cloudapp.net)
I0425 10:45:10.686038 77624 master.cpp:3331] Deactivating agent 91daf399-45a6-445b-a2c0-b05903a27297-S0
at slave(514)@192.10.1.4:64503 (windows-01.chtsmhjxogyevckjfayqqcnjda.xx.internal.cloudapp.net)
I0425 10:45:10.687011 70428 hierarchical.cpp:392] Removed framework 91daf399-45a6-445b-a2c0-b05903a27297-0000
I0425 10:45:10.687011 70428 hierarchical.cpp:829] Agent 91daf399-45a6-445b-a2c0-b05903a27297-S0
deactivated
I0425 10:45:10.688022 77624 containerizer.cpp:2576] Destroying container e3573752-a99c-428b-8879-360227de6051
in RUNNING state
I0425 10:45:10.688022 77624 containerizer.cpp:3278] Transitioning the state of container e3573752-a99c-428b-8879-360227de6051
from RUNNING to DESTROYING
I0425 10:45:10.688022 77624 launcher.cpp:161] Asked to destroy container e3573752-a99c-428b-8879-360227de6051
W0425 10:45:10.690022 79864 process.cpp:1423] Failed to recv on [       OK ] IsolationFlag/MemoryIsolatorTest.ROOT_MemUsage/0
(794 ms)
[----------] 1 test from IsolationFlag/MemoryIsolatorTest (813 ms total)

[----------] Global test environment tear-down
[==========] 1176 tests from 109 test cases ran. (594714 ms total)
[  PASSED  ] 1173 tests.
[  FAILED  ] 3 tests, listed below:
[  FAILED  ] DockerFetcherPluginTest.INTERNET_CURL_FetchManifest
[  FAILED  ] DockerFetcherPluginTest.INTERNET_CURL_FetchImage
[  FAILED  ] DockerFetcherPluginTest.INTERNET_CURL_InvokeFetchByName

 3 FAILED TESTS
  YOU HAVE 233 DISABLED TESTS

socket WindowsFD::Type::SOCKET=2816 to peer '192.10.1.4:50593': IO failed with error code:
The specified network name is no longer available.

W0425 10:45:10.690022 79864 process.cpp:838] Failed to recv on socket WindowsFD::Type::SOCKET=120
to peer '192.10.1.4:50594': IO failed with error code: The specified network name is no longer
available.

I0425 10:45:10.778272 74552 containerizer.cpp:3117] Container e3573752-a99c-428b-8879-360227de6051
has exited
I0425 10:45:10.812242 78640 master.cpp:1135] Master terminating
I0425 10:45:10.813252 74552 hierarchical.cpp:680] Removed agent 91daf399-45a6-445b-a2c0-b05903a27297-S0
I0425 10:45:11.935622 79864 process.cpp:927] Stopped the socket accept loop
```

- Mesos Reviewbot Windows


On April 10, 2019, 2:51 a.m., Chun-Hung Hsiao wrote:
> 
> -----------------------------------------------------------
> This is an automatically generated e-mail. To reply, visit:
> https://reviews.apache.org/r/70133/
> -----------------------------------------------------------
> 
> (Updated April 10, 2019, 2:51 a.m.)
> 
> 
> Review request for mesos, Benjamin Bannier and Meng Zhu.
> 
> 
> Repository: mesos
> 
> 
> Description
> -------
> 
> Removed unnecessary accept filters in SLRP tests.
> 
> 
> Diffs
> -----
> 
>   src/tests/storage_local_resource_provider_tests.cpp bd35150200a23ba57408f5d64a975f8a2f062018

> 
> 
> Diff: https://reviews.apache.org/r/70133/diff/2/
> 
> 
> Testing
> -------
> 
> `sudo make check`
> 
> Especially, tested that each of the three modified tests finishes in 5 seconds.
> 
> 
> Thanks,
> 
> Chun-Hung Hsiao
> 
>


Mime
  • Unnamed multipart/alternative (inline, None, 0 bytes)
View raw message