mesos-reviews mailing list archives

Site index · List index
Message view « Date » · « Thread »
Top « Date » · « Thread »
From Mesos Reviewbot Windows <revi...@mesos.apache.org>
Subject Re: Review Request 70515: Added a test to verify non-root nested container can access its sandbox.
Date Wed, 24 Apr 2019 10:45:39 GMT

-----------------------------------------------------------
This is an automatically generated e-mail. To reply, visit:
https://reviews.apache.org/r/70515/#review214850
-----------------------------------------------------------



FAIL: Some of the unit tests failed. Please check the relevant logs.

Reviews applied: `['70514', '70515']`

Failed command: `Start-MesosCITesting`

All the build artifacts available at: http://dcos-win.westus2.cloudapp.azure.com/artifacts/mesos-reviewbot-testing/3254/mesos-review-70515

Relevant logs:

- [mesos-tests.log](http://dcos-win.westus2.cloudapp.azure.com/artifacts/mesos-reviewbot-testing/3254/mesos-review-70515/logs/mesos-tests.log):

```
I0424 10:45:20.507802 74432 master.cpp:3312] Disconnecting agent 45419471-589e-47be-8c13-555b89e0eabd-S0
at slave(504)@192.10.1.4:55176 (windows-01.chtsmhjxogyevckjfayqqcnjda.xx.internal.cloudapp.net)
I0424 10:45:20.507802 74432 master.cpp:3331] Deactivating agent 45419471-589e-47be-8c13-555b89e0eabd-S0
at slave(504)@192.10.1.4:55176 (windows-01.chtsmhjxogyevckjfayqqcnjda.xx.internal.cloudapp.net)
I0424 10:45:20.507802 64904 hierarchical.cpp:392] Removed framework 45419471-589e-47be-8c13-555b89e0eabd-0000
I0424 10:45:20.508805 64904 hierarchical.cpp:829] Agent 45419471-589e-47be-8c13-555b89e0eabd-S0
deactivated
I0424 10:45:20.509799 74432 containerizer.cpp:2587] Destroying container de707a30-36bd-47d2-8ad9-1a5f94099021
in RUNNING state
I0424 10:45:20.509799 74432 containerizer.cpp:3289] Transitioning the state of container de707a30-36bd-47d2-8ad9-1a5f94099021
from RUNNING to DESTROYING
I0424 10:45:20.509799 74432 launcher.cpp:161] Asked to destroy c[       OK ] IsolationFlag/MemoryIsolatorTest.ROOT_MemUsage/0
(785 ms)
[----------] 1 test from IsolationFlag/MemoryIsolatorTest (804 ms total)

[----------] Global test environment tear-down
[==========] 1166 tests from 109 test cases ran. (591494 ms total)
[  PASSED  ] 1163 tests.
[  FAILED  ] 3 tests, listed below:
[  FAILED  ] DockerFetcherPluginTest.INTERNET_CURL_FetchManifest
[  FAILED  ] DockerFetcherPluginTest.INTERNET_CURL_FetchImage
[  FAILED  ] DockerFetcherPluginTest.INTERNET_CURL_InvokeFetchByName

 3 FAILED TESTS
  YOU HAVE 233 DISABLED TESTS

ontainer de707a30-36bd-47d2-8ad9-1a5f94099021
W0424 10:45:20.511799 78168 process.cpp:1423] Failed to recv on socket WindowsFD::Type::SOCKET=11796
to peer '192.10.1.4:57592': IO failed with error code: The specified network name is no longer
available.

W0424 10:45:20.511799 78168 process.cpp:838] Failed to recv on socket WindowsFD::Type::SOCKET=11676
to peer '192.10.1.4:57593': IO failed with error code: The specified network name is no longer
available.

I0424 10:45:20.594751 77936 containerizer.cpp:3128] Container de707a30-36bd-47d2-8ad9-1a5f94099021
has exited
I0424 10:45:20.625802 76892 master.cpp:1135] Master terminating
I0424 10:45:20.626765 74900 hierarchical.cpp:680] Removed agent 45419471-589e-47be-8c13-555b89e0eabd-S0
I0424 10:45:21.805826 78168 process.cpp:927] Stopped the socket accept loop
```

- Mesos Reviewbot Windows


On April 22, 2019, 1:27 p.m., Qian Zhang wrote:
> 
> -----------------------------------------------------------
> This is an automatically generated e-mail. To reply, visit:
> https://reviews.apache.org/r/70515/
> -----------------------------------------------------------
> 
> (Updated April 22, 2019, 1:27 p.m.)
> 
> 
> Review request for mesos, Andrei Budnik, Gilbert Song, and James Peach.
> 
> 
> Bugs: MESOS-9536
>     https://issues.apache.org/jira/browse/MESOS-9536
> 
> 
> Repository: mesos
> 
> 
> Description
> -------
> 
> Added a test to verify non-root nested container can access its sandbox.
> 
> 
> Diffs
> -----
> 
>   src/tests/containerizer/nested_mesos_containerizer_tests.cpp bbf83fa24966a7c9f585b9912fa77bf3460db26f

> 
> 
> Diff: https://reviews.apache.org/r/70515/diff/1/
> 
> 
> Testing
> -------
> 
> sudo make check
> 
> This test will fail without the previous patch (https://reviews.apache.org/r/70514/ ).
> 
> 
> Thanks,
> 
> Qian Zhang
> 
>


Mime
  • Unnamed multipart/alternative (inline, None, 0 bytes)
View raw message