mesos-reviews mailing list archives

Site index · List index
Message view « Date » · « Thread »
Top « Date » · « Thread »
From Mesos Reviewbot Windows <revi...@mesos.apache.org>
Subject Re: Review Request 70133: Removed unnecessary accept filters in SLRP tests.
Date Tue, 09 Apr 2019 23:32:01 GMT

-----------------------------------------------------------
This is an automatically generated e-mail. To reply, visit:
https://reviews.apache.org/r/70133/#review214507
-----------------------------------------------------------



FAIL: Some of the unit tests failed. Please check the relevant logs.

Reviews applied: `['70132', '70133']`

Failed command: `Start-MesosCITesting`

All the build artifacts available at: http://dcos-win.westus2.cloudapp.azure.com/artifacts/mesos-reviewbot-testing/3129/mesos-review-70133

Relevant logs:

- [mesos-tests.log](http://dcos-win.westus2.cloudapp.azure.com/artifacts/mesos-reviewbot-testing/3129/mesos-review-70133/logs/mesos-tests.log):

```
I0409 23:31:43.826845 38072 master.cpp:1295] Agent de7dad45-a3d2-4321-b837-36e3d2b4c399-S0
at slave(501)@192.10.1.4:59330 (windows-01.chtsmhjxogyevckjfayqqcnjda.xx.internal.cloudapp.net)
disconnected
I0409 23:31:43.826845 38072 master.cpp:3333] Disconnecting agent de7dad45-a3d2-4321-b837-36e3d2b4c399-S0
at slave(501)@192.10.1.4:59330 (windows-01.chtsmhjxogyevckjfayqqcnjda.xx.internal.cloudapp.net)
I0409 23:31:43.826845 38072 master.cpp:3352] Deactivating agent de7dad45-a3d2-4321-b837-36e3d2b4c399-S0
at slave(501)@192.10.1.4:59330 (windows-01.chtsmhjxogyevckjfayqqcnjda.xx.internal.cloudapp.net)
I0409 23:31:43.826845 45524 hierarchical.cpp:392] Removed framework de7dad45-a3d2-4321-b837-36e3d2b4c399-0000
I0409 23:31:43.826845 45524 hierarchical.cpp:829] Agent de7dad45-a3d2-4321-b837-36e3d2b4c399-S0
deactivated
I0409 23:31:43.826845 42016 containerizer.cpp:2576] Destroying co[       OK ] IsolationFlag/MemoryIsolatorTest.ROOT_MemUsage/0
(736 ms)
[----------] 1 test from IsolationFlag/MemoryIsolatorTest (752 ms total)

[----------] Global test environment tear-down
[==========] 1159 tests from 108 test cases ran. (577780 ms total)
[  PASSED  ] 1157 tests.
[  FAILED  ] 2 tests, listed below:
[  FAILED  ] DockerFetcherPluginTest.INTERNET_CURL_FetchImage
[  FAILED  ] DockerFetcherPluginTest.INTERNET_CURL_InvokeFetchByName

 2 FAILED TESTS
  YOU HAVE 233 DISABLED TESTS

ntainer 591b4ffd-32a8-4b1e-8f88-c7426e347a3f in RUNNING state
I0409 23:31:43.826845 42016 containerizer.cpp:3278] Transitioning the state of container 591b4ffd-32a8-4b1e-8f88-c7426e347a3f
from RUNNING to DESTROYING
I0409 23:31:43.826845 42016 launcher.cpp:161] Asked to destroy container 591b4ffd-32a8-4b1e-8f88-c7426e347a3f
W0409 23:31:43.826845 38316 process.cpp:1423] Failed to recv on socket WindowsFD::Type::SOCKET=992
to peer '192.10.1.4:61756': IO failed with error code: The specified network name is no longer
available.

W0409 23:31:43.826845 38316 process.cpp:838] Failed to recv on socket WindowsFD::Type::SOCKET=2068
to peer '192.10.1.4:61757': IO failed with error code: The specified network name is no longer
available.

I0409 23:31:43.920641 45524 containerizer.cpp:3117] Container 591b4ffd-32a8-4b1e-8f88-c7426e347a3f
has exited
I0409 23:31:43.936213 44940 master.cpp:1135] Master terminating
I0409 23:31:43.951841 43136 hierarchical.cpp:680] Removed agent de7dad45-a3d2-4321-b837-36e3d2b4c399-S0
I0409 23:31:44.483098 38316 process.cpp:927] Stopped the socket accept loop
```

- Mesos Reviewbot Windows


On April 10, 2019, 5:21 a.m., Chun-Hung Hsiao wrote:
> 
> -----------------------------------------------------------
> This is an automatically generated e-mail. To reply, visit:
> https://reviews.apache.org/r/70133/
> -----------------------------------------------------------
> 
> (Updated April 10, 2019, 5:21 a.m.)
> 
> 
> Review request for mesos, Benjamin Bannier and Meng Zhu.
> 
> 
> Repository: mesos
> 
> 
> Description
> -------
> 
> Removed unnecessary accept filters in SLRP tests.
> 
> 
> Diffs
> -----
> 
>   src/tests/storage_local_resource_provider_tests.cpp bd35150200a23ba57408f5d64a975f8a2f062018

> 
> 
> Diff: https://reviews.apache.org/r/70133/diff/2/
> 
> 
> Testing
> -------
> 
> `sudo make check`
> 
> Especially, tested that each of the three modified tests finishes in 5 seconds.
> 
> 
> Thanks,
> 
> Chun-Hung Hsiao
> 
>


Mime
  • Unnamed multipart/alternative (inline, None, 0 bytes)
View raw message