mesos-reviews mailing list archives

Site index · List index
Message view « Date » · « Thread »
Top « Date » · « Thread »
From Mesos Reviewbot Windows <revi...@mesos.apache.org>
Subject Re: Review Request 70396: Added a test to ensure correct role consumed quota accounting.
Date Sat, 06 Apr 2019 03:25:13 GMT

-----------------------------------------------------------
This is an automatically generated e-mail. To reply, visit:
https://reviews.apache.org/r/70396/#review214436
-----------------------------------------------------------



FAIL: Some of the unit tests failed. Please check the relevant logs.

Reviews applied: `['70390', '70396']`

Failed command: `Start-MesosCITesting`

All the build artifacts available at: http://dcos-win.westus2.cloudapp.azure.com/artifacts/mesos-reviewbot-testing/3099/mesos-review-70396

Relevant logs:

- [mesos-tests-cmake.log](http://dcos-win.westus2.cloudapp.azure.com/artifacts/mesos-reviewbot-testing/3099/mesos-review-70396/logs/mesos-tests-cmake.log):

```
         d:\dcos\mesos\mesos\src\tests\hierarchical_allocator_tests.cpp(6465): error C3861:
'createFrameworkInfo': identifier not found [D:\DCOS\mesos\src\tests\mesos-tests.vcxproj]
         d:\dcos\mesos\mesos\src\tests\hierarchical_allocator_tests.cpp(6466): error C2882:
'allocator': illegal use of namespace identifier in expression [D:\DCOS\mesos\src\tests\mesos-tests.vcxproj]
         d:\dcos\mesos\mesos\src\tests\hierarchical_allocator_tests.cpp(6468): error C3861:
'createSlaveInfo': identifier not found [D:\DCOS\mesos\src\tests\mesos-tests.vcxproj]
         d:\dcos\mesos\mesos\src\tests\hierarchical_allocator_tests.cpp(6469): error C2882:
'allocator': illegal use of namespace identifier in expression [D:\DCOS\mesos\src\tests\mesos-tests.vcxproj]
         d:\dcos\mesos\mesos\src\tests\hierarchical_allocator_tests.cpp(6481): error C2065:
'allocations': undeclared identifier [D:\DCOS\mesos\src\tests\mesos-tests.vcxproj]
         d:\dcos\mesos\mesos\src\tests\hierarchical_allocator_tests.cpp(6481): error C2672:
'AwaitAssertEq': no matching overloaded function found [D:\DCOS\mesos\src\tests\mesos-tests.vcxproj]
         d:\dcos\mesos\mesos\src\tests\hierarchical_allocator_tests.cpp(6481): error C2780:
'testing::AssertionResult AwaitAssertEq(const char *,const char *,const char *,const T1 &,const
process::Future<X> &,const Duration &)': expects 6 arguments - 5 provided [D:\DCOS\mesos\src\tests\mesos-tests.vcxproj]
         d:\dcos\mesos\mesos\src\tests\hierarchical_allocator_tests.cpp(6481): error C2512:
'testing::AssertionResult': no appropriate default constructor available [D:\DCOS\mesos\src\tests\mesos-tests.vcxproj]
         d:\dcos\mesos\mesos\src\tests\hierarchical_allocator_tests.cpp(6484): error C3861:
'createFrameworkInfo': identifier not found [D:\DCOS\mesos\src\tests\mesos-tests.vcxproj]
         d:\dcos\mesos\mesos\src\tests\hierarchical_allocator_tests.cpp(6485): error C2882:
'allocator': illegal use of namespace identifier in expression [D:\DCOS\mesos\src\tests\mesos-tests.vcxproj]
         d:\dcos\mesos\mesos\src\tests\hierarchical_allocator_tests.cpp(6488): error C3861:
'createSlaveInfo': identifier not found [D:\DCOS\mesos\src\tests\mesos-tests.vcxproj]
         d:\dcos\mesos\mesos\src\tests\hierarchical_allocator_tests.cpp(6489): error C2882:
'allocator': illegal use of namespace identifier in expression [D:\DCOS\mesos\src\tests\mesos-tests.vcxproj]
         d:\dcos\mesos\mesos\src\tests\hierarchical_allocator_tests.cpp(6501): error C2065:
'allocations': undeclared identifier [D:\DCOS\mesos\src\tests\mesos-tests.vcxproj]
         d:\dcos\mesos\mesos\src\tests\hierarchical_allocator_tests.cpp(6501): error C2672:
'AwaitAssertEq': no matching overloaded function found [D:\DCOS\mesos\src\tests\mesos-tests.vcxproj]
         d:\dcos\mesos\mesos\src\tests\hierarchical_allocator_tests.cpp(6501): error C2780:
'testing::AssertionResult AwaitAssertEq(const char *,const char *,const char *,const T1 &,const
process::Future<X> &,const Duration &)': expects 6 arguments - 5 provided [D:\DCOS\mesos\src\tests\mesos-tests.vcxproj]
         d:\dcos\mesos\mesos\src\tests\hierarchical_allocator_tests.cpp(6501): error C2512:
'testing::AssertionResult': no appropriate default constructor available [D:\DCOS\mesos\src\tests\mesos-tests.vcxproj]
         d:\dcos\mesos\mesos\src\tests\hierarchical_allocator_tests.cpp(6506): error C2882:
'allocator': illegal use of namespace identifier in expression [D:\DCOS\mesos\src\tests\mesos-tests.vcxproj]
         d:\dcos\mesos\mesos\src\tests\hierarchical_allocator_tests.cpp(6508): error C3861:
'createSlaveInfo': identifier not found [D:\DCOS\mesos\src\tests\mesos-tests.vcxproj]
         d:\dcos\mesos\mesos\src\tests\hierarchical_allocator_tests.cpp(6509): error C2882:
'allocator': illegal use of namespace identifier in expression [D:\DCOS\mesos\src\tests\mesos-tests.vcxproj]
         d:\dcos\mesos\mesos\src\tests\hierarchical_allocator_tests.cpp(6517): error C2065:
'allocations': undeclared identifier [D:\DCOS\mesos\src\tests\mesos-tests.vcxproj]
         d:\dcos\mesos\mesos\src\tests\hierarchical_allocator_tests.cpp(6520): error C3861:
'createSlaveInfo': identifier not found [D:\DCOS\mesos\src\tests\mesos-tests.vcxproj]
         d:\dcos\mesos\mesos\src\tests\hierarchical_allocator_tests.cpp(6521): error C2882:
'allocator': illegal use of namespace identifier in expression [D:\DCOS\mesos\src\tests\mesos-tests.vcxproj]
         d:\dcos\mesos\mesos\src\tests\hierarchical_allocator_tests.cpp(6534): error C2065:
'allocations': undeclared identifier [D:\DCOS\mesos\src\tests\mesos-tests.vcxproj]
         d:\dcos\mesos\mesos\src\tests\hierarchical_allocator_tests.cpp(6534): error C2512:
'testing::AssertionResult': no appropriate default constructor available [D:\DCOS\mesos\src\tests\mesos-tests.vcxproj]

    172 Warning(s)
    49 Error(s)

Time Elapsed 00:31:52.74
```

- Mesos Reviewbot Windows


On April 5, 2019, 12:37 a.m., Meng Zhu wrote:
> 
> -----------------------------------------------------------
> This is an automatically generated e-mail. To reply, visit:
> https://reviews.apache.org/r/70396/
> -----------------------------------------------------------
> 
> (Updated April 5, 2019, 12:37 a.m.)
> 
> 
> Review request for mesos and Benjamin Mahler.
> 
> 
> Repository: mesos
> 
> 
> Description
> -------
> 
> This test ensures that a nested role's allocation is accounted
> to the top-level role's consumed quota.
> 
> 
> Diffs
> -----
> 
>   src/tests/hierarchical_allocator_tests.cpp 30c0c3e62c626f8c0cab8bd70b8d6953dce2a2e6

> 
> 
> Diff: https://reviews.apache.org/r/70396/diff/2/
> 
> 
> Testing
> -------
> 
> make check
> 
> 
> Thanks,
> 
> Meng Zhu
> 
>


Mime
  • Unnamed multipart/alternative (inline, None, 0 bytes)
View raw message