mesos-reviews mailing list archives

Site index · List index
Message view « Date » · « Thread »
Top « Date » · « Thread »
From Mesos Reviewbot Windows <revi...@mesos.apache.org>
Subject Re: Review Request 70366: Added a unit test for Mesos containerizer image force pulling.
Date Thu, 04 Apr 2019 09:30:30 GMT

-----------------------------------------------------------
This is an automatically generated e-mail. To reply, visit:
https://reviews.apache.org/r/70366/#review214360
-----------------------------------------------------------



FAIL: Some of the unit tests failed. Please check the relevant logs.

Reviews applied: `['70287', '70354', '70365', '70288', '70289', '70290', '70291', '70366']`

Failed command: `Start-MesosCITesting`

All the build artifacts available at: http://dcos-win.westus2.cloudapp.azure.com/artifacts/mesos-reviewbot-testing/3080/mesos-review-70366

Relevant logs:

- [mesos-tests.log](http://dcos-win.westus2.cloudapp.azure.com/artifacts/mesos-reviewbot-testing/3080/mesos-review-70366/logs/mesos-tests.log):

```
I0404 09:30:13.727792 30428 master.cpp:1295] Agent 8a4ca07f-e203-4875-943e-316de46949fe-S0
at slave(500)@192.10.1.4:51008 (windows-01.chtsmhjxogyevckjfayqqcnjda.xx.internal.cloudapp.net)
disconnected
I0404 09:30:13.727792 30428 master.cpp:3333] Disconnecting agent 8a4ca07f-e203-4875-943e-316de46949fe-S0
at slave(500)@192.10.1.4:51008 (windows-01.chtsmhjxogyevckjfayqqcnjda.xx.internal.cloudapp.net)
I0404 09:30:13.727792 30428 master.cpp:3352] Deactivating agent 8a4ca07f-e203-4875-943e-316de46949fe-S0
at slave(500)@192.10.1.4:51008 (windows-01.chtsmhjxogyevckjfayqqcnjda.xx.internal.cloudapp.net)
I0404 09:30:13.727792 32244 hierarchical.cpp:392] Removed framework 8a4ca07f-e203-4875-943e-316de46949fe-0000
I0404 09:30:13.728866 32244 hierarchical.cpp:829] Agent 8a4ca07f-e203-4875-943e-316de46949fe-S0
deactivated
I0404 09:30:13.728866 22912 containerizer.cpp:2576] Destroying container b6ad2284-e086-4789-85e9-ee5f05603d42
in RUNNING state
I0404 09:30:13.72886[       OK ] IsolationFlag/MemoryIsolatorTest.ROOT_MemUsage/0 (788 ms)
[----------] 1 test from IsolationFlag/MemoryIsolatorTest (806 ms total)

[----------] Global test environment tear-down
[==========] 1134 tests from 106 test cases ran. (618597 ms total)
[  PASSED  ] 1132 tests.
[  FAILED  ] 2 tests, listed below:
[  FAILED  ] DockerFetcherPluginTest.INTERNET_CURL_FetchImage
[  FAILED  ] DockerFetcherPluginTest.INTERNET_CURL_InvokeFetchByName

 2 FAILED TESTS
  YOU HAVE 231 DISABLED TESTS

6 22912 containerizer.cpp:3278] Transitioning the state of container b6ad2284-e086-4789-85e9-ee5f05603d42
from RUNNING to DESTROYING
I0404 09:30:13.729818 22912 launcher.cpp:161] Asked to destroy container b6ad2284-e086-4789-85e9-ee5f05603d42
W0404 09:30:13.730795 33304 process.cpp:1423] Failed to recv on socket WindowsFD::Type::SOCKET=2504
to peer '192.10.1.4:53443': IO failed with error code: The specified network name is no longer
available.

W0404 09:30:13.730795 33304 process.cpp:838] Failed to recv on socket WindowsFD::Type::SOCKET=2732
to peer '192.10.1.4:53444': IO failed with error code: The specified network name is no longer
available.

I0404 09:30:13.814801 30960 containerizer.cpp:3117] Container b6ad2284-e086-4789-85e9-ee5f05603d42
has exited
I0404 09:30:13.845796 22536 master.cpp:1135] Master terminating
I0404 09:30:13.847759 26176 hierarchical.cpp:680] Removed agent 8a4ca07f-e203-4875-943e-316de46949fe-S0
I0404 09:30:14.311792 33304 process.cpp:927] Stopped the socket accept loop
```

- Mesos Reviewbot Windows


On April 3, 2019, 7:25 a.m., Gilbert Song wrote:
> 
> -----------------------------------------------------------
> This is an automatically generated e-mail. To reply, visit:
> https://reviews.apache.org/r/70366/
> -----------------------------------------------------------
> 
> (Updated April 3, 2019, 7:25 a.m.)
> 
> 
> Review request for mesos, Andrei Budnik, Ilya Pronin, Jie Yu, and Qian Zhang.
> 
> 
> Repository: mesos
> 
> 
> Description
> -------
> 
> Added a unit test for Mesos containerizer image force pulling.
> 
> 
> Diffs
> -----
> 
>   src/tests/containerizer/provisioner_docker_tests.cpp a2a7f11eeb533d7790890988061612e11a798067

> 
> 
> Diff: https://reviews.apache.org/r/70366/diff/2/
> 
> 
> Testing
> -------
> 
> 
> Thanks,
> 
> Gilbert Song
> 
>


Mime
  • Unnamed multipart/alternative (inline, None, 0 bytes)
View raw message