mesos-reviews mailing list archives

Site index · List index
Message view « Date » · « Thread »
Top « Date » · « Thread »
From Mesos Reviewbot Windows <revi...@mesos.apache.org>
Subject Re: Review Request 70369: Fixed compile error with a built-in logrotate module.
Date Wed, 03 Apr 2019 04:17:33 GMT

-----------------------------------------------------------
This is an automatically generated e-mail. To reply, visit:
https://reviews.apache.org/r/70369/#review214311
-----------------------------------------------------------



FAIL: Some of the unit tests failed. Please check the relevant logs.

Reviews applied: `['70369']`

Failed command: `Start-MesosCITesting`

All the build artifacts available at: http://dcos-win.westus2.cloudapp.azure.com/artifacts/mesos-reviewbot-testing/3067/mesos-review-70369

Relevant logs:

- [mesos-tests.log](http://dcos-win.westus2.cloudapp.azure.com/artifacts/mesos-reviewbot-testing/3067/mesos-review-70369/logs/mesos-tests.log):

```
I0403 04:17:17.452752 20128 exown framework e0ad6767-d9d8-44da-a567-9dca20311928-0000 because
it is terminating
I0403 04:17:17.454778 26404 master.cpp:1295] Agent e0ad6767-d9d8-44da-a567-9dca20311928-S0
at slave(500)@192.10.1.4:58739 (windows-01.chtsmhjxogyevckjfayqqcnjda.xx.internal.cloudapp.net)
disconnected
I0403 04:17:17.454778 26404 master.cpp:3333] Disconnecting agent e0ad6767-d9d8-44da-a567-9dca20311928-S0
at slave(500)@192.10.1.4:58739 (windows-01.chtsmhjxogyevckjfayqqcnjda.xx.internal.cloudapp.net)
I0403 04:17:17.454778 26404 master.cpp:3352] Deactivating agent e0ad6767-d9d8-44da-a567-9dca20311928-S0
at slave(500)@192.10.1.4:58739 (windows-01.chtsmhjxogyevckjfayqqcnjda.xx.internal.cloudapp.net)
I0403 04:17:17.455782 19640 hierarchical.cpp:391] Removed framework e0ad6767-d9d8-44da-a567-9dca20311928-0000
I0403 04:17:17.455782 19640 hierarchical.cpp:828] Agent e0ad6767-d9d8-44da-a567-9dca20311928-S0
deactivated
I0403 04:17:17.456758 27920 containerizer.cpp:2576] Destroying container 0313bc36-ff0d-4a71-80ec-0d7991e25706
in RUNNING st[       OK ] IsolationFlag/MemoryIsolatorTest.ROOT_MemUsage/0 (688 ms)
[----------] 1 test from IsolationFlag/MemoryIsolatorTest (706 ms total)

[----------] Global test environment tear-down
[==========] 1131 tests from 107 test cases ran. (557156 ms total)
[  PASSED  ] 1130 tests.
[  FAILED  ] 1 test, listed below:
[  FAILED  ] DockerFetcherPluginTest.INTERNET_CURL_FetchBlob

 1 FAILED TEST
  YOU HAVE 231 DISABLED TESTS

ate
I0403 04:17:17.456758 27920 containerizer.cpp:3278] Transitioning the state of container 0313bc36-ff0d-4a71-80ec-0d7991e25706
from RUNNING to DESTROYING
I0403 04:17:17.457784 27920 launcher.cpp:161] Asked to destroy container 0313bc36-ff0d-4a71-80ec-0d7991e25706
W0403 04:17:17.458782 21312 process.cpp:1423] Failed to recv on socket WindowsFD::Type::SOCKET=4592
to peer '192.10.1.4:61139': IO failed with error code: The specified network name is no longer
available.

W0403 04:17:17.458782 21312 process.cpp:838] Failed to recv on socket WindowsFD::Type::SOCKET=3136
to peer '192.10.1.4:61140': IO failed with error code: The specified network name is no longer
available.

I0403 04:17:17.500866 19768 containerizer.cpp:3117] Container 0313bc36-ff0d-4a71-80ec-0d7991e25706
has exited
I0403 04:17:17.530843 25492 master.cpp:1135] Master terminating
I0403 04:17:17.531791 19768 hierarchical.cpp:679] Removed agent e0ad6767-d9d8-44da-a567-9dca20311928-S0
I0403 04:17:17.962246 21312 process.cpp:927] Stopped the socket accept loop
```

- Mesos Reviewbot Windows


On April 2, 2019, 11:56 a.m., Andrei Budnik wrote:
> 
> -----------------------------------------------------------
> This is an automatically generated e-mail. To reply, visit:
> https://reviews.apache.org/r/70369/
> -----------------------------------------------------------
> 
> (Updated April 2, 2019, 11:56 a.m.)
> 
> 
> Review request for mesos, Chun-Hung Hsiao, Joseph Wu, and Meng Zhu.
> 
> 
> Bugs: MESOS-9564
>     https://issues.apache.org/jira/browse/MESOS-9564
> 
> 
> Repository: mesos
> 
> 
> Description
> -------
> 
> This patch gets rid of redundant use of `Error` wrapper for an error
> message that is passed to EXIT macro. This fixes a compile error on
> Mesos versions that do not support output operator for `Error` type.
> 
> 
> Diffs
> -----
> 
>   src/slave/container_loggers/logrotate.cpp 528dea48fa2c470c176ee2ad07850598c628f82f

> 
> 
> Diff: https://reviews.apache.org/r/70369/diff/1/
> 
> 
> Testing
> -------
> 
> `make`
> 
> 
> Thanks,
> 
> Andrei Budnik
> 
>


Mime
  • Unnamed multipart/alternative (inline, None, 0 bytes)
View raw message