mesos-reviews mailing list archives

Site index · List index
Message view « Date » · « Thread »
Top « Date » · « Thread »
From Mesos Reviewbot Windows <revi...@mesos.apache.org>
Subject Re: Review Request 70374: Added tests for Sorter::allocationScalarQuantities.
Date Wed, 03 Apr 2019 03:09:42 GMT

-----------------------------------------------------------
This is an automatically generated e-mail. To reply, visit:
https://reviews.apache.org/r/70374/#review214307
-----------------------------------------------------------



FAIL: Some of the unit tests failed. Please check the relevant logs.

Reviews applied: `['70352', '70353', '70370', '70373', '70374']`

Failed command: `Start-MesosCITesting`

All the build artifacts available at: http://dcos-win.westus2.cloudapp.azure.com/artifacts/mesos-reviewbot-testing/3065/mesos-review-70374

Relevant logs:

- [mesos-tests.log](http://dcos-win.westus2.cloudapp.azure.com/artifacts/mesos-reviewbot-testing/3065/mesos-review-70374/logs/mesos-tests.log):

```
I0403 03:09:26.426995 25652 master.cpp:3333] Disconnecting agent 42caf5ed-401c-49e1-84b8-145016c7421c-S0
at slave(500)@192.10.1.4:56162 (windows-01.chtsmhjxogyevckjfayqqcnjda.xx.internal.cloudapp.net)
I0403 03:09:26.426995 25652 master.cpp:3352] Deactivating agent 42caf5ed-401c-49e1-84b8-145016c7421c-S0
at slave(500)@192.10.1.4:56162 (windows-01.chtsmhjxogyevckjfayqqcnjda.xx.internal.cloudapp.net)
I0403 03:09:26.428045 21436 hierarchical.cpp:392] Removed framework 42caf5ed-401c-49e1-84b8-145016c7421c-0000
I0403 03:09:26.428045 21436 hierarchical.cpp:829] Agent 42caf5ed-401c-49e1-84b8-145016c7421c-S0
deactivated
I0403 03:09:26.429003 12688 containerizer.cpp:2576] Destroying container 9f1f5199-30f6-4579-9b97-387917ea1180
in RUNNING state
I0403 03:09:26.429003 12688 containerizer.cpp:3278] Transitioning the state of container 9f1f5199-30f6-4579-9b97-387917ea1180
from RUNNING to DESTROYING
I0403 03:09:26.429003 12688 launcher.cpp:161] Asked to destroy container 9f1f5199-30f6-4579-9b97-387917ea1180
W0403 03:09:26.430030 25916 proces[       OK ] IsolationFlag/MemoryIsolatorTest.ROOT_MemUsage/0
(783 ms)
[----------] 1 test from IsolationFlag/MemoryIsolatorTest (802 ms total)

[----------] Global test environment tear-down
[==========] 1132 tests from 107 test cases ran. (578016 ms total)
[  PASSED  ] 1129 tests.
[  FAILED  ] 3 tests, listed below:
[  FAILED  ] CommonSorterTest/0.AllocationForInactiveClient, where TypeParam = class mesos::internal::master::allocator::DRFSorter
[  FAILED  ] CommonSorterTest/1.AllocationForInactiveClient, where TypeParam = class mesos::internal::master::allocator::RandomSorter
[  FAILED  ] DockerFetcherPluginTest.INTERNET_CURL_FetchImage

 3 FAILED TESTS
  YOU HAVE 231 DISABLED TESTS

s.cpp:1423] Failed to recv on socket WindowsFD::Type::SOCKET=7328 to peer '192.10.1.4:58538':
IO failed with error code: The specified network name is no longer available.

W0403 03:09:26.431008 25916 process.cpp:838] Failed to recv on socket WindowsFD::Type::SOCKET=7308
to peer '192.10.1.4:58539': IO failed with error code: The specified network name is no longer
available.

I0403 03:09:26.512995 24664 containerizer.cpp:3117] Container 9f1f5199-30f6-4579-9b97-387917ea1180
has exited
I0403 03:09:26.543995 21276 master.cpp:1135] Master terminating
I0403 03:09:26.544981 22636 hierarchical.cpp:680] Removed agent 42caf5ed-401c-49e1-84b8-145016c7421c-S0
I0403 03:09:26.957011 25916 process.cpp:927] Stopped the socket accept loop
```

- Mesos Reviewbot Windows


On April 2, 2019, 5:54 p.m., Benjamin Mahler wrote:
> 
> -----------------------------------------------------------
> This is an automatically generated e-mail. To reply, visit:
> https://reviews.apache.org/r/70374/
> -----------------------------------------------------------
> 
> (Updated April 2, 2019, 5:54 p.m.)
> 
> 
> Review request for mesos and Meng Zhu.
> 
> 
> Repository: mesos
> 
> 
> Description
> -------
> 
> See summary.
> 
> 
> Diffs
> -----
> 
>   src/tests/sorter_tests.cpp 76e3256a56a810800b4e3cc88df82af58ced579b 
> 
> 
> Diff: https://reviews.apache.org/r/70374/diff/1/
> 
> 
> Testing
> -------
> 
> make check
> 
> 
> Thanks,
> 
> Benjamin Mahler
> 
>


Mime
  • Unnamed multipart/alternative (inline, None, 0 bytes)
View raw message