mesos-reviews mailing list archives

Site index · List index
Message view « Date » · « Thread »
Top « Date » · « Thread »
From Mesos Reviewbot Windows <revi...@mesos.apache.org>
Subject Re: Review Request 70244: Added new operation reconciliation tests.
Date Thu, 21 Mar 2019 23:26:08 GMT

-----------------------------------------------------------
This is an automatically generated e-mail. To reply, visit:
https://reviews.apache.org/r/70244/#review213895
-----------------------------------------------------------



FAIL: Some of the unit tests failed. Please check the relevant logs.

Reviews applied: `['70264', '70242', '70243', '70244']`

Failed command: `Start-MesosCITesting`

All the build artifacts available at: http://dcos-win.westus2.cloudapp.azure.com/artifacts/mesos-reviewbot-testing/2990/mesos-review-70244

Relevant logs:

- [mesos-tests.log](http://dcos-win.westus2.cloudapp.azure.com/artifacts/mesos-reviewbot-testing/2990/mesos-review-70244/logs/mesos-tests.log):

```
I0321 23:25:52.451818 23624 master.cpp:1295] Agent a9c136cd-584b-49f5-9574-f1954599c2fc-S0
at slave(502)@192.10.1.6:59694 (windows-02.chtsmhjxogyevckjfayqqcnjda.xx.internal.cloudapp.net)
disconnected
I0321 23:25:52.452865 23624 master.cpp:3330] Disconnecting agent a9c136cd-584b-49f5-9574-f1954599c2fc-S0
at slave(502)@192.10.1.6:59694 (windows-02.chtsmhjxogyevckjfayqqcnjda.xx.internal.cloudapp.net)
I0321 23:25:52.452865 23624 master.cpp:3349] Deactivating agent a9c136cd-584b-49f5-9574-f1954599c2fc-S0
at slave(502)@192.10.1.6:59694 (windows-02.chtsmhjxogyevckjfayqqcnjda.xx.internal.cloudapp.net)
I0321 23:25:52.452865 23084 hierarchical.cpp:391] Removed framework a9c136cd-584b-49f5-9574-f1954599c2fc-0000
I0321 23:25:52.452865 23084 hierarchical.cpp:828] Agent a9c136cd-584b-49f5-9574-f1954599c2fc-S0
deactivated
I0321 23:25:52.453860 23624 containerizer.cpp:2576] Destroying container 5230119f-ea8d-4a8e-90b7-c5e3b74c727e
in RUNNING stat[       OK ] IsolationFlag/MemoryIsolatorTest.ROOT_MemUsage/0 (690 ms)
[----------] 1 test from IsolationFlag/MemoryIsolatorTest (707 ms total)

[----------] Global test environment tear-down
[==========] 1128 tests from 107 test cases ran. (540082 ms total)
[  PASSED  ] 1126 tests.
[  FAILED  ] 2 tests, listed below:
[  FAILED  ] ContentType/OperationReconciliationTest.FrameworkReconciliationRaceWithUpdateSlaveMessage/0,
where GetParam() = application/x-protobuf
[  FAILED  ] ContentType/OperationReconciliationTest.FrameworkReconciliationRaceWithUpdateSlaveMessage/1,
where GetParam() = application/json

 2 FAILED TESTS
  YOU HAVE 231 DISABLED TESTS

e
I0321 23:25:52.453860 23624 containerizer.cpp:3278] Transitioning the state of container 5230119f-ea8d-4a8e-90b7-c5e3b74c727e
from RUNNING to DESTROYING
I0321 23:25:52.454818 23624 launcher.cpp:161] Asked to destroy container 5230119f-ea8d-4a8e-90b7-c5e3b74c727e
W0321 23:25:52.455790 20672 process.cpp:1423] Failed to recv on socket WindowsFD::Type::SOCKET=8168
to peer '192.10.1.6:65519': IO failed with error code: The specified network name is no longer
available.

W0321 23:25:52.455790 20672 process.cpp:838] Failed to recv on socket WindowsFD::Type::SOCKET=7940
to peer '192.10.1.6:65520': IO failed with error code: The specified network name is no longer
available.

I0321 23:25:52.542614 17448 containerizer.cpp:3117] Container 5230119f-ea8d-4a8e-90b7-c5e3b74c727e
has exited
I0321 23:25:52.572590 26944 master.cpp:1135] Master terminating
I0321 23:25:52.574566 23624 hierarchical.cpp:679] Removed agent a9c136cd-584b-49f5-9574-f1954599c2fc-S0
I0321 23:25:52.983587 20672 process.cpp:927] Stopped the socket accept loop
```

- Mesos Reviewbot Windows


On March 20, 2019, 7:47 p.m., Greg Mann wrote:
> 
> -----------------------------------------------------------
> This is an automatically generated e-mail. To reply, visit:
> https://reviews.apache.org/r/70244/
> -----------------------------------------------------------
> 
> (Updated March 20, 2019, 7:47 p.m.)
> 
> 
> Review request for mesos, Benjamin Bannier, Chun-Hung Hsiao, Gastón Kleiman, and Joseph
Wu.
> 
> 
> Bugs: MESOS-9318
>     https://issues.apache.org/jira/browse/MESOS-9318
> 
> 
> Repository: mesos
> 
> 
> Description
> -------
> 
> This patch adds two new operation reconciliation tests,
> `OperationOnUnsubscribedProvider` and
> `FrameworkReconciliationRaceWithUpdateSlaveMessage`, to
> probe scenarios relevant to MESOS-9648 and MESOS-9318.
> 
> 
> Diffs
> -----
> 
>   src/tests/operation_reconciliation_tests.cpp 6a815ad694e2a608ce324715c920833f825793a0

> 
> 
> Diff: https://reviews.apache.org/r/70244/diff/2/
> 
> 
> Testing
> -------
> 
> `make check`
> `bin/mesos-tests.sh --gtest_filter="*FrameworkReconciliationRaceWithUpdateSlaveMessage*"
--gtest_repeat=-1 --gtest_break_on_failure`
> `bin/mesos-tests.sh --gtest_filter="*OperationOnUnsubscribedProvider*" --gtest_repeat=-1
--gtest_break_on_failure`
> 
> 
> Thanks,
> 
> Greg Mann
> 
>


Mime
  • Unnamed multipart/alternative (inline, None, 0 bytes)
View raw message