mesos-reviews mailing list archives

Site index · List index
Message view « Date » · « Thread »
Top « Date » · « Thread »
From Mesos Reviewbot Windows <revi...@mesos.apache.org>
Subject Re: Review Request 68301: Changed `DEFAULT_EXECUTOR_INFO` to use `default:id`.
Date Wed, 13 Mar 2019 20:25:51 GMT

-----------------------------------------------------------
This is an automatically generated e-mail. To reply, visit:
https://reviews.apache.org/r/68301/#review213686
-----------------------------------------------------------



FAIL: Some of the unit tests failed. Please check the relevant logs.

Reviews applied: `['68297', '68374', '68301']`

Failed command: `Start-MesosCITesting`

All the build artifacts available at: http://dcos-win.westus2.cloudapp.azure.com/artifacts/mesos-reviewbot-testing/2937/mesos-review-68301

Relevant logs:

- [mesos-tests.log](http://dcos-win.westus2.cloudapp.azure.com/artifacts/mesos-reviewbot-testing/2937/mesos-review-68301/logs/mesos-tests.log):

```

W0313 20:25:34.569185  9964 process.cpp:838] Failed to recv on socket WindowsFD::Type::SOCKET=14064
to peer '192.10.1.4:63426': IO failed with error code: The specified network name is no longer
available.

I0313 20:25:34.585218  8552 containerizer.cpp:3117] Container 98dfa831-a280-4247-a5ac-63fa58cef8db
has exited
I0313 20:25:34.617194  8552 master.cpp:1135] Master terminating
I0313 20:25:34.618181  2412 hierarc[       OK ] IsolationFlag/MemoryIsolatorTest.ROOT_MemUsage/0
(692 ms)
[----------] 1 test from IsolationFlag/MemoryIsolatorTest (711 ms total)

[----------] Global test environment tear-down
[==========] 1115 tests from 106 test cases ran. (660523 ms total)
[  PASSED  ] 1104 tests.
[  FAILED  ] 11 tests, listed below:
[  FAILED  ] GarbageCollectorIntegrationTest.LongLivedDefaultExecutor
[  FAILED  ] GarbageCollectorIntegrationTest.LongLivedDefaultExecutorRestart
[  FAILED  ] MesosContainerizer/DefaultExecutorTest.KillTask/0, where GetParam() = "mesos"
[  FAILED  ] MesosContainerizer/DefaultExecutorTest.KillTaskGroupOnTaskFailure/0, where GetParam()
= "mesos"
[  FAILED  ] MesosContainerizer/DefaultExecutorTest.CommitSuicideOnKillTask/0, where GetParam()
= "mesos"
[  FAILED  ] MesosContainerizer/DefaultExecutorTest.MaxCompletionTime/0, where GetParam()
= "mesos"
[  FAILED  ] MesosContainerizer/DefaultExecutorTest.TaskWithFileURI/0, where GetParam() =
"mesos"
[  FAILED  ] ROOT_DOCKER_DockerAndMesosContainerizers/DefaultExecutorTest.KillTask/0, where
GetParam() = "docker,mesos"
[  FAILED  ] ROOT_DOCKER_DockerAndMesosContainerizers/DefaultExecutorTest.CommitSuicideOnKillTask/0,
where GetParam() = "docker,mesos"
[  FAILED  ] ROOT_DOCKER_DockerAndMesosContainerizers/DefaultExecutorTest.MaxCompletionTime/0,
where GetParam() = "docker,mesos"
[  FAILED  ] ROOT_DOCKER_DockerAndMesosContainerizers/DefaultExecutorTest.TaskWithFileURI/0,
where GetParam() = "docker,mesos"

11 FAILED TESTS
  YOU HAVE 232 DISABLED TESTS

hical.cpp:678] Removed agent f1807198-588f-42ab-ba0d-83bfd0c0ff6c-S0
I0313 20:25:34.881379  9964 process.cpp:927] Stopped the socket accept loop
```

- Mesos Reviewbot Windows


On Aug. 23, 2018, 6:26 p.m., Andrew Schwartzmeyer wrote:
> 
> -----------------------------------------------------------
> This is an automatically generated e-mail. To reply, visit:
> https://reviews.apache.org/r/68301/
> -----------------------------------------------------------
> 
> (Updated Aug. 23, 2018, 6:26 p.m.)
> 
> 
> Review request for mesos, Benjamin Mahler, Gastón Kleiman, and Joseph Wu.
> 
> 
> Repository: mesos
> 
> 
> Description
> -------
> 
> By adding a `:` to the default executor ID used by the tests, this
> thoroughly exercises MESOS-9109.
> 
> 
> Diffs
> -----
> 
>   src/tests/containerizer/volume_host_path_isolator_tests.cpp 81bf72e869d36edb162b121f9e84a53d2096dae3

>   src/tests/gc_tests.cpp 4f288cfd70cc53b4064bced96c3c5d6377c1c421 
>   src/tests/health_check_tests.cpp 7544b2c20cb271655ad41c5d8f71739c26e6c638 
>   src/tests/master_tests.cpp 1db8ed7d81acbcd8bad4b7ca77c501d1d99cc135 
>   src/tests/master_validation_tests.cpp ec4fd13724a44a86ad655fb2a8affbb9f476834f 
>   src/tests/mesos.hpp 75c5fae8ed30f64c973b1cc290f8540a072cb8a8 
>   src/tests/slave_authorization_tests.cpp 061e230b52805c4260e93ac83734aed5454ea3b5 
>   src/tests/slave_tests.cpp 9597067799aaedf9d1c9d797454bb4bdf240cde1 
>   src/tests/upgrade_tests.cpp de3911c77f9e40398672889cf43c25d36a6fb274 
> 
> 
> Diff: https://reviews.apache.org/r/68301/diff/4/
> 
> 
> Testing
> -------
> 
> This should have _almost_ all the tests pass, except for:
> 
> ```
> [  FAILED  ] 9 tests, listed below:
> [  FAILED  ] MesosContainerizer/DefaultExecutorTest.KillTask/0, where GetParam() = "mesos"
> [  FAILED  ] MesosContainerizer/DefaultExecutorTest.KillTaskGroupOnTaskFailure/0, where
GetParam() = "mesos"
> [  FAILED  ] MesosContainerizer/DefaultExecutorTest.CommitSuicideOnKillTask/0, where
GetParam() = "mesos"
> [  FAILED  ] MesosContainerizer/DefaultExecutorTest.MaxCompletionTime/0, where GetParam()
= "mesos"
> [  FAILED  ] MesosContainerizer/DefaultExecutorTest.TaskWithFileURI/0, where GetParam()
= "mesos"
> [  FAILED  ] ROOT_DOCKER_DockerAndMesosContainerizers/DefaultExecutorTest.KillTask/0,
where GetParam() = "docker,mesos"
> [  FAILED  ] ROOT_DOCKER_DockerAndMesosContainerizers/DefaultExecutorTest.CommitSuicideOnKillTask/0,
where GetParam() = "docker,mesos"
> [  FAILED  ] ROOT_DOCKER_DockerAndMesosContainerizers/DefaultExecutorTest.MaxCompletionTime/0,
where GetParam() = "docker,mesos"
> [  FAILED  ] ROOT_DOCKER_DockerAndMesosContainerizers/DefaultExecutorTest.TaskWithFileURI/0,
where GetParam() = "docker,mesos"
> ```
> 
> Due to long-path issues with `SetCurrentDirectory` that cannot be worked around except
via regedit + manifest.
> 
> 
> Thanks,
> 
> Andrew Schwartzmeyer
> 
>


Mime
  • Unnamed multipart/alternative (inline, None, 0 bytes)
View raw message