mesos-reviews mailing list archives

Site index · List index
Message view « Date » · « Thread »
Top « Date » · « Thread »
From Mesos Reviewbot Windows <revi...@mesos.apache.org>
Subject Re: Review Request 70025: Blacklisted the "ubuntu-4" Jenkins box.
Date Wed, 20 Feb 2019 20:36:05 GMT

-----------------------------------------------------------
This is an automatically generated e-mail. To reply, visit:
https://reviews.apache.org/r/70025/#review212975
-----------------------------------------------------------



FAIL: Some of the unit tests failed. Please check the relevant logs.

Reviews applied: `['70024', '70025']`

Failed command: `Start-MesosCITesting`

All the build artifacts available at: http://dcos-win.westus2.cloudapp.azure.com/artifacts/mesos-reviewbot-testing/2909/mesos-review-70025

Relevant logs:

- [mesos-tests.log](http://dcos-win.westus2.cloudapp.azure.com/artifacts/mesos-reviewbot-testing/2909/mesos-review-70025/logs/mesos-tests.log):

```
I0220 20:35:47.426396 29756 exown framework 0f2e1e63-cccb-4655-ab66-86daec20fce2-0000 because
it is terminating
I0220 20:35:47.427353 29824 master.cpp:1269] Agent 0f2e1e63-cccb-4655-ab66-86daec20fce2-S0
at slave(491)@192.10.1.4:54823 (windows-01.chtsmhjxogyevckjfayqqcnjda.xx.internal.cloudapp.net)
disconnected
I0220 20:35:47.427353 29824 master.cpp:3292] Disconnecting agent 0f2e1e63-cccb-4655-ab66-86daec20fce2-S0
at slave(491)@192.10.1.4:54823 (windows-01.chtsmhjxogyevckjfayqqcnjda.xx.internal.cloudapp.net)
I0220 20:35:47.428342 30244 hierarchical.cpp:390] Removed framework 0f2e1e63-cccb-4655-ab66-86daec20fce2-0000
I0220 20:35:47.428342 29824 master.cpp:3311] Deactivating agent 0f2e1e63-cccb-4655-ab66-86daec20fce2-S0
at slave(491)@192.10.1.4:54823 (windows-01.chtsmhjxogyevckjfayqqcnjda.xx.internal.cloudapp.net)
I0220 20:35:47.428342 27568 hierarchical.cpp:827] Agent 0f2e1e63-cccb-4655-ab66-86daec20fce2-S0
deactivated
I0220 20:35:47.430429 28832 containerizer.cpp:2526] Destroying container a3b63c42-865e-42b1-9798-e832412f0213
in RUNNING st[       OK ] IsolationFlag/MemoryIsolatorTest.ROOT_MemUsage/0 (791 ms)
[----------] 1 test from IsolationFlag/MemoryIsolatorTest (812 ms total)

[----------] Global test environment tear-down
[==========] 1112 tests from 105 test cases ran. (601972 ms total)
[  PASSED  ] 1111 tests.
[  FAILED  ] 1 test, listed below:
[  FAILED  ] DockerFetcherPluginTest.INTERNET_CURL_FetchImage

 1 FAILED TEST
  YOU HAVE 232 DISABLED TESTS

ate
I0220 20:35:47.430429 28832 containerizer.cpp:3193] Transitioning the state of container a3b63c42-865e-42b1-9798-e832412f0213
from RUNNING to DESTROYING
I0220 20:35:47.430429 28832 launcher.cpp:161] Asked to destroy container a3b63c42-865e-42b1-9798-e832412f0213
W0220 20:35:47.432400 13860 process.cpp:1423] Failed to recv on socket WindowsFD::Type::SOCKET=2508
to peer '192.10.1.4:56787': IO failed with error code: The specified network name is no longer
available.

W0220 20:35:47.433356 13860 process.cpp:838] Failed to recv on socket WindowsFD::Type::SOCKET=2328
to peer '192.10.1.4:56788': IO failed with error code: The specified network name is no longer
available.

I0220 20:35:47.487386 27568 containerizer.cpp:3032] Container a3b63c42-865e-42b1-9798-e832412f0213
has exited
I0220 20:35:47.522347 19772 master.cpp:1109] Master terminating
I0220 20:35:47.524339 27300 hierarchical.cpp:678] Removed agent 0f2e1e63-cccb-4655-ab66-86daec20fce2-S0
I0220 20:35:48.078958 13860 process.cpp:927] Stopped the socket accept loop
```

- Mesos Reviewbot Windows


On Feb. 20, 2019, 7:18 p.m., Jie Yu wrote:
> 
> -----------------------------------------------------------
> This is an automatically generated e-mail. To reply, visit:
> https://reviews.apache.org/r/70025/
> -----------------------------------------------------------
> 
> (Updated Feb. 20, 2019, 7:18 p.m.)
> 
> 
> Review request for mesos and James DeFelice.
> 
> 
> Repository: mesos
> 
> 
> Description
> -------
> 
> The git version installed on the box is too low.
> 
> 
> Diffs
> -----
> 
>   support/jenkins/Jenkinsfile-docker-centos 99575c93dcbe2988e4f67dff613f8cc635c8da27

>   support/jenkins/Jenkinsfile-mini 6790d8957e76c9c1f74abf2aa40f55cb733cb7c3 
> 
> 
> Diff: https://reviews.apache.org/r/70025/diff/1/
> 
> 
> Testing
> -------
> 
> n/a
> 
> 
> Thanks,
> 
> Jie Yu
> 
>


Mime
  • Unnamed multipart/alternative (inline, None, 0 bytes)
View raw message