mesos-reviews mailing list archives

Site index · List index
Message view « Date » · « Thread »
Top « Date » · « Thread »
From Mesos Reviewbot Windows <revi...@mesos.apache.org>
Subject Re: Review Request 70022: Added master load tests to cmake build.
Date Wed, 20 Feb 2019 16:14:53 GMT

-----------------------------------------------------------
This is an automatically generated e-mail. To reply, visit:
https://reviews.apache.org/r/70022/#review212965
-----------------------------------------------------------



FAIL: Some of the unit tests failed. Please check the relevant logs.

Reviews applied: `['70022']`

Failed command: `Start-MesosCITesting`

All the build artifacts available at: http://dcos-win.westus2.cloudapp.azure.com/artifacts/mesos-reviewbot-testing/2905/mesos-review-70022

Relevant logs:

- [mesos-tests.log](http://dcos-win.westus2.cloudapp.azure.com/artifacts/mesos-reviewbot-testing/2905/mesos-review-70022/logs/mesos-tests.log):

```
I0220 16:14:37.835110 62832 exs-02.chtsmhjxogyevckjfayqqcnjda.xx.internal.cloudapp.net)
I0220 16:14:37.837096 56944 master.cpp:1269] Agent 0b0b215a-5b10-4a2c-aa79-e8cbf42c2a27-S0
at slave(494)@192.10.1.6:63731 (windows-02.chtsmhjxogyevckjfayqqcnjda.xx.internal.cloudapp.net)
disconnected
I0220 16:14:37.837096 56944 master.cpp:3292] Disconnecting agent 0b0b215a-5b10-4a2c-aa79-e8cbf42c2a27-S0
at slave(494)@192.10.1.6:63731 (windows-02.chtsmhjxogyevckjfayqqcnjda.xx.internal.cloudapp.net)
I0220 16:14:37.838090 56944 master.cpp:3311] Deactivating agent 0b0b215a-5b10-4a2c-aa79-e8cbf42c2a27-S0
at slave(494)@192.10.1.6:63731 (windows-02.chtsmhjxogyevckjfayqqcnjda.xx.internal.cloudapp.net)
I0220 16:14:37.838090 59812 hierarchical.cpp:390] Removed framework 0b0b215a-5b10-4a2c-aa79-e8cbf42c2a27-0000
I0220 16:14:37.839107 59812 hierarchical.cpp:827] Agent 0b0b215a-5b10-4a2c-aa79-e8cbf42c2a27-S0
deactivated
I0220 16:14:37.839107 53016 containerizer.cpp:2526] Destroying container 6653a428-873d-4806-bef3-c32360571221
in RUNNING state
I0220 16:14:37.83910[       OK ] IsolationFlag/MemoryIsolatorTest.ROOT_MemUsage/0 (688 ms)
[----------] 1 test from IsolationFlag/MemoryIsolatorTest (706 ms total)

[----------] Global test environment tear-down
[==========] 1115 tests from 106 test cases ran. (528793 ms total)
[  PASSED  ] 1114 tests.
[  FAILED  ] 1 test, listed below:
[  FAILED  ] DockerFetcherPluginTest.INTERNET_CURL_FetchImage

 1 FAILED TEST
  YOU HAVE 232 DISABLED TESTS

7 53016 containerizer.cpp:3193] Transitioning the state of container 6653a428-873d-4806-bef3-c32360571221
from RUNNING to DESTROYING
I0220 16:14:37.839107 53016 launcher.cpp:161] Asked to destroy container 6653a428-873d-4806-bef3-c32360571221
W0220 16:14:37.841102 61416 process.cpp:1423] Failed to recv on socket WindowsFD::Type::SOCKET=1048
to peer '192.10.1.6:49660': IO failed with error code: The specified network name is no longer
available.

W0220 16:14:37.841102 61416 process.cpp:838] Failed to recv on socket WindowsFD::Type::SOCKET=5000
to peer '192.10.1.6:49661': IO failed with error code: The specified network name is no longer
available.

I0220 16:14:37.919109 59812 containerizer.cpp:3032] Container 6653a428-873d-4806-bef3-c32360571221
has exited
I0220 16:14:37.947103 61856 master.cpp:1109] Master terminating
I0220 16:14:37.948092 62688 hierarchical.cpp:678] Removed agent 0b0b215a-5b10-4a2c-aa79-e8cbf42c2a27-S0
I0220 16:14:38.706096 61416 process.cpp:927] Stopped the socket accept loop
```

- Mesos Reviewbot Windows


On Feb. 20, 2019, 3:06 p.m., Benno Evers wrote:
> 
> -----------------------------------------------------------
> This is an automatically generated e-mail. To reply, visit:
> https://reviews.apache.org/r/70022/
> -----------------------------------------------------------
> 
> (Updated Feb. 20, 2019, 3:06 p.m.)
> 
> 
> Review request for mesos and Benjamin Bannier.
> 
> 
> Repository: mesos
> 
> 
> Description
> -------
> 
> This patch adds `master_load_tests.cpp` to the cmake build
> system.
> 
> 
> Diffs
> -----
> 
>   src/tests/CMakeLists.txt b647d5b2b2273e0ba77accf2b213dc07ce34f399 
> 
> 
> Diff: https://reviews.apache.org/r/70022/diff/1/
> 
> 
> Testing
> -------
> 
> CI run still in progress.
> 
> 
> Thanks,
> 
> Benno Evers
> 
>


Mime
  • Unnamed multipart/alternative (inline, None, 0 bytes)
View raw message