mesos-reviews mailing list archives

Site index · List index
Message view « Date » · « Thread »
Top « Date » · « Thread »
From Mesos Reviewbot Windows <revi...@mesos.apache.org>
Subject Re: Review Request 69869: [WIP] Added test for tearing down frameworks while creating disks.
Date Thu, 31 Jan 2019 02:43:08 GMT

-----------------------------------------------------------
This is an automatically generated e-mail. To reply, visit:
https://reviews.apache.org/r/69869/#review212472
-----------------------------------------------------------



FAIL: Some of the unit tests failed. Please check the relevant logs.

Reviews applied: `['69869']`

Failed command: `Start-MesosCITesting`

All the build artifacts available at: http://dcos-win.westus2.cloudapp.azure.com/artifacts/mesos-reviewbot-testing/2837/mesos-review-69869

Relevant logs:

- [mesos-tests.log](http://dcos-win.westus2.cloudapp.azure.com/artifacts/mesos-reviewbot-testing/2837/mesos-review-69869/logs/mesos-tests.log):

```
W0131 02:42:53.282217 27312 slave.cpp:3934] Ignoring shutdown framework 4f25b998-2b3d-46b6-92d8-f59210e156af-0000
because it is terminating
I0131 02:42:53.284219 27700 master.cpp:1269] Agent 4f25b998-2b3d-46b6-92d8-f59210e156af-S0
at slave(478)@192.10.1.6:59648 (windows-02.chtsmhjxogyevckjfayqqcnjda.xx.internal.cloudapp.net)
disconnected
I0131 02:42:53.284219 27700 master.cpp:3272] Disconnecting agent 4f25b998-2b3d-46b6-92d8-f59210e156af-S0
at slave(478)@192.10.1.6:59648 (windows-02.chtsmhjxogyevckjfayqqcnjda.xx.internal.cloudapp.net)
I0131 02:42:53.284219 27700 master.cpp:3291] Deactivating agent 4f25b998-2b3d-46b6-92d8-f59210e156af-S0
at slave(478)@192.10.1.6:59648 (windows-02.chtsmhjxogyevckjfayqqcnjda.xx.internal.cloudapp.net)
I0131 02:42:53.284219 27524 hierarchical.cpp:358] Removed framework 4f25b998-2b3d-46b6-92d8-f59210e156af-0000
I0131 02:42:53.285212 27524 hierarchical.cpp:793] Agent 4f25b998-2b3d-46b6-92d8-f59210e156af-S0
deactivated
I0131 02:42:53.286213 27504 containerizer.cpp:2477] Destroying container 60d4eba9-ceae-4c21-bd7e-755ddb5d1605
in RUNNING state
I0131 02:42:53.286213 27504 containerizer.cpp:3144] Transitioning the state of container 60d4eba9-ceae-4c21-bd7e-755ddb5d1605
from RUNNING to DESTROYING
I0131 02:42:53.287214 27504 launcher.cpp:161] Asked to destroy container 60d4eba9-ceae-4c21-bd7e-755ddb5d1605
W0131 02:42:53.288219 26296 process.cpp:838] Failed to recv on socket WindowsFD::Type::SOCKET=6384
to peer '192.10.1.6:61562': IO failed with error code: The specified network name is no longer
available.

W0131 02:42:53.288219 26296 process.cpp:1423] Failed to recv on socket WindowsFD::Type::SOCKET=6528
to peer '192.10.1.6:61561': IO failed with error code: The specified network name is no longer
available.

I0131 02:42:53.363895 27700 containerizer.cpp:2983] Container 60d4eba9-ceae-4c21-bd7e-755ddb5d1605
has exited
I0131 02:42:53.392890 26164 master.cpp:1109] Master terminating
I0131 02:42:53.394879 27504 hierarchical.cpp:644] Removed agent 4f25b99[       OK ] IsolationFlag/MemoryIsolatorTest.ROOT_MemUsage/0
(686 ms)
[----------] 1 test from IsolationFlag/MemoryIsolatorTest (703 ms total)

[----------] Global test environment tear-down
[==========] 1096 tests from 104 test cases ran. (519202 ms total)
[  PASSED  ] 1095 tests.
[  FAILED  ] 1 test, listed below:
[  FAILED  ] SlaveTest.FrameworkTeardownBeforeTerminalOperationStatusUpdate

 1 FAILED TEST
  YOU HAVE 231 DISABLED TESTS

8-2b3d-46b6-92d8-f59210e156af-S0
I0131 02:42:53.800878 26296 process.cpp:927] Stopped the socket accept loop
```

- Mesos Reviewbot Windows


On Jan. 31, 2019, 1:38 a.m., Joseph Wu wrote:
> 
> -----------------------------------------------------------
> This is an automatically generated e-mail. To reply, visit:
> https://reviews.apache.org/r/69869/
> -----------------------------------------------------------
> 
> (Updated Jan. 31, 2019, 1:38 a.m.)
> 
> 
> Review request for mesos, Benno Evers, Gastón Kleiman, and Greg Mann.
> 
> 
> Bugs: MESOS-9542
>     https://issues.apache.org/jira/browse/MESOS-9542
> 
> 
> Repository: mesos
> 
> 
> Description
> -------
> 
> The CREATE_DISK and DESTROY_DISK operations are "non-speculative"
> operations, which means the master must wait for the operations to
> complete successfully before the master can update its resources.
> Because the master must wait to update the results of non-speculative
> operations, it is possible for the framework making the
> CREATE/DESTROY_DISK to be torn down before the operation completes.
> 
> This commit adds a test to make sure the master can gracefully handle
> such a case.
> 
> 
> Diffs
> -----
> 
>   src/tests/slave_tests.cpp 22a0295086ae4f4ec26df00a0e077eecfa27f1fb 
> 
> 
> Diff: https://reviews.apache.org/r/69869/diff/1/
> 
> 
> Testing
> -------
> 
> The test does not currently pass, as it is meant to be a regression
> test for MESOS-9542 (a bug which has not been started yet).
> 
> src/mesos-tests --gtest_filter="SlaveTest.FrameworkTeardownBeforeTerminalOperationStatusUpdate"
--verbose
> 
> 
> Thanks,
> 
> Joseph Wu
> 
>


Mime
  • Unnamed multipart/alternative (inline, None, 0 bytes)
View raw message