mesos-reviews mailing list archives

Site index · List index
Message view « Date » · « Thread »
Top « Date » · « Thread »
From Mesos Reviewbot Windows <revi...@mesos.apache.org>
Subject Re: Review Request 69474: Added tests for agent/executor heartbeating.
Date Tue, 11 Dec 2018 02:37:31 GMT

-----------------------------------------------------------
This is an automatically generated e-mail. To reply, visit:
https://reviews.apache.org/r/69474/#review211182
-----------------------------------------------------------



FAIL: Some of the unit tests failed. Please check the relevant logs.

Reviews applied: `['69463', '69472', '69473', '69474']`

Failed command: `Start-MesosCITesting`

All the build artifacts available at: http://dcos-win.westus2.cloudapp.azure.com/artifacts/mesos-reviewbot-testing/2693/mesos-review-69474

Relevant logs:

- [mesos-tests.log](http://dcos-win.westus2.cloudapp.azure.com/artifacts/mesos-reviewbot-testing/2693/mesos-review-69474/logs/mesos-tests.log):

```
I1211 02:37:15.163028  7732 executor.cpp:922] Sending SIGTERM to process tree at pid 96602:37:15.163028
 1584 master.cpp:11065] Removing task f673b950-c557-427d-8dce-9b9a97035501 with resources
cpus(allocated: *):4; mem(allocated: *):2048; disk(allocated: *):1024; ports(allocated: *):[31000-32000]
of framework 6c9fcc20-eac8-4e6c-90e1-b79a795de9a7-0000 on agent 6c9fcc20-eac8-4e6c-90e1-b79a795de9a7-S0
at slave(463)@192.10.1.4:64631 (windows-01.chtsmhjxogyevckjfayqqcnjda.xx.internal.cloudapp.net)
I1211 02:37:15.166033  1584 master.cpp:1277] Agent 6c9fcc20-eac8-4e6c-90e1-b79a795de9a7-S0
at slave(463)@192.10.1.4:64631 (windows-01.chtsmhjxogyevckjfayqqcnjda.xx.internal.cloudapp.net)
disconnected
I1211 02:37:15.166033  1584 master.cpp:3280] Disconnecting agent 6c9fcc20-eac8-4e6c-90e1-b79a795de9a7-S0
at slave(463)@192.10.1.4:64631 (windows-01.chtsmhjxogyevckjfayqqcnjda.xx.internal.cloudapp.net)
I1211 02:37:15.166033  1584 master.cpp:3299] Deactivating agent 6c9fcc20-eac8-4e6c-90e1-b79a795de9a7-S0
at slave(463)@192.10.1.4:64631 (windows-01.chtsmhjxogyevckjfayqqcnjda.xx.internal.cloudapp.net)
I1211 02:37:15.167024 13936 hierarchical.cpp:357] Removed framework 6c9fcc20-eac8-4e6c-90e1-b79a795de9a7-0000
I1211 02:37:15.167024 13936 hierarchical.cpp:801] Agent 6c9fcc20-eac8-4e6c-90e1-b79a795de9a7-S0
deactivated
I1211 02:37:15.167024  6600 containerizer.cpp:2463] Destroying container 7346239a-02a5-4f0a-bc21-bcb693639e96
in RUNNING state
I1211 02:37:15.168032  6600 containerizer.cpp:3130] Transitioning the state of container 7346239a-02a5-4f0a-bc21-bcb693639e96
from RUNNING to DESTROYING
I1211 02:37:15.168032  6600 launcher.cpp:161] Asked to destroy container 7346239a-02a5-4f0a-bc21-bcb693639e96
W1211 02:37:15.170037 13532 process.cpp:1423] Failed to recv on socket WindowsFD::Type::SOCKET=8552
to peer '192.10.1.4:50078': IO failed with error code: The specified network name is no longer
available.

W1211 02:37:15.170037 13532 process.cpp:838] Failed to recv on socket WindowsFD::Type::SOCKET=9144
to peer '192.10.1.4:50079': IO failed with error code: The specified network name is no longer
available.

I1211 02:37:15.[       OK ] IsolationFlag/MemoryIsolatorTest.ROOT_MemUsage/0 (682 ms)
[----------] 1 test from IsolationFlag/MemoryIsolatorTest (705 ms total)

[----------] Global test environment tear-down
[==========] 1060 tests from 104 test cases ran. (561735 ms total)
[  PASSED  ] 1059 tests.
[  FAILED  ] 1 test, listed below:
[  FAILED  ] DockerFetcherPluginTest.INTERNET_CURL_InvokeFetchByName

 1 FAILED TEST
  YOU HAVE 231 DISABLED TESTS

194044  1584 containerizer.cpp:2969] Container 7346239a-02a5-4f0a-bc21-bcb693639e96 has exited
I1211 02:37:15.224057 14100 master.cpp:1117] Master terminating
I1211 02:37:15.225041 13176 hierarchical.cpp:643] Removed agent 6c9fcc20-eac8-4e6c-90e1-b79a795de9a7-S0
I1211 02:37:15.529048 13532 process.cpp:927] Stopped the socket accept loop
```

- Mesos Reviewbot Windows


On Dec. 10, 2018, 5:20 p.m., Joseph Wu wrote:
> 
> -----------------------------------------------------------
> This is an automatically generated e-mail. To reply, visit:
> https://reviews.apache.org/r/69474/
> -----------------------------------------------------------
> 
> (Updated Dec. 10, 2018, 5:20 p.m.)
> 
> 
> Review request for mesos, Benno Evers, Gastón Kleiman, and Greg Mann.
> 
> 
> Bugs: MESOS-7564
>     https://issues.apache.org/jira/browse/MESOS-7564
> 
> 
> Repository: mesos
> 
> 
> Description
> -------
> 
> This adds two separate tests which check if the Agent sends heartbeats
> to HTTP executors, and if the HTTP executor driver sends heartbeats
> to the agent.
> 
> 
> Diffs
> -----
> 
>   src/examples/long_lived_executor.cpp b87a8069892b3886329581e86ed15072dd785b3d 
>   src/examples/test_http_executor.cpp e5f7cbb3b4e35663717f2a74550f8378bfafb0f9 
>   src/tests/executor_http_api_tests.cpp a635e1a3c228b52f47ba81a67753ea49ce092143 
>   src/tests/mesos.hpp b57bbd40051fed0829453c56b90f5660354f4334 
> 
> 
> Diff: https://reviews.apache.org/r/69474/diff/6/
> 
> 
> Testing
> -------
> 
> ```
> cmake --build . --target check
> src/mesos-tests --gtest_filter="*Heartbeat*" --verbose --gtest_repeat=-1 --gtest_break_on_failure
> ```
> 
> 
> Thanks,
> 
> Joseph Wu
> 
>


Mime
  • Unnamed multipart/alternative (inline, None, 0 bytes)
View raw message