mesos-reviews mailing list archives

Site index · List index
Message view « Date » · « Thread »
Top « Date » · « Thread »
From Mesos Reviewbot Windows <revi...@mesos.apache.org>
Subject Re: Review Request 69236: Fixed a coding error that a test waited on a wrong task status update.
Date Thu, 01 Nov 2018 23:04:10 GMT

-----------------------------------------------------------
This is an automatically generated e-mail. To reply, visit:
https://reviews.apache.org/r/69236/#review210267
-----------------------------------------------------------



FAIL: Some of the unit tests failed. Please check the relevant logs.

Reviews applied: `['69234', '69235', '69236']`

Failed command: `Start-MesosCITesting`

All the build artifacts available at: http://dcos-win.westus2.cloudapp.azure.com/artifacts/mesos-reviewbot-testing/2562/mesos-review-69236

Relevant logs:

- [mesos-tests.log](http://dcos-win.westus2.cloudapp.azure.com/artifacts/mesos-reviewbot-testing/2562/mesos-review-69236/logs/mesos-tests.log):

```
I1101 23:03:57.538496 12472 master.cpp:1273] Agent 3085d9bf-b40e-4de7-88af-f5cd54a6766e-S0
at slave(461)@192.10.1.5:62559 (windows-02.aa0q4n2kgcyefckmv0xukjvy4f.xx.internal.cloudapp.net)
disconnected
I1101 23:03:57.538496 12472 master.cpp:3289] Disconnecting agent 3085d9bf-b40e-4de7-88af-f5cd54a6766e-S0
at slave(461)@192.10.1.5:62559 (windows-02.aa0q4n2kgcyefckmv0xukjvy4f.xx.internal.cloudapp.net)
I1101 23:03:57.538496 14928 hierarchical.cpp:357] Removed framework 3085d9bf-b40e-4de7-88af-f5cd54a6766e-0000
I1101 23:03:57.538496 12472 master.cpp:3308] Deactivating agent 3085d9bf-b40e-4de7-88af-f5cd54a6766e-S0
at slave(461)@192.10.1.5:62559 (windows-02.aa0q4n2kgcyefckmv0xukjvy4f.xx.internal.cloudapp.net)
I1101 23:03:57.538496 12876 hierarchical.cpp:801] Agent 3085d9bf-b40e-4de7-88af-f5cd54a6766e-S0
deactivated
I1101 23:03:57.540508 12876 containerizer.cpp:2467] Destroying container 5937d1d7-64a6-45f7-b7b4-170445c4e22f
in RUNNING state
I1101 23:03:57.540508 12876 containerizer.cpp:3134] Transitioning the state of container 5937d1d7-64a6-45f7-b7b4-170445c4e22f
from RUNNING to DESTROYING
I1101 23:03:57.540508 12876 launcher.cpp:166] Asked to destroy container 5937d1d7-64a6-45f7-b7b4-170445c4e22f
W1101 23:03:57.541486 10536 process.cpp:1423] Failed to recv on socket WindowsFD::Type::SOCKET=4120
to peer '192.10.1.5:64357': IO fai[       OK ] IsolationFlag/MemoryIsolatorTest.ROOT_MemUsage/0
(580 ms)
[----------] 1 test from IsolationFlag/MemoryIsolatorTest (598 ms total)

[----------] Global test environment tear-down
[==========] 1053 tests from 103 test cases ran. (489158 ms total)
[  PASSED  ] 1051 tests.
[  FAILED  ] 2 tests, listed below:
[  FAILED  ] DockerFetcherPluginTest.INTERNET_CURL_FetchBlob
[  FAILED  ] DockerFetcherPluginTest.INTERNET_CURL_InvokeFetchByName

 2 FAILED TESTS
  YOU HAVE 231 DISABLED TESTS

led with error code: The specified network name is no longer available.

W1101 23:03:57.542479 10536 process.cpp:838] Failed to recv on socket WindowsFD::Type::SOCKET=5076
to peer '192.10.1.5:64358': IO failed with error code: The specified network name is no longer
available.

I1101 23:03:57.555501 11836 containerizer.cpp:2973] Container 5937d1d7-64a6-45f7-b7b4-170445c4e22f
has exited
I1101 23:03:57.584530 10080 master.cpp:1115] Master terminating
I1101 23:03:57.585494 12596 hierarchical.cpp:643] Removed agent 3085d9bf-b40e-4de7-88af-f5cd54a6766e-S0
I1101 23:03:57.891475 10536 process.cpp:927] Stopped the socket accept loop
```

- Mesos Reviewbot Windows


On Nov. 1, 2018, 10:29 p.m., Qian Zhang wrote:
> 
> -----------------------------------------------------------
> This is an automatically generated e-mail. To reply, visit:
> https://reviews.apache.org/r/69236/
> -----------------------------------------------------------
> 
> (Updated Nov. 1, 2018, 10:29 p.m.)
> 
> 
> Review request for mesos and Gilbert Song.
> 
> 
> Bugs: MESOS-9332
>     https://issues.apache.org/jira/browse/MESOS-9332
> 
> 
> Repository: mesos
> 
> 
> Description
> -------
> 
> Fixed a coding error that a test waited on a wrong task status update.
> 
> 
> Diffs
> -----
> 
>   src/tests/health_check_tests.cpp da64dc2b4de6e1526628522af34ee83b8ef9f469 
> 
> 
> Diff: https://reviews.apache.org/r/69236/diff/1/
> 
> 
> Testing
> -------
> 
> sudo make check
> 
> 
> Thanks,
> 
> Qian Zhang
> 
>


Mime
  • Unnamed multipart/alternative (inline, None, 0 bytes)
View raw message