mesos-reviews mailing list archives

Site index · List index
Message view « Date » · « Thread »
Top « Date » · « Thread »
From Mesos Reviewbot Windows <revi...@mesos.apache.org>
Subject Re: Review Request 68537: Cleaned up some style issues in `ReadOnlyHandler`.
Date Tue, 28 Aug 2018 10:57:25 GMT

-----------------------------------------------------------
This is an automatically generated e-mail. To reply, visit:
https://reviews.apache.org/r/68537/#review208027
-----------------------------------------------------------



FAIL: Some of the unit tests failed. Please check the relevant logs.

Reviews applied: `['68321', '68440', '68441', '68442', '68473', '68537']`

Failed command: `Start-MesosCITesting`

All the build artifacts available at: http://dcos-win.westus.cloudapp.azure.com/artifacts/mesos-reviewbot-testing/2248/mesos-review-68537

Relevant logs:

- [mesos-tests-cmake.log](http://dcos-win.westus.cloudapp.azure.com/artifacts/mesos-reviewbot-testing/2248/mesos-review-68537/logs/mesos-tests-cmake.log):

```
         d:\dcos\mesos\3rdparty\zookeeper-3.4.8\src\zookeeper-3.4.8\src\c\src\recordio.c(170):
warning C4267: '=': conversion from 'size_t' to 'int32_t', possible loss of data [D:\DCOS\mesos\3rdparty\zookeeper-3.4.8\src\zookeeper-3.4.8-build\zookeeper.vcxproj]
[D:\DCOS\mesos\3rdparty\zookeeper-3.4.8.vcxproj]
         d:\dcos\mesos\3rdparty\zookeeper-3.4.8\src\zookeeper-3.4.8\src\c\src\mt_adaptor.c(496):
warning C4244: '=': conversion from 'time_t' to 'int32_t', possible loss of data [D:\DCOS\mesos\3rdparty\zookeeper-3.4.8\src\zookeeper-3.4.8-build\zookeeper.vcxproj]
[D:\DCOS\mesos\3rdparty\zookeeper-3.4.8.vcxproj]
         d:\dcos\mesos\3rdparty\zookeeper-3.4.8\src\zookeeper-3.4.8\src\c\src\winport.c(256):
warning C4090: 'function': different 'const' qualifiers [D:\DCOS\mesos\3rdparty\zookeeper-3.4.8\src\zookeeper-3.4.8-build\zookeeper.vcxproj]
[D:\DCOS\mesos\3rdparty\zookeeper-3.4.8.vcxproj]
         d:\dcos\mesos\3rdparty\zookeeper-3.4.8\src\zookeeper-3.4.8\src\c\src\winport.c(166):
warning C4716: 'pthread_cond_broadcast': must return a value [D:\DCOS\mesos\3rdparty\zookeeper-3.4.8\src\zookeeper-3.4.8-build\zookeeper.vcxproj]
[D:\DCOS\mesos\3rdparty\zookeeper-3.4.8.vcxproj]
         d:\dcos\mesos\3rdparty\zookeeper-3.4.8\src\zookeeper-3.4.8\src\c\src\winport.c(205):
warning C4716: 'pthread_cond_wait': must return a value [D:\DCOS\mesos\3rdparty\zookeeper-3.4.8\src\zookeeper-3.4.8-build\zookeeper.vcxproj]
[D:\DCOS\mesos\3rdparty\zookeeper-3.4.8.vcxproj]
         d:\dcos\mesos\3rdparty\zookeeper-3.4.8\src\zookeeper-3.4.8\src\c\src\cli.c(124):
warning C4996: 'fopen': This function or variable may be unsafe. Consider using fopen_s instead.
To disable deprecation, use _CRT_SECURE_NO_WARNINGS. See online help for details. [D:\DCOS\mesos\3rdparty\zookeeper-3.4.8\src\zookeeper-3.4.8-build\cli.vcxproj]
[D:\DCOS\mesos\3rdparty\zookeeper-3.4.8.vcxproj]
         d:\dcos\mesos\3rdparty\zookeeper-3.4.8\src\zookeeper-3.4.8\src\c\src\cli.c(128):
warning C4267: 'initializing': conversion from 'size_t' to 'int', possible loss of data [D:\DCOS\mesos\3rdparty\zookeeper-3.4.8\src\zookeeper-3.4.8-build\cli.vcxproj]
[D:\DCOS\mesos\3rdparty\zookeeper-3.4.8.vcxproj]
         d:\dcos\mesos\3rdparty\zookeeper-3.4.8\src\zookeeper-3.4.8\src\c\src\cli.c(279):
warning C4267: 'function': conversion from 'size_t' to 'int', possible loss of data [D:\DCOS\mesos\3rdparty\zookeeper-3.4.8\src\zookeeper-3.4.8-build\cli.vcxproj]
[D:\DCOS\mesos\3rdparty\zookeeper-3.4.8.vcxproj]
         d:\dcos\mesos\3rdparty\zookeeper-3.4.8\src\zookeeper-3.4.8\src\c\src\cli.c(301):
warning C4267: 'initializing': conversion from 'size_t' to 'int', possible loss of data [D:\DCOS\mesos\3rdparty\zookeeper-3.4.8\src\zookeeper-3.4.8-build\cli.vcxproj]
[D:\DCOS\mesos\3rdparty\zookeeper-3.4.8.vcxproj]
         d:\dcos\mesos\3rdparty\zookeeper-3.4.8\src\zookeeper-3.4.8\src\c\src\cli.c(368):
warning C4267: 'function': conversion from 'size_t' to 'int', possible loss of data [D:\DCOS\mesos\3rdparty\zookeeper-3.4.8\src\zookeeper-3.4.8-build\cli.vcxproj]
[D:\DCOS\mesos\3rdparty\zookeeper-3.4.8.vcxproj]
         d:\dcos\mesos\3rdparty\zookeeper-3.4.8\src\zookeeper-3.4.8\src\c\src\cli.c(372):
warning C4267: 'function': conversion from 'size_t' to 'int', possible loss of data [D:\DCOS\mesos\3rdparty\zookeeper-3.4.8\src\zookeeper-3.4.8-build\cli.vcxproj]
[D:\DCOS\mesos\3rdparty\zookeeper-3.4.8.vcxproj]
         d:\dcos\mesos\3rdparty\zookeeper-3.4.8\src\zookeeper-3.4.8\src\c\src\cli.c(512):
warning C4267: 'function': conversion from 'size_t' to 'int', possible loss of data [D:\DCOS\mesos\3rdparty\zookeeper-3.4.8\src\zookeeper-3.4.8-build\cli.vcxproj]
[D:\DCOS\mesos\3rdparty\zookeeper-3.4.8.vcxproj]
         d:\dcos\mesos\3rdparty\zookeeper-3.4.8\src\zookeeper-3.4.8\src\c\src\cli.c(543):
warning C4996: 'strcpy': This function or variable may be unsafe. Consider using strcpy_s
instead. To disable deprecation, use _CRT_SECURE_NO_WARNINGS. See online help for details.
[D:\DCOS\mesos\3rdparty\zookeeper-3.4.8\src\zookeeper-3.4.8-build\cli.vcxproj] [D:\DCOS\mesos\3rdparty\zookeeper-3.4.8.vcxproj]
         d:\dcos\mesos\3rdparty\zookeeper-3.4.8\src\zookeeper-3.4.8\src\c\src\cli.c(548):
warning C4996: 'fopen': This function or variable may be unsafe. Consider using fopen_s instead.
To disable deprecation, use _CRT_SECURE_NO_WARNINGS. See online help for details. [D:\DCOS\mesos\3rdparty\zookeeper-3.4.8\src\zookeeper-3.4.8-build\cli.vcxproj]
[D:\DCOS\mesos\3rdparty\zookeeper-3.4.8.vcxproj]
         d:\dcos\mesos\3rdparty\zookeeper-3.4.8\src\zookeeper-3.4.8\src\c\src\cli.c(569):
warning C4996: 'strcpy': This function or variable may be unsafe. Consider using strcpy_s
instead. To disable deprecation, use _CRT_SECURE_NO_WARNINGS. See online help for details.
[D:\DCOS\mesos\3rdparty\zookeeper-3.4.8\src\zookeeper-3.4.8-build\cli.vcxproj] [D:\DCOS\mesos\3rdparty\zookeeper-3.4.8.vcxproj]


       "D:\DCOS\mesos\src\tests\mesos-tests.vcxproj" (default target) (1) ->
       "D:\DCOS\mesos\src\mesos.vcxproj" (default target) (18) ->
       (ClCompile target) -> 
         d:\dcos\mesos\mesos\src\master\readonly_handler.cpp(649): error C3494: 'this' cannot
be explicitly captured because an enclosing capture mode does not allow it [D:\DCOS\mesos\src\mesos.vcxproj]
         d:\dcos\mesos\mesos\src\master\readonly_handler.cpp(651): error C3493: 'master' cannot
be implicitly captured because no default capture mode has been specified [D:\DCOS\mesos\src\mesos.vcxproj]
         d:\dcos\mesos\mesos\src\master\readonly_handler.cpp(667): error C3494: 'this' cannot
be explicitly captured because an enclosing capture mode does not allow it [D:\DCOS\mesos\src\mesos.vcxproj]
         d:\dcos\mesos\mesos\src\master\readonly_handler.cpp(669): error C3493: 'master' cannot
be implicitly captured because no default capture mode has been specified [D:\DCOS\mesos\src\mesos.vcxproj]

    172 Warning(s)
    4 Error(s)

Time Elapsed 00:08:11.62
```

- Mesos Reviewbot Windows


On Aug. 28, 2018, 12:51 p.m., Benno Evers wrote:
> 
> -----------------------------------------------------------
> This is an automatically generated e-mail. To reply, visit:
> https://reviews.apache.org/r/68537/
> -----------------------------------------------------------
> 
> (Updated Aug. 28, 2018, 12:51 p.m.)
> 
> 
> Review request for mesos and Alexander Rukletsov.
> 
> 
> Repository: mesos
> 
> 
> Description
> -------
> 
> This commit fixes several minor style issues:
>  - Sorted member function declarations of `ReadOnlyHandler`
>    alphabetically.
>  - Added notes to remind readers of the fact that requests
>    to certain endpoints are batched.
>  - Changed captured variable in `/frameworks` endpoint handler.
> 
> 
> Diffs
> -----
> 
>   src/master/master.hpp 1e01dab8b5160e0b69670c896cb5e9fc0bf31005 
>   src/master/readonly_handler.cpp PRE-CREATION 
> 
> 
> Diff: https://reviews.apache.org/r/68537/diff/1/
> 
> 
> Testing
> -------
> 
> Started Internal CI Run (Jenkins Id #4262)
> 
> 
> Thanks,
> 
> Benno Evers
> 
>


Mime
  • Unnamed multipart/alternative (inline, None, 0 bytes)
View raw message