mesos-reviews mailing list archives

Site index · List index
Message view « Date » · « Thread »
Top « Date » · « Thread »
From Mesos Reviewbot Windows <revi...@mesos.apache.org>
Subject Re: Review Request 68151: Avoided some expensive copies in the allocator.
Date Wed, 01 Aug 2018 22:38:06 GMT

-----------------------------------------------------------
This is an automatically generated e-mail. To reply, visit:
https://reviews.apache.org/r/68151/#review206766
-----------------------------------------------------------



FAIL: Some of the unit tests failed. Please check the relevant logs.

Reviews applied: `['68151']`

Failed command: `Start-MesosCITesting`

All the build artifacts available at: http://dcos-win.westus.cloudapp.azure.com/artifacts/mesos-reviewbot-testing/2023/mesos-review-68151

Relevant logs:

- [mesos-tests-stdout.log](http://dcos-win.westus.cloudapp.azure.com/artifacts/mesos-reviewbot-testing/2023/mesos-review-68151/logs/mesos-tests-stdout.log):

```
[       OK ] Endpoint/SlaveEndpointTest.NoAuthorizer/2 (99 ms)
[----------] 9 tests from Endpoint/SlaveEndpointTest (932 ms total)

[----------] 2 tests from ContainerizerType/DefaultContainerDNSFlagTest
[ RUN      ] ContainerizerType/DefaultContainerDNSFlagTest.ValidateFlag/0
[       OK ] ContainerizerType/DefaultContainerDNSFlagTest.ValidateFlag/0 (31 ms)
[ RUN      ] ContainerizerType/DefaultContainerDNSFlagTest.ValidateFlag/1
[       OK ] ContainerizerType/DefaultContainerDNSFlagTest.ValidateFlag/1 (37 ms)
[----------] 2 tests from ContainerizerType/DefaultContainerDNSFlagTest (70 ms total)

[----------] 1 test from IsolationFlag/CpuIsolatorTest
[ RUN      ] IsolationFlag/CpuIsolatorTest.ROOT_UserCpuUsage/0
[       OK ] IsolationFlag/CpuIsolatorTest.ROOT_UserCpuUsage/0 (999 ms)
[----------] 1 test from IsolationFlag/CpuIsolatorTest (1021 ms total)

[----------] 1 test from IsolationFlag/MemoryIsolatorTest
[ RUN      ] IsolationFlag/MemoryIsolatorTest.ROOT_MemUsage/0
[       OK ] IsolationFlag/MemoryIsolatorTest.ROOT_MemUsage/0 (1086 ms)
[----------] 1 test from IsolationFlag/MemoryIsolatorTest (1108 ms total)

[----------] Global test environment tear-down
[==========] 1013 tests from 98 test cases ran. (622443 ms total)
[  PASSED  ] 1012 tests.
[  FAILED  ] 1 test, listed below:
[  FAILED  ] DockerTest.ROOT_DOCKER_interface

 1 FAILED TEST
  YOU HAVE 222 DISABLED TESTS

```

- [mesos-tests-stderr.log](http://dcos-win.westus.cloudapp.azure.com/artifacts/mesos-reviewbot-testing/2023/mesos-review-68151/logs/mesos-tests-stderr.log):

```
I0801 22:37:47.888818  8100 master.cpp:10963] Updating the state of task 86470d5d-d6b9-40db-baad-1cb16fe3a013
of framework 58538642-c97c-42e0-a4a2-9586d2874172-0000 (latest state: TASK_KILLED, status
update state: TASK_KILLED)
I0801 22:37:47.888818  8732 slave.cpp:3939] Shutting down framework 58538642-c97c-42e0-a4a2-9586d2874172-0000
I0801 22:37:47.888818  8732 slave.cpp:6658] Shutting down executor '86470d5d-d6b9-40db-baad-1cb16fe3a013'
of framework 58538642-c97c-42e0-a4a2-9586d2874172-0000 at executor(1)@192.10.1.6:56035
I0801 22:37:47.890821  8100 master.cpp:11061] Removing task 86470d5d-d6b9-40db-baad-1cb16fe3a013
with resources cpus(allocated: *):4; mem(allocated: *):2048; disk(allocated: *):1024; ports(allocated:
*):[31000-32000] of framework 58538642-c97c-42e0-a4a2-9586d2874172-0000 on agent 58538I0801
22:37:47.659826 12204 exec.cpp:162] Version: 1.7.0
I0801 22:37:47.684813 10636 exec.cpp:236] Executor registered on agent 58538642-c97c-42e0-a4a2-9586d2874172-S0
I0801 22:37:47.688830 11628 executor.cpp:182] Received SUBSCRIBED event
I0801 22:37:47.693811 11628 executor.cpp:186] Subscribed executor on windows-02.enofukwu14ruplxn0gs3yzmsgf.xx.internal.cloudapp.net
I0801 22:37:47.693811 11628 executor.cpp:182] Received LAUNCH event
I0801 22:37:47.698812 11628 executor.cpp:679] Starting task 86470d5d-d6b9-40db-baad-1cb16fe3a013
I0801 22:37:47.780813 11628 executor.cpp:499] Running 'D:\DCOS\mesos\src\mesos-containerizer.exe
launch <POSSIBLY-SENSITIVE-DATA>'
I0801 22:37:47.861809 11628 executor.cpp:693] Forked command at 11188
I0801 22:37:47.890821  1720 exec.cpp:445] Executor asked to shutdown
I0801 22:37:47.891820 11628 executor.cpp:182] Received SHUTDOWN event
I0801 22:37:47.891820 11628 executor.cpp:796] Shutting down
I0801 22:37:47.891820 11628 executor.cpp:909] Sending SIGTERM to process tree at pid 11642-c97c-42e0-a4a2-9586d2874172-S0
at slave(462)@192.10.1.6:54329 (windows-02.enofukwu14ruplxn0gs3yzmsgf.xx.internal.cloudapp.net)
I0801 22:37:47.890821  8732 slave.cpp:931] Agent terminating
W0801 22:37:47.891820  8732 slave.cpp:3935] Ignoring shutdown framework 58538642-c97c-42e0-a4a2-9586d2874172-0000
because it is terminating
I0801 22:37:47.894819 10004 master.cpp:1338] Agent 58538642-c97c-42e0-a4a2-9586d2874172-S0
at slave(462)@192.10.1.6:54329 (windows-02.enofukwu14ruplxn0gs3yzmsgf.xx.internal.cloudapp.net)
disconnected
I0801 22:37:47.894819 10004 master.cpp:3354] Disconnecting agent 58538642-c97c-42e0-a4a2-9586d2874172-S0
at slave(462)@192.10.1.6:54329 (windows-02.enofukwu14ruplxn0gs3yzmsgf.xx.internal.cloudapp.net)
I0801 22:37:47.894819 10004 master.cpp:3373] Deactivating agent 58538642-c97c-42e0-a4a2-9586d2874172-S0
at slave(462)@192.10.1.6:54329 (windows-02.enofukwu14ruplxn0gs3yzmsgf.xx.internal.cloudapp.net)
I0801 22:37:47.895859  9848 hierarchical.cpp:359] Removed framework 58538642-c97c-42e0-a4a2-9586d2874172-0000
I0801 22:37:47.895859  9848 hierarchical.cpp:795] Agent 58538642-c97c-42e0-a4a2-9586d2874172-S0
deactivated
I0801 22:37:47.896833  1652 containerizer.cpp:2407] Destroying container 605c8ec8-1a68-44d8-b982-266afaef79a4
in RUNNING state
I0801 22:37:47.896833  1652 containerizer.cpp:3021] Transitioning the state of container 605c8ec8-1a68-44d8-b982-266afaef79a4
from RUNNING to DESTROYING
I0801 22:37:47.897824  1652 launcher.cpp:155] Asked to destroy container 605c8ec8-1a68-44d8-b982-266afaef79a4
I0801 22:37:47.938819  9848 containerizer.cpp:2860] Container 605c8ec8-1a68-44d8-b982-266afaef79a4
has exited
I0801 22:37:47.967834  9684 master.cpp:1180] Master terminating
I0801 22:37:47.970821  8100 hierarchical.cpp:637] Removed agent 58538642-c97c-42e0-a4a2-9586d2874172-S0
I0801 22:37:48.251823  7496 process.cpp:926] Stopped the socket accept loop
```

- Mesos Reviewbot Windows


On Aug. 1, 2018, 2:27 p.m., Meng Zhu wrote:
> 
> -----------------------------------------------------------
> This is an automatically generated e-mail. To reply, visit:
> https://reviews.apache.org/r/68151/
> -----------------------------------------------------------
> 
> (Updated Aug. 1, 2018, 2:27 p.m.)
> 
> 
> Review request for mesos and Benjamin Mahler.
> 
> 
> Repository: mesos
> 
> 
> Description
> -------
> 
> Avoided unnecessary copies from
> `sorter->allocation(string client)` calls.
> 
> 
> Diffs
> -----
> 
>   src/master/allocator/mesos/hierarchical.cpp 35992474eacb8b14ae57e1dc23307e1542f63cb5

> 
> 
> Diff: https://reviews.apache.org/r/68151/diff/2/
> 
> 
> Testing
> -------
> 
> make check
> 
> 
> Thanks,
> 
> Meng Zhu
> 
>


Mime
  • Unnamed multipart/alternative (inline, None, 0 bytes)
View raw message