mesos-reviews mailing list archives

Site index · List index
Message view « Date » · « Thread »
Top « Date » · « Thread »
From Mesos Reviewbot Windows <revi...@mesos.apache.org>
Subject Re: Review Request 67994: Extended log message for assertion.
Date Fri, 20 Jul 2018 08:15:41 GMT

-----------------------------------------------------------
This is an automatically generated e-mail. To reply, visit:
https://reviews.apache.org/r/67994/#review206266
-----------------------------------------------------------



FAIL: Some of the unit tests failed. Please check the relevant logs.

Reviews applied: `['67994']`

Failed command: `Start-MesosCITesting`

All the build artifacts available at: http://dcos-win.westus.cloudapp.azure.com/artifacts/mesos-reviewbot-testing/1962/mesos-review-67994

Relevant logs:

- [mesos-tests-stdout.log](http://dcos-win.westus.cloudapp.azure.com/artifacts/mesos-reviewbot-testing/1962/mesos-review-67994/logs/mesos-tests-stdout.log):

```
[       OK ] Endpoint/SlaveEndpointTest.NoAuthorizer/2 (105 ms)
[----------] 9 tests from Endpoint/SlaveEndpointTest (963 ms total)

[----------] 2 tests from ContainerizerType/DefaultContainerDNSFlagTest
[ RUN      ] ContainerizerType/DefaultContainerDNSFlagTest.ValidateFlag/0
[       OK ] ContainerizerType/DefaultContainerDNSFlagTest.ValidateFlag/0 (32 ms)
[ RUN      ] ContainerizerType/DefaultContainerDNSFlagTest.ValidateFlag/1
[       OK ] ContainerizerType/DefaultContainerDNSFlagTest.ValidateFlag/1 (38 ms)
[----------] 2 tests from ContainerizerType/DefaultContainerDNSFlagTest (73 ms total)

[----------] 1 test from IsolationFlag/CpuIsolatorTest
[ RUN      ] IsolationFlag/CpuIsolatorTest.ROOT_UserCpuUsage/0
[       OK ] IsolationFlag/CpuIsolatorTest.ROOT_UserCpuUsage/0 (650 ms)
[----------] 1 test from IsolationFlag/CpuIsolatorTest (674 ms total)

[----------] 1 test from IsolationFlag/MemoryIsolatorTest
[ RUN      ] IsolationFlag/MemoryIsolatorTest.ROOT_MemUsage/0
[       OK ] IsolationFlag/MemoryIsolatorTest.ROOT_MemUsage/0 (779 ms)
[----------] 1 test from IsolationFlag/MemoryIsolatorTest (802 ms total)

[----------] Global test environment tear-down
[==========] 1012 tests from 98 test cases ran. (560531 ms total)
[  PASSED  ] 1011 tests.
[  FAILED  ] 1 test, listed below:
[  FAILED  ] CommandExecutorCheckTest.CommandCheckTimeout

 1 FAILED TEST
  YOU HAVE 222 DISABLED TESTS

```

- [mesos-tests-stderr.log](http://dcos-win.westus.cloudapp.azure.com/artifacts/mesos-reviewbot-testing/1962/mesos-review-67994/logs/mesos-tests-stderr.log):

```
I0720 08:15:23.196698 14984 slave.cpp:3939] Shutting down framework d74fa897-04e0-40f0-86ae-4f9d7427637d-0000
I0720 08:15:23.196698 17492 master.cpp:10917] Updating the state of task 81f816cc-2aeb-4d62-b7fc-062109e50fad
of framework d74fa897-04e0-40f0-86ae-4f9d7427637d-0000 (latest state: TASK_KILLED, status
update state: TASK_KILLED)
I0720 08:15:23.197832 14984 slave.cpp:6658] Shutting down executor '81f816cc-2aeb-4d62-b7fc-062109e50fad'
of framework d74fa897-04e0-40f0-86ae-4f9d7427637d-0000 at executor(1)@192.10.1.5:56078
I0720 08:15:23.199687 14984 slave.cpp:931] Agent terminating
I0720 08:15:23.199687 17492 master.cpp:11016] Removing task 81f816cc-2aeb-4d62-b7fc-062109e50fad
with resources cpus(allocated: *):4; mem(allocated: *):2048; disk(allocated: *):1024; ports(allocated:
*):[31000-32000] of framework d74fa897-04e0-40f0-86ae-4f9d7427637d-0000 on agent d74fa897-04e0-40f0-86ae-4f9d7427637d-S0
at slave(462)@192.10.1.5:54366 (windows-01.enofukwu14ruplxn0gs3yzmsgf.xx.internal.cloudapp.I0720
08:15:23.018679 18724 exec.cpp:162] Version: 1.7.0
I0720 08:15:23.044675 18632 exec.cpp:236] Executor registered on agent d74fa897-04e0-40f0-86ae-4f9d7427637d-S0
I0720 08:15:23.049669  6484 executor.cpp:182] Received SUBSCRIBED event
I0720 08:15:23.054677  6484 executor.cpp:186] Subscribed executor on windows-01.enofukwu14ruplxn0gs3yzmsgf.xx.internal.cloudapp.net
I0720 08:15:23.054677  6484 executor.cpp:182] Received LAUNCH event
I0720 08:15:23.059684  6484 executor.cpp:679] Starting task 81f816cc-2aeb-4d62-b7fc-062109e50fad
I0720 08:15:23.142678  6484 executor.cpp:499] Running 'D:\DCOS\mesos\src\mesos-containerizer.exe
launch <POSSIBLY-SENSITIVE-DATA>'
I0720 08:15:23.155689  6484 executor.cpp:693] Forked command at 15900
I0720 08:15:23.200686 19196 exec.cpp:445] Executor asked to shutdown
I0720 08:15:23.201696  6484 executor.cpp:182] Received SHUTDOWN event
I0720 08:15:23.201696  6484 executor.cpp:796] Shutting down
I0720 08:15:23.201696  6484 executor.cpp:909] Sending SIGTERM to process tree at pid 15net)
W0720 08:15:23.200686 14984 slave.cpp:3935] Ignoring shutdown framework d74fa897-04e0-40f0-86ae-4f9d7427637d-0000
because it is terminating
I0720 08:15:23.204685 17492 master.cpp:1330] Agent d74fa897-04e0-40f0-86ae-4f9d7427637d-S0
at slave(462)@192.10.1.5:54366 (windows-01.enofukwu14ruplxn0gs3yzmsgf.xx.internal.cloudapp.net)
disconnected
I0720 08:15:23.204685 17492 master.cpp:3340] Disconnecting agent d74fa897-04e0-40f0-86ae-4f9d7427637d-S0
at slave(462)@192.10.1.5:54366 (windows-01.enofukwu14ruplxn0gs3yzmsgf.xx.internal.cloudapp.net)
I0720 08:15:23.204685 17492 master.cpp:3359] Deactivating agent d74fa897-04e0-40f0-86ae-4f9d7427637d-S0
at slave(462)@192.10.1.5:54366 (windows-01.enofukwu14ruplxn0gs3yzmsgf.xx.internal.cloudapp.net)
I0720 08:15:23.204685 15756 hierarchical.cpp:346] Removed framework d74fa897-04e0-40f0-86ae-4f9d7427637d-0000
I0720 08:15:23.205680 15756 hierarchical.cpp:769] Agent d74fa897-04e0-40f0-86ae-4f9d7427637d-S0
deactivated
I0720 08:15:23.205680 11848 containerizer.cpp:2408] Destroying container 5b27809c-0994-45e9-abc1-47dfec5aaadd
in RUNNING state
I0720 08:15:23.206687 11848 containerizer.cpp:3022] Transitioning the state of container 5b27809c-0994-45e9-abc1-47dfec5aaadd
from RUNNING to DESTROYING
I0720 08:15:23.206687 11848 launcher.cpp:155] Asked to destroy container 5b27809c-0994-45e9-abc1-47dfec5aaadd
I0720 08:15:23.296736 14984 containerizer.cpp:2861] Container 5b27809c-0994-45e9-abc1-47dfec5aaadd
has exited
I0720 08:15:23.325875  4724 master.cpp:1172] Master terminating
I0720 08:15:23.327750 16184 hierarchical.cpp:612] Removed agent d74fa897-04e0-40f0-86ae-4f9d7427637d-S0
I0720 08:15:23.706753 17720 process.cpp:926] Stopped the socket accept loop
```

- Mesos Reviewbot Windows


On July 20, 2018, 3:01 p.m., Benjamin Bannier wrote:
> 
> -----------------------------------------------------------
> This is an automatically generated e-mail. To reply, visit:
> https://reviews.apache.org/r/67994/
> -----------------------------------------------------------
> 
> (Updated July 20, 2018, 3:01 p.m.)
> 
> 
> Review request for mesos, Gilbert Song and Jie Yu.
> 
> 
> Repository: mesos
> 
> 
> Description
> -------
> 
> Extended log message for assertion.
> 
> 
> Diffs
> -----
> 
>   src/slave/containerizer/mesos/containerizer.cpp 98129d006cda9b65804b518619b6addc8990410a

> 
> 
> Diff: https://reviews.apache.org/r/67994/diff/1/
> 
> 
> Testing
> -------
> 
> `make check`
> 
> 
> Thanks,
> 
> Benjamin Bannier
> 
>


Mime
  • Unnamed multipart/alternative (inline, None, 0 bytes)
View raw message