mesos-reviews mailing list archives

Site index · List index
Message view « Date » · « Thread »
Top « Date » · « Thread »
From Mesos Reviewbot Windows <revi...@mesos.apache.org>
Subject Re: Review Request 67318: Updated python.m4 to be compatible with Python 3.
Date Fri, 25 May 2018 10:46:26 GMT

-----------------------------------------------------------
This is an automatically generated e-mail. To reply, visit:
https://reviews.apache.org/r/67318/#review203858
-----------------------------------------------------------



FAIL: Some of the unit tests failed. Please check the relevant logs.

Reviews applied: `['67318']`

Failed command: `Start-MesosCITesting`

All the build artifacts available at: http://dcos-win.westus.cloudapp.azure.com/mesos-build/review/67318

Relevant logs:

- [mesos-tests-stdout.log](http://dcos-win.westus.cloudapp.azure.com/mesos-build/review/67318/logs/mesos-tests-stdout.log):

```
[       OK ] Endpoint/SlaveEndpointTest.NoAuthorizer/2 (111 ms)
[----------] 9 tests from Endpoint/SlaveEndpointTest (1032 ms total)

[----------] 2 tests from ContainerizerType/DefaultContainerDNSFlagTest
[ RUN      ] ContainerizerType/DefaultContainerDNSFlagTest.ValidateFlag/0
[       OK ] ContainerizerType/DefaultContainerDNSFlagTest.ValidateFlag/0 (34 ms)
[ RUN      ] ContainerizerType/DefaultContainerDNSFlagTest.ValidateFlag/1
[       OK ] ContainerizerType/DefaultContainerDNSFlagTest.ValidateFlag/1 (38 ms)
[----------] 2 tests from ContainerizerType/DefaultContainerDNSFlagTest (75 ms total)

[----------] 1 test from IsolationFlag/CpuIsolatorTest
[ RUN      ] IsolationFlag/CpuIsolatorTest.ROOT_UserCpuUsage/0
[       OK ] IsolationFlag/CpuIsolatorTest.ROOT_UserCpuUsage/0 (727 ms)
[----------] 1 test from IsolationFlag/CpuIsolatorTest (750 ms total)

[----------] 1 test from IsolationFlag/MemoryIsolatorTest
[ RUN      ] IsolationFlag/MemoryIsolatorTest.ROOT_MemUsage/0
[       OK ] IsolationFlag/MemoryIsolatorTest.ROOT_MemUsage/0 (732 ms)
[----------] 1 test from IsolationFlag/MemoryIsolatorTest (757 ms total)

[----------] Global test environment tear-down
[==========] 980 tests from 95 test cases ran. (444260 ms total)
[  PASSED  ] 979 tests.
[  FAILED  ] 1 test, listed below:
[  FAILED  ] DockerContainerizerHealthCheckTest.ROOT_DOCKER_DockerHealthStatusChange

 1 FAILED TEST
  YOU HAVE 220 DISABLED TESTS

```

- [mesos-tests-stderr.log](http://dcos-win.westus.cloudapp.azure.com/mesos-build/review/67318/logs/mesos-tests-stderr.log):

```
I0525 10:46:11.391443 15404 slave.cpp:3935] Shutting down framework f2c7cafe-0297-4aI0525
10:46:11.224486 22524 exec.cpp:162] Version: 1.7.0
I0525 10:46:11.251437 22808 exec.cpp:236] Executor registered on agent f2c7cafe-0297-4a4e-a6f8-1e938654e946-S0
I0525 10:46:11.255479 23932 executor.cpp:178] Received SUBSCRIBED event
I0525 10:46:11.260447 23932 executor.cpp:182] Subscribed executor on windows-02.enofukwu14ruplxn0gs3yzmsgf.xx.internal.cloudapp.net
I0525 10:46:11.260447 23932 executor.cpp:178] Received LAUNCH event
I0525 10:46:11.265444 23932 executor.cpp:665] Starting task 9e3e3ab9-cdbd-4251-b7dd-d38804fc7fb5
I0525 10:46:11.347445 23932 executor.cpp:485] Running 'D:\DCOS\mesos\src\mesos-containerizer.exe
launch <POSSIBLY-SENSITIVE-DATA>'
I0525 10:46:11.365459 23932 executor.cpp:678] Forked command at 9716
I0525 10:46:11.394453  3808 exec.cpp:445] Executor asked to shutdown
I0525 10:46:11.395440 21120 executor.cpp:178] Received SHUTDOWN event
I0525 10:46:11.395440 21120 executor.cpp:781] Shutting down
I0525 10:46:11.395440 21120 executor.cpp:894] Sending SIGTERM to process tree at pid 9714e-a6f8-1e938654e946-0000
I0525 10:46:11.391443 22856 master.cpp:10843] Updating the state of task 9e3e3ab9-cdbd-4251-b7dd-d38804fc7fb5
of framework f2c7cafe-0297-4a4e-a6f8-1e938654e946-0000 (latest state: TASK_KILLED, status
update state: TASK_KILLED)
I0525 10:46:11.392442 15404 slave.cpp:6656] Shutting down executor '9e3e3ab9-cdbd-4251-b7dd-d38804fc7fb5'
of framework f2c7cafe-0297-4a4e-a6f8-1e938654e946-0000 at executor(1)@192.10.1.6:53075
I0525 10:46:11.394453 15404 slave.cpp:929] Agent terminating
W0525 10:46:11.395440 15404 slave.cpp:3931] Ignoring shutdown framework f2c7cafe-0297-4a4e-a6f8-1e938654e946-0000
because it is terminating
I0525 10:46:11.395440 22856 master.cpp:10942] Removing task 9e3e3ab9-cdbd-4251-b7dd-d38804fc7fb5
with resources cpus(allocated: *):4; mem(allocated: *):2048; disk(allocated: *):1024; ports(allocated:
*):[31000-32000] of framework f2c7cafe-0297-4a4e-a6f8-1e938654e946-0000 on agent f2c7cafe-0297-4a4e-a6f8-1e938654e946-S0
at slave(447)@192.10.1.6:53054 (windows-02.enofukwu14ruplxn0gs3yzmsgf.xx.internal.cloudapp.net)
I0525 10:46:11.398450 22856 master.cpp:1293] Agent f2c7cafe-0297-4a4e-a6f8-1e938654e946-S0
at slave(447)@192.10.1.6:53054 (windows-02.enofukwu14ruplxn0gs3yzmsgf.xx.internal.cloudapp.net)
disconnected
I0525 10:46:11.398450 22856 master.cpp:3303] Disconnecting agent f2c7cafe-0297-4a4e-a6f8-1e938654e946-S0
at slave(447)@192.10.1.6:53054 (windows-02.enofukwu14ruplxn0gs3yzmsgf.xx.internal.cloudapp.net)
I0525 10:46:11.398450 22856 master.cpp:3322] Deactivating agent f2c7cafe-0297-4a4e-a6f8-1e938654e946-S0
at slave(447)@192.10.1.6:53054 (windows-02.enofukwu14ruplxn0gs3yzmsgf.xx.internal.cloudapp.net)
I0525 10:46:11.399451 23928 hierarchical.cpp:344] Removed framework f2c7cafe-0297-4a4e-a6f8-1e938654e946-0000
I0525 10:46:11.399451 17580 containerizer.cpp:2404] Destroying container 2d25290c-186c-4c91-9b28-c4f6468a2ef7
in RUNNING state
I0525 10:46:11.399451 17580 containerizer.cpp:3018] Transitioning the state of container 2d25290c-186c-4c91-9b28-c4f6468a2ef7
from RUNNING to DESTROYING
I0525 10:46:11.399451 23928 hierarchical.cpp:766] Agent f2c7cafe-0297-4a4e-a6f8-1e938654e946-S0
deactivated
I0525 10:46:11.400467 17580 launcher.cpp:156] Asked to destroy container 2d25290c-186c-4c91-9b28-c4f6468a2ef7
I0525 10:46:11.449162 21496 containerizer.cpp:2857] Container 2d25290c-186c-4c91-9b28-c4f6468a2ef7
has exited
I0525 10:46:11.479159 22340 master.cpp:1135] Master terminating
I0525 10:46:11.481163 24160 hierarchical.cpp:609] Removed agent f2c7cafe-0297-4a4e-a6f8-1e938654e946-S0
I0525 10:46:11.951162 23744 process.cpp:940] Stopped the socket accept loop
```

- Mesos Reviewbot Windows


On May 25, 2018, 9:57 a.m., Armand Grillet wrote:
> 
> -----------------------------------------------------------
> This is an automatically generated e-mail. To reply, visit:
> https://reviews.apache.org/r/67318/
> -----------------------------------------------------------
> 
> (Updated May 25, 2018, 9:57 a.m.)
> 
> 
> Review request for Benjamin Bannier.
> 
> 
> Repository: mesos
> 
> 
> Description
> -------
> 
> Keeps python.m4 to upstream `63c0a0e` (commit in automake repo).
> The Mesos patch has been removed as we now use automake >= 1.11.
> 
> 
> Diffs
> -----
> 
>   m4/python.m4 5c0b2ffa1d345f695ac60b806ee33f1e9f05e769 
>   m4/python.m4.patch 80431eb5381b367eff09f343d4553c4a66715f05 
> 
> 
> Diff: https://reviews.apache.org/r/67318/diff/1/
> 
> 
> Testing
> -------
> 
> 
> Thanks,
> 
> Armand Grillet
> 
>


Mime
  • Unnamed multipart/alternative (inline, None, 0 bytes)
View raw message