mesos-reviews mailing list archives

Site index · List index
Message view « Date » · « Thread »
Top « Date » · « Thread »
From Mesos Reviewbot Windows <revi...@mesos.apache.org>
Subject Re: Review Request 67308: Documented how to setup and use cquery with Mesos.
Date Fri, 25 May 2018 05:01:46 GMT

-----------------------------------------------------------
This is an automatically generated e-mail. To reply, visit:
https://reviews.apache.org/r/67308/#review203848
-----------------------------------------------------------



FAIL: Some of the unit tests failed. Please check the relevant logs.

Reviews applied: `['67308']`

Failed command: `Start-MesosCITesting`

All the build artifacts available at: http://dcos-win.westus.cloudapp.azure.com/mesos-build/review/67308

Relevant logs:

- [mesos-tests-stdout.log](http://dcos-win.westus.cloudapp.azure.com/mesos-build/review/67308/logs/mesos-tests-stdout.log):

```
[       OK ] Endpoint/SlaveEndpointTest.NoAuthorizer/2 (111 ms)
[----------] 9 tests from Endpoint/SlaveEndpointTest (1053 ms total)

[----------] 2 tests from ContainerizerType/DefaultContainerDNSFlagTest
[ RUN      ] ContainerizerType/DefaultContainerDNSFlagTest.ValidateFlag/0
[       OK ] ContainerizerType/DefaultContainerDNSFlagTest.ValidateFlag/0 (32 ms)
[ RUN      ] ContainerizerType/DefaultContainerDNSFlagTest.ValidateFlag/1
[       OK ] ContainerizerType/DefaultContainerDNSFlagTest.ValidateFlag/1 (38 ms)
[----------] 2 tests from ContainerizerType/DefaultContainerDNSFlagTest (73 ms total)

[----------] 1 test from IsolationFlag/CpuIsolatorTest
[ RUN      ] IsolationFlag/CpuIsolatorTest.ROOT_UserCpuUsage/0
[       OK ] IsolationFlag/CpuIsolatorTest.ROOT_UserCpuUsage/0 (714 ms)
[----------] 1 test from IsolationFlag/CpuIsolatorTest (739 ms total)

[----------] 1 test from IsolationFlag/MemoryIsolatorTest
[ RUN      ] IsolationFlag/MemoryIsolatorTest.ROOT_MemUsage/0
[       OK ] IsolationFlag/MemoryIsolatorTest.ROOT_MemUsage/0 (724 ms)
[----------] 1 test from IsolationFlag/MemoryIsolatorTest (748 ms total)

[----------] Global test environment tear-down
[==========] 980 tests from 95 test cases ran. (435796 ms total)
[  PASSED  ] 979 tests.
[  FAILED  ] 1 test, listed below:
[  FAILED  ] DockerContainerizerHealthCheckTest.ROOT_DOCKER_DockerHealthStatusChange

 1 FAILED TEST
  YOU HAVE 220 DISABLED TESTS

```

- [mesos-tests-stderr.log](http://dcos-win.westus.cloudapp.azure.com/mesos-build/review/67308/logs/mesos-tests-stderr.log):

```
I0525 05:01:28.771742 18080 master.cpp:10843] Updating the state of task 544045a0-eb06-42fe-84a9-448f4ef552c4
of framework 367ab55f-c3f5-43f7-9e89-82c86a9413f6-0000 (latest state: TASK_KILLED, status
update state: TASK_KILLED)
I0525 05:01:28.771742 13776 slave.cpp:3935] Shutting down framework 367ab55f-c3f5-43f7-9e89-82c86a9413f6-0000
I0525 05:01:28.771742 13776 slave.cpp:6656] Shutting down executor '544045a0-eb06-42fe-84a9-448f4ef552c4'
of framework 367ab55f-c3f5-43f7-9e89I0525 05:01:28.605736 23600 exec.cpp:162] Version: 1.7.0
I0525 05:01:28.631736 23912 exec.cpp:236] Executor registered on agent 367ab55f-c3f5-43f7-9e89-82c86a9413f6-S0
I0525 05:01:28.635738 21644 executor.cpp:178] Received SUBSCRIBED event
I0525 05:01:28.639744 21644 executor.cpp:182] Subscribed executor on windows-02.enofukwu14ruplxn0gs3yzmsgf.xx.internal.cloudapp.net
I0525 05:01:28.640743 21644 executor.cpp:178] Received LAUNCH event
I0525 05:01:28.645750 21644 executor.cpp:665] Starting task 544045a0-eb06-42fe-84a9-448f4ef552c4
I0525 05:01:28.725738 21644 executor.cpp:485] Running 'D:\DCOS\mesos\src\mesos-containerizer.exe
launch <POSSIBLY-SENSITIVE-DATA>'
I0525 05:01:28.743734 21644 executor.cpp:678] Forked command at 21120
I0525 05:01:28.773739 21616 exec.cpp:445] Executor asked to shutdown
I0525 05:01:28.774838 20272 executor.cpp:178] Received SHUTDOWN event
I0525 05:01:28.774838 20272 executor.cpp:781] Shutting down
I0525 05:01:28.774838 20272 executor.cpp:894] Sending SIGTERM to process tree at pid 21-82c86a9413f6-0000
at executor(1)@192.10.1.6:50366
I0525 05:01:28.773739 13776 slave.cpp:929] Agent terminating
W0525 05:01:28.773739 13776 slave.cpp:3931] Ignoring shutdown framework 367ab55f-c3f5-43f7-9e89-82c86a9413f6-0000
because it is terminating
I0525 05:01:28.773739 18080 master.cpp:10942] Removing task 544045a0-eb06-42fe-84a9-448f4ef552c4
with resources cpus(allocated: *):4; mem(allocated: *):2048; disk(allocated: *):1024; ports(allocated:
*):[31000-32000] of framework 367ab55f-c3f5-43f7-9e89-82c86a9413f6-0000 on agent 367ab55f-c3f5-43f7-9e89-82c86a9413f6-S0
at slave(447)@192.10.1.6:50345 (windows-02.enofukwu14ruplxn0gs3yzmsgf.xx.internal.cloudapp.net)
I0525 05:01:28.777742 18080 master.cpp:1293] Agent 367ab55f-c3f5-43f7-9e89-82c86a9413f6-S0
at slave(447)@192.10.1.6:50345 (windows-02.enofukwu14ruplxn0gs3yzmsgf.xx.internal.cloudapp.net)
disconnected
I0525 05:01:28.777742 18080 master.cpp:3303] Disconnecting agent 367ab55f-c3f5-43f7-9e89-82c86a9413f6-S0
at slave(447)@192.10.1.6:50345 (windows-02.enofukwu14ruplxn0gs3yzmsgf.xx.internal.cloudapp.net)
I0525 05:01:28.777742 11844 hierarchical.cpp:344] Removed framework 367ab55f-c3f5-43f7-9e89-82c86a9413f6-0000
I0525 05:01:28.777742 18080 master.cpp:3322] Deactivating agent 367ab55f-c3f5-43f7-9e89-82c86a9413f6-S0
at slave(447)@192.10.1.6:50345 (windows-02.enofukwu14ruplxn0gs3yzmsgf.xx.internal.cloudapp.net)
I0525 05:01:28.778741 13776 hierarchical.cpp:766] Agent 367ab55f-c3f5-43f7-9e89-82c86a9413f6-S0
deactivated
I0525 05:01:28.778741 20908 containerizer.cpp:2404] Destroying container b6f31932-339a-43a3-8338-fa9ef6e8ed4b
in RUNNING state
I0525 05:01:28.778741 20908 containerizer.cpp:3018] Transitioning the state of container b6f31932-339a-43a3-8338-fa9ef6e8ed4b
from RUNNING to DESTROYING
I0525 05:01:28.779744 20908 launcher.cpp:156] Asked to destroy container b6f31932-339a-43a3-8338-fa9ef6e8ed4b
I0525 05:01:28.819738 19548 containerizer.cpp:2857] Container b6f31932-339a-43a3-8338-fa9ef6e8ed4b
has exited
I0525 05:01:28.849741 21848 master.cpp:1135] Master terminating
I0525 05:01:28.852741  3364 hierarchical.cpp:609] Removed agent 367ab55f-c3f5-43f7-9e89-82c86a9413f6-S0
I0525 05:01:29.366744 24512 process.cpp:940] Stopped the socket accept loop
```

- Mesos Reviewbot Windows


On May 25, 2018, 2:30 a.m., Andrew Schwartzmeyer wrote:
> 
> -----------------------------------------------------------
> This is an automatically generated e-mail. To reply, visit:
> https://reviews.apache.org/r/67308/
> -----------------------------------------------------------
> 
> (Updated May 25, 2018, 2:30 a.m.)
> 
> 
> Review request for mesos, Benjamin Bannier, Benjamin Hindman, Benjamin Mahler, Greg Mann,
Jie Yu, James Peach, and Joseph Wu.
> 
> 
> Repository: mesos
> 
> 
> Description
> -------
> 
> Note that while cquery and LSP support many editors, this only
> demonstrates how to setup Emacs. Documentation on Vim setup is
> welcome!
> 
> 
> Diffs
> -----
> 
>   docs/developer-guide.md 3dbc93ee4225abc54593dda005781d879d2ca8da 
> 
> 
> Diff: https://reviews.apache.org/r/67308/diff/1/
> 
> 
> Testing
> -------
> 
> 
> Thanks,
> 
> Andrew Schwartzmeyer
> 
>


Mime
  • Unnamed multipart/alternative (inline, None, 0 bytes)
View raw message