mesos-reviews mailing list archives

Site index · List index
Message view « Date » · « Thread »
Top « Date » · « Thread »
From Mesos Reviewbot Windows <revi...@mesos.apache.org>
Subject Re: Review Request 67304: Added missing calls to the scheduler API docs.
Date Fri, 25 May 2018 02:42:36 GMT

-----------------------------------------------------------
This is an automatically generated e-mail. To reply, visit:
https://reviews.apache.org/r/67304/#review203841
-----------------------------------------------------------



FAIL: Some of the unit tests failed. Please check the relevant logs.

Reviews applied: `['67304']`

Failed command: `Start-MesosCITesting`

All the build artifacts available at: http://dcos-win.westus.cloudapp.azure.com/mesos-build/review/67304

Relevant logs:

- [mesos-tests-stdout.log](http://dcos-win.westus.cloudapp.azure.com/mesos-build/review/67304/logs/mesos-tests-stdout.log):

```
[       OK ] Endpoint/SlaveEndpointTest.NoAuthorizer/2 (110 ms)
[----------] 9 tests from Endpoint/SlaveEndpointTest (1037 ms total)

[----------] 2 tests from ContainerizerType/DefaultContainerDNSFlagTest
[ RUN      ] ContainerizerType/DefaultContainerDNSFlagTest.ValidateFlag/0
[       OK ] ContainerizerType/DefaultContainerDNSFlagTest.ValidateFlag/0 (34 ms)
[ RUN      ] ContainerizerType/DefaultContainerDNSFlagTest.ValidateFlag/1
[       OK ] ContainerizerType/DefaultContainerDNSFlagTest.ValidateFlag/1 (38 ms)
[----------] 2 tests from ContainerizerType/DefaultContainerDNSFlagTest (72 ms total)

[----------] 1 test from IsolationFlag/CpuIsolatorTest
[ RUN      ] IsolationFlag/CpuIsolatorTest.ROOT_UserCpuUsage/0
[       OK ] IsolationFlag/CpuIsolatorTest.ROOT_UserCpuUsage/0 (745 ms)
[----------] 1 test from IsolationFlag/CpuIsolatorTest (769 ms total)

[----------] 1 test from IsolationFlag/MemoryIsolatorTest
[ RUN      ] IsolationFlag/MemoryIsolatorTest.ROOT_MemUsage/0
[       OK ] IsolationFlag/MemoryIsolatorTest.ROOT_MemUsage/0 (735 ms)
[----------] 1 test from IsolationFlag/MemoryIsolatorTest (761 ms total)

[----------] Global test environment tear-down
[==========] 980 tests from 95 test cases ran. (455056 ms total)
[  PASSED  ] 979 tests.
[  FAILED  ] 1 test, listed below:
[  FAILED  ] DockerContainerizerHealthCheckTest.ROOT_DOCKER_DockerHealthStatusChange

 1 FAILED TEST
  YOU HAVE 220 DISABLED TESTS

```

- [mesos-tests-stderr.log](http://dcos-win.westus.cloudapp.azure.com/mesos-build/review/67304/logs/mesos-tests-stderr.log):

```
I0525 02:42:20.940337 23960 master.cpp:10843] Updating the state of task 5dae1397-b1d6-4827-b248-1004ceb4cf4f
of framework d79579bb-8e08-4938-901e-ad11ef5ae18c-0000 (latest state: TASK_KILLED, status
update state: TASK_KILLED)
I0525 02:42:20.940337 22848 slave.cpp:3935] Shutting down framework d79579bb-8e08-4938-901e-ad11ef5ae18c-0000
I0525 02:42:20.941311 22848 slave.cpp:6656] Shutting down executor '5dae1397-b1d6-4827-b248-1004ceb4cf4f'
of framework d79579bb-8e08-4938-901e-ad11ef5ae18c-0000 at executor(1)@192.10.1.6:61432
I0525 02:42:20.942322 22848 slave.cpp:929] Agent terminating
W0525 02:42:20.943320 22848 slave.cpp:3931] Ignoring shutdown framework d79579bb-8e08-4938-901e-ad11ef5ae18c-0000
because it is terminating
I0525 02:42:20.943320 23960 master.cpp:10942] Removing task 5dae1397-b1d6-4827-b248-1004ceb4cf4f
with resources cpus(allocated: *):4; mem(allocated: *):2048; disk(allocated: *):1024; ports(allocated:
*):[31000-32000] of framework d79579bb-8e08-4938-901e-ad11ef5ae18c-0000 on agent d79579bb-8e08-4938-901e-ad11ef5ae18c-S0
at slave(447)@192.10.1.6:61411 (windows-02.enofukwu14ruplxn0gs3yzmsgf.xx.internal.cloudapp.net)
I0525 02:42:20.946305 23960 master.cpp:1293] Agent d79579bb-8e08-4938-901e-ad11ef5ae18c-S0
at slave(447)@192.10.1.6:61411 (windows-02.enofukwu14ruplxn0gs3yzmsgf.xx.internal.cloudapp.net)
disconnected
I0525 02:42:20.946305 23960 master.cpp:3303] Disconnecting agent d79579bb-8e08-4938-901e-ad11ef5ae18c-S0
at slave(447)@192.10.1.6:61411 (windows-02.enofukwu14ruplxn0gs3yzmsgf.xx.internal.cloudapp.net)
I0525 02:42:20.946305 23960 master.cpp:3322] Deactivating agent d79579bb-8e08-4938-901e-ad11ef5ae18c-S0
at slave(447)@192.10.1.6:61411 (windows-02.enofukwu14ruplxn0gs3yzmsgf.xx.internal.cloudapp.net)
I0525 02:42:20.947304 18160 hierarchical.cpp:344] Removed framework d79579bb-8e08-4938-901e-ad11ef5ae18c-0000
I0525 02:42:20.947304 18160 hierarchical.cpp:766] Agent d79579bb-8e08-4938-901e-ad11ef5ae18c-S0
deactivated
I0525 02:42:20.947304  6856 containerizer.cpp:2404] Destroying container 92f36886-afI0525
02:42:20.779338 18020 exec.cpp:162] Version: 1.7.0
I0525 02:42:20.804313 23708 exec.cpp:236] Executor registered on agent d79579bb-8e08-4938-901e-ad11ef5ae18c-S0
I0525 02:42:20.808315  6884 executor.cpp:178] Received SUBSCRIBED event
I0525 02:42:20.812331  6884 executor.cpp:182] Subscribed executor on windows-02.enofukwu14ruplxn0gs3yzmsgf.xx.internal.cloudapp.net
I0525 02:42:20.813331  6884 executor.cpp:178] Received LAUNCH event
I0525 02:42:20.817337  6884 executor.cpp:665] Starting task 5dae1397-b1d6-4827-b248-1004ceb4cf4f
I0525 02:42:20.895331  6884 executor.cpp:485] Running 'D:\DCOS\mesos\src\mesos-containerizer.exe
launch <POSSIBLY-SENSITIVE-DATA>'
I0525 02:42:20.912320  6884 executor.cpp:678] Forked command at 17020
I0525 02:42:20.942322 23592 exec.cpp:445] Executor asked to shutdown
I0525 02:42:20.947304 20976 executor.cpp:178] Received SHUTDOWN event
I0525 02:42:20.947304 20976 executor.cpp:781] Shutting down
I0525 02:42:20.947304 20976 executor.cpp:894] Sending SIGTERM to process tree at pid 1756-472e-a12e-633d2664d484
in RUNNING state
I0525 02:42:20.948338  6856 containerizer.cpp:3018] Transitioning the state of container 92f36886-af56-472e-a12e-633d2664d484
from RUNNING to DESTROYING
I0525 02:42:20.948338  6856 launcher.cpp:156] Asked to destroy container 92f36886-af56-472e-a12e-633d2664d484
I0525 02:42:21.024070 12552 containerizer.cpp:2857] Container 92f36886-af56-472e-a12e-633d2664d484
has exited
I0525 02:42:21.054038 21640 master.cpp:1135] Master terminating
I0525 02:42:21.056053 17944 hierarchical.cpp:609] Removed agent d79579bb-8e08-4938-901e-ad11ef5ae18c-S0
I0525 02:42:21.596060 13344 process.cpp:940] Stopped the socket accept loop
```

- Mesos Reviewbot Windows


On May 25, 2018, 1:23 a.m., Greg Mann wrote:
> 
> -----------------------------------------------------------
> This is an automatically generated e-mail. To reply, visit:
> https://reviews.apache.org/r/67304/
> -----------------------------------------------------------
> 
> (Updated May 25, 2018, 1:23 a.m.)
> 
> 
> Review request for mesos, Chun-Hung Hsiao, Gaston Kleiman, Gilbert Song, and Joseph Wu.
> 
> 
> Repository: mesos
> 
> 
> Description
> -------
> 
> Added missing calls to the scheduler API docs.
> 
> 
> Diffs
> -----
> 
>   docs/scheduler-http-api.md bea8817e4cb275d21055eed501c7af0b4b056a9e 
> 
> 
> Diff: https://reviews.apache.org/r/67304/diff/1/
> 
> 
> Testing
> -------
> 
> 
> Thanks,
> 
> Greg Mann
> 
>


Mime
  • Unnamed multipart/alternative (inline, None, 0 bytes)
View raw message