mesos-reviews mailing list archives

Site index · List index
Message view « Date » · « Thread »
Top « Date » · « Thread »
From Mesos Reviewbot Windows <revi...@mesos.apache.org>
Subject Re: Review Request 67288: White list fds that child processes can inherit in mesos containerizer.
Date Fri, 25 May 2018 00:30:56 GMT

-----------------------------------------------------------
This is an automatically generated e-mail. To reply, visit:
https://reviews.apache.org/r/67288/#review203832
-----------------------------------------------------------



FAIL: Some of the unit tests failed. Please check the relevant logs.

Reviews applied: `['67286', '67287', '67288']`

Failed command: `Start-MesosCITesting`

All the build artifacts available at: http://dcos-win.westus.cloudapp.azure.com/mesos-build/review/67288

Relevant logs:

- [mesos-tests-stdout.log](http://dcos-win.westus.cloudapp.azure.com/mesos-build/review/67288/logs/mesos-tests-stdout.log):

```
[       OK ] Endpoint/SlaveEndpointTest.NoAuthorizer/2 (108 ms)
[----------] 9 tests from Endpoint/SlaveEndpointTest (1025 ms total)

[----------] 2 tests from ContainerizerType/DefaultContainerDNSFlagTest
[ RUN      ] ContainerizerType/DefaultContainerDNSFlagTest.ValidateFlag/0
[       OK ] ContainerizerType/DefaultContainerDNSFlagTest.ValidateFlag/0 (34 ms)
[ RUN      ] ContainerizerType/DefaultContainerDNSFlagTest.ValidateFlag/1
[       OK ] ContainerizerType/DefaultContainerDNSFlagTest.ValidateFlag/1 (36 ms)
[----------] 2 tests from ContainerizerType/DefaultContainerDNSFlagTest (72 ms total)

[----------] 1 test from IsolationFlag/CpuIsolatorTest
[ RUN      ] IsolationFlag/CpuIsolatorTest.ROOT_UserCpuUsage/0
[       OK ] IsolationFlag/CpuIsolatorTest.ROOT_UserCpuUsage/0 (727 ms)
[----------] 1 test from IsolationFlag/CpuIsolatorTest (754 ms total)

[----------] 1 test from IsolationFlag/MemoryIsolatorTest
[ RUN      ] IsolationFlag/MemoryIsolatorTest.ROOT_MemUsage/0
[       OK ] IsolationFlag/MemoryIsolatorTest.ROOT_MemUsage/0 (729 ms)
[----------] 1 test from IsolationFlag/MemoryIsolatorTest (754 ms total)

[----------] Global test environment tear-down
[==========] 980 tests from 95 test cases ran. (442674 ms total)
[  PASSED  ] 979 tests.
[  FAILED  ] 1 test, listed below:
[  FAILED  ] DockerContainerizerHealthCheckTest.ROOT_DOCKER_DockerHealthStatusChange

 1 FAILED TEST
  YOU HAVE 220 DISABLED TESTS

```

- [mesos-tests-stderr.log](http://dcos-win.westus.cloudapp.azure.com/mesos-build/review/67288/logs/mesos-tests-stderr.log):

```
I0525 00:30:38.493302 21160 executor.cpp:178] Received SUBSCRIBED event
I0525 00:30:38.498245 21160 executor.cpp:182] Subscribed executor on windows-02.enofukwu14ruplxn0gs3yzmsgf.xx.internal.cloudapp.net
I0525 00:30:38.498245 21160 executor.cpp:178] Received LAUNCH event
I0525 00:30:38.503278 21160 executor.cpp:665] Starting task de5a1f8a-726a-4056-ad9e-288af145ba59
I0525 00:30:38.584270 21160 executor.cpp:485] Running 'D:\DCOS\mesos\src\mesos-containerizer.exe
launch <POSSIBLY-SENSITIVE-DATA>'
I0525 00:30:38.601246 21160 executor.cpp:678] Forked command at 15696
I0525 00:30:38.630240 23368 exec.cpp:445] Executor asked to shutdown
I0525 00:30:38.631242 18588 executor.cpp:178] Received SHUTDOWN event
I0525 00:30:38.631242 18588 executor.cpp:781] Shutting down
I0525 00:30:38.631242 18588 executor.cpp:894] Sending SIGTERM to process tree at pid 1581
 8372 master.cpp:3266] Deactivating framework 06ac683f-0b03-4f54-b4f7-879e8e0fb5ea-0000 (default)
at scheduler-5ee620a2-bdf3-4cb6-b7b6-33dceb06fc4a@192.10.1.6:56147
I0525 00:30:38.629253 16416 hierarchical.cpp:405] Deactivated framework 06ac683f-0b03-4f54-b4f7-879e8e0fb5ea-0000
I0525 00:30:38.629253  8372 master.cpp:10843] Updating the state of task de5a1f8a-726a-4056-ad9e-288af145ba59
of framework 06ac683f-0b03-4f54-b4f7-879e8e0fb5ea-0000 (latest state: TASK_KILLED, status
update state: TASK_KILLED)
I0525 00:30:38.629253 16788 slave.cpp:3935] Shutting down framework 06ac683f-0b03-4f54-b4f7-879e8e0fb5ea-0000
I0525 00:30:38.629253 16788 slave.cpp:6656] Shutting down executor 'de5a1f8a-726a-4056-ad9e-288af145ba59'
of framework 06ac683f-0b03-4f54-b4f7-879e8e0fb5ea-0000 at executor(1)@192.10.1.6:56168
I0525 00:30:38.630240 16788 slave.cpp:929] Agent terminating
W0525 00:30:38.631242 16788 slave.cpp:3931] Ignoring shutdown framework 06ac683f-0b03-4f54-b4f7-879e8e0fb5ea-0000
because it is terminating
I0525 00:30:38.631242  8372 master.cpp:10942] Removing task de5a1f8a-726a-4056-ad9e-288af145ba59
with resources cpus(allocated: *):4; mem(allocated: *):2048; disk(allocated: *):1024; ports(allocated:
*):[31000-32000] of framework 06ac683f-0b03-4f54-b4f7-879e8e0fb5ea-0000 on agent 06ac683f-0b03-4f54-b4f7-879e8e0fb5ea-S0
at slave(447)@192.10.1.6:56147 (windows-02.enofukwu14ruplxn0gs3yzmsgf.xx.internal.cloudapp.net)
I0525 00:30:38.635247  8372 master.cpp:1293] Agent 06ac683f-0b03-4f54-b4f7-879e8e0fb5ea-S0
at slave(447)@192.10.1.6:56147 (windows-02.enofukwu14ruplxn0gs3yzmsgf.xx.internal.cloudapp.net)
disconnected
I0525 00:30:38.635247  8372 master.cpp:3303] Disconnecting agent 06ac683f-0b03-4f54-b4f7-879e8e0fb5ea-S0
at slave(447)@192.10.1.6:56147 (windows-02.enofukwu14ruplxn0gs3yzmsgf.xx.internal.cloudapp.net)
I0525 00:30:38.635247  8372 master.cpp:3322] Deactivating agent 06ac683f-0b03-4f54-b4f7-879e8e0fb5ea-S0
at slave(447)@192.10.1.6:56147 (windows-02.enofukwu14ruplxn0gs3yzmsgf.xx.internal.cloudapp.net)
I0525 00:30:38.635247  6856 hierarchical.cpp:344] Removed framework 06ac683f-0b03-4f54-b4f7-879e8e0fb5ea-0000
I0525 00:30:38.635247  9444 containerizer.cpp:2404] Destroying container 45dfe3d7-6291-42ad-9804-ede03e86b6db
in RUNNING state
I0525 00:30:38.636245  9444 containerizer.cpp:3018] Transitioning the state of container 45dfe3d7-6291-42ad-9804-ede03e86b6db
from RUNNING to DESTROYING
I0525 00:30:38.636245  6856 hierarchical.cpp:766] Agent 06ac683f-0b03-4f54-b4f7-879e8e0fb5ea-S0
deactivated
I0525 00:30:38.636245  9444 launcher.cpp:158] Asked to destroy container 45dfe3d7-6291-42ad-9804-ede03e86b6db
I0525 00:30:38.684041 21052 containerizer.cpp:2857] Container 45dfe3d7-6291-42ad-9804-ede03e86b6db
has exited
I0525 00:30:38.713032 14212 master.cpp:1135] Master terminating
I0525 00:30:38.715040 19444 hierarchical.cpp:609] Removed agent 06ac683f-0b03-4f54-b4f7-879e8e0fb5ea-S0
I0525 00:30:39.149039 15268 process.cpp:940] Stopped the socket accept loop
```

- Mesos Reviewbot Windows


On May 24, 2018, 3:47 p.m., Radhika Jandhyala wrote:
> 
> -----------------------------------------------------------
> This is an automatically generated e-mail. To reply, visit:
> https://reviews.apache.org/r/67288/
> -----------------------------------------------------------
> 
> (Updated May 24, 2018, 3:47 p.m.)
> 
> 
> Review request for mesos, Akash Gupta, Andrew Schwartzmeyer, Eric Mumau, Jie Yu, Li Li,
and Radhika Jandhyala.
> 
> 
> Bugs: MESOS-8926
>     https://issues.apache.org/jira/browse/MESOS-8926
> 
> 
> Repository: mesos
> 
> 
> Description
> -------
> 
> White list fds that child processes can inherit in mesos containerizer.
> 
> 
> Diffs
> -----
> 
>   src/slave/containerizer/mesos/containerizer.cpp eac1d16f2388385fec04ff8f013ce0ebf4e97f0f

>   src/slave/containerizer/mesos/launcher.hpp f69d934d2e1a129e10df8c7f5c78723e832adc7d

>   src/slave/containerizer/mesos/launcher.cpp 2fe47d368cb82a46328e1f636baa836272db244c

>   src/slave/containerizer/mesos/linux_launcher.hpp 0ea9b875ae46cadea483bc8dd8bf4907fd324dc9

>   src/slave/containerizer/mesos/linux_launcher.cpp 80e444501e429c1e1ae354abcd51f86430316ada

> 
> 
> Diff: https://reviews.apache.org/r/67288/diff/2/
> 
> 
> Testing
> -------
> 
> 
> Thanks,
> 
> Radhika Jandhyala
> 
>


Mime
  • Unnamed multipart/alternative (inline, None, 0 bytes)
View raw message